{"text_format":"1","workbook":"xlsx","n_sheets":6,"sheets":["Summary1","Instruction","Charges & Claims","Credentials","Summary","Filtered Data"],"not_rendered":{"charts":0,"images":0,"macros":1,"external_links":0,"defined_names":2,"comments":0,"pivot_tables":1},"unopened":[],"bounds":{"document_bytes":16777216,"sheet_cells":100000,"rows_first":2000,"rows_last":500,"rows_between":2000,"halvings":0,"cell_chars":16384,"cell_head_chars":4096},"cells_cut":0,"cells_raw":0,"read":"whole","date_system":"1900"}

{"sheet":"Summary1","index":0,"n_rows":1001,"n_cols":5,"rows_kept":1001,"cut":false,"hidden":true,"merged":[[0,0,0,4]]}
["Summary of Charges and Claims Report"]
[]
["ProgramCode","Credential","Individual/Group","PlanName","Sum of Billable Minutes"]
["ECS IOS RRC CE E"," AMFT Associate Marriage and Family Therapist","Group","Medi-Cal DMC",21810]
["ECS IOS RRC CE E"," AMFT Associate Marriage and Family Therapist","Individual",9999,278]
["ECS IOS RRC CE E"," AMFT Associate Marriage and Family Therapist","Individual","County Billable SUD",15]
["ECS IOS RRC CE E"," AMFT Associate Marriage and Family Therapist","Individual","Medi-Cal DMC",19194]
["ECS IOS RRC CE E"," AMFT Associate Marriage and Family Therapist","Individual","Medicare Part C",105]
["ECS IOS RRC CE E"," APCC Associate Professional Clinical Counselor","Group","Medi-Cal DMC",51615]
["ECS IOS RRC CE E"," APCC Associate Professional Clinical Counselor","Individual",9999,255]
["ECS IOS RRC CE E"," APCC Associate Professional Clinical Counselor","Individual","County Billable SUD",45]
["ECS IOS RRC CE E"," APCC Associate Professional Clinical Counselor","Individual","Medi-Cal DMC",27857]
["ECS IOS RRC CE E"," APCC Associate Professional Clinical Counselor","Individual","Medicare Part C",45]
["ECS IOS RRC CE E"," Certified AOD Counselor","Group",9999,7650]
["ECS IOS RRC CE E"," Certified AOD Counselor","Group","County Billable SUD",2340]
["ECS IOS RRC CE E"," Certified AOD Counselor","Group","Medi-Cal DMC",625215]
["ECS IOS RRC CE E"," Certified AOD Counselor","Group","Medicare Part C",630]
["ECS IOS RRC CE E"," Certified AOD Counselor","Individual",9999,1315]
["ECS IOS RRC CE E"," Certified AOD Counselor","Individual","County Billable SUD",398]
["ECS IOS RRC CE E"," Certified AOD Counselor","Individual","Medi-Cal DMC",83983]
["ECS IOS RRC CE E"," Certified AOD Counselor","Individual","Medicare Part C",255]
["ECS IOS RRC CE E"," LCSW Licensed Clinical Social Worker","Group","Medi-Cal DMC",630]
["ECS IOS RRC CE E"," LCSW Licensed Clinical Social Worker","Individual","County Billable SUD",30]
["ECS IOS RRC CE E"," LCSW Licensed Clinical Social Worker","Individual","Medi-Cal DMC",5921]
["ECS IOS RRC CE E"," LCSW Licensed Clinical Social Worker","Individual","Medicare Part C",83]
["ECS IOS RRC CE E"," MFT Marriage and Family Therapist","Individual","Medi-Cal DMC",551]
["ECS IOS RRC CE E"," Registered AOD Counselor","Group",9999,1710]
["ECS IOS RRC CE E"," Registered AOD Counselor","Group","County Billable SUD",5580]
["ECS IOS RRC CE E"," Registered AOD Counselor","Group","Medi-Cal DMC",261045]
["ECS IOS RRC CE E"," Registered AOD Counselor","Group","Medicare Part C",540]
["ECS IOS RRC CE E"," Registered AOD Counselor","Individual",9999,293]
["ECS IOS RRC CE E"," Registered AOD Counselor","Individual","County Billable SUD",308]
["ECS IOS RRC CE E"," Registered AOD Counselor","Individual","Medi-Cal DMC",24576]
["ECS IOS RRC CE E"," Registered AOD Counselor","Individual","Medicare Part C",30]
["ECS OS RRC CE E",0,"Individual","Medi-Cal DMC",235]
["ECS OS RRC CE E"," AMFT Associate Marriage and Family Therapist","Group",9999,90]
["ECS OS RRC CE E"," AMFT Associate Marriage and Family Therapist","Group","County Billable SUD",0]
["ECS OS RRC CE E"," AMFT Associate Marriage and Family Therapist","Group","Medi-Cal DMC",2250]
["ECS OS RRC CE E"," AMFT Associate Marriage and Family Therapist","Individual",9999,45]
["ECS OS RRC CE E"," AMFT Associate Marriage and Family Therapist","Individual","County Billable SUD",30]
["ECS OS RRC CE E"," AMFT Associate Marriage and Family Therapist","Individual","Medi-Cal DMC",8143]
["ECS OS RRC CE E"," APCC Associate Professional Clinical Counselor","Group",9999,270]
["ECS OS RRC CE E"," APCC Associate Professional Clinical Counselor","Group","Medi-Cal DMC",14400]
["ECS OS RRC CE E"," APCC Associate Professional Clinical Counselor","Individual",9999,391]
["ECS OS RRC CE E"," APCC Associate Professional Clinical Counselor","Individual","County Billable SUD",0]
["ECS OS RRC CE E"," APCC Associate Professional Clinical Counselor","Individual","Medi-Cal DMC",10378]
["ECS OS RRC CE E"," Certified AOD Counselor","Group",9999,8100]
["ECS OS RRC CE E"," Certified AOD Counselor","Group","County Billable SUD",1170]
["ECS OS RRC CE E"," Certified AOD Counselor","Group","Medi-Cal DMC",213120]
["ECS OS RRC CE E"," Certified AOD Counselor","Individual",9999,953]
["ECS OS RRC CE E"," Certified AOD Counselor","Individual","County Billable SUD",30]
["ECS OS RRC CE E"," Certified AOD Counselor","Individual","Medi-Cal DMC",38786]
["ECS OS RRC CE E"," Certified AOD Counselor","Individual","Medicare Part B-Noridian",60]
["ECS OS RRC CE E"," Certified AOD Counselor","Individual","Medicare Part C",30]
["ECS OS RRC CE E"," LCSW Licensed Clinical Social Worker","Group","Medi-Cal DMC",180]
["ECS OS RRC CE E"," LCSW Licensed Clinical Social Worker","Individual","County Billable SUD",0]
["ECS OS RRC CE E"," LCSW Licensed Clinical Social Worker","Individual","Medi-Cal DMC",4782]
["ECS OS RRC CE E"," MFT Marriage and Family Therapist","Individual","Medi-Cal DMC",345]
["ECS OS RRC CE E"," Registered AOD Counselor","Group",9999,3780]
["ECS OS RRC CE E"," Registered AOD Counselor","Group","County Billable SUD",0]
{"$rows_left_out":942}
{"sheet":"Instruction","index":1,"n_rows":11,"n_cols":1,"rows_kept":11,"cut":false,"hidden":false,"merged":[]}
["Instructions for Generating the CoSD Charges/Claims Summary Report"]
[]
["1. Download the CoSD Charges/Claims Report from SmartCare in CSV format."]
["2. In the downloaded report, delete the first three (3) rows and the Client Name column (Column D). Then copy all data from Columns A through T."]
["3. In the Charges & Claims tab of the Charges and Claims Units Generator, paste the data as values."]
["4. Locate the Generate Summary button in Columns AI–AL of the Charges & Claims tab and click it to produce the summary."]
["5. To process a new report, first remove all filters in both the Charges & Claims tab and the Summary tab. Then click the Clear Data button in the Summary tab."]
["6. Repeat Steps 1–4 for the next report."]
[]
["Important Reminder"]
["Use the template that corresponds to the correct Fiscal Year for the report you are processing to ensure data accuracy."]

{"sheet":"Charges & Claims","index":2,"n_rows":11979,"n_cols":41,"rows_kept":11979,"cut":false,"hidden":false,"merged":[]}
[null,null,null,null,null,null,null,null,null,null,null,null,null,null,null,null,null,null,null,null,null,null,null,null,"Credential"]
[null,null,null,null,null,null,null,null,null,null,null,null,null,null,null,null,null,null,null,null,null,{"$f":"IFERROR((_xlfn.IFS(AND(I2=\"Residential Treatment -Substance Use\",G2=\"BedDay, System\"),\"Bed Days\",I2=\"Residential Withdrawal Management\",\"Bed Days WM\",I2=\"Crisis Residential Day\",\"Crisis Residential Day\",I2=\"Adult Residential Day\",\"Bed Day\",I2=\"Ambulatory WM - Level 1\",\"AWM - Level 1\",I2=\"Ambulatory WM - Level 2\",\"AWM - Level 2\",I2=\"Crisis Stabilization\",\"Crisis Stabilization\",I2=\"Overstay\",\"Overstay\",I2=\"Day Treatment Intensive - Full Day\",\"Day Treatment Intensive - Full Day\",I2=\"Day Treatment Intensive - Half Day\",\"Day Treatment Intensive - Half Day\",I2=\"Psychiatric Health Facility Day\",\"Psychiatric Health Facility\",I2=\"Sign Language or Oral Interpretive Services\",\"Interpreter Services\",I2=\"Interactive Complexity\",\"Interactive Complexity\")),H2)","v":0},{"$f":"IFERROR((VLOOKUP(I2,Credentials!I:J,2,0)),\"Individual\")","v":"Individual"},{"$f":"IFERROR((IF(AND(G2=\"BedDay, System\",AF2=1),1,ROUND((AG2/AA2),0))),0)","v":0},{"$f":"_xlfn.IFS(AND(I2=\"Residential Treatment -Substance Use\",G2=\"BedDay, System\"),\"Bed Days\",I2=\"Residential Withdrawal Management\",\"Bed Days WM\",I2=\"Crisis Residential Day\",\"Crisis Residential Day\",I2=\"Adult Residential Day\",\"Bed Day\",I2=\"Ambulatory WM - Level 1\",\"AWM - Level 1\",I2=\"Ambulatory WM - Level 2\",\"AWM - Level 2\",I2=\"Crisis Stabilization\",\"Crisis Stabilization\",I2=\"Overstay\",\"Overstay\",I2=\"Day Treatment Intensive - Full Day\",\"Day Treatment Intensive - Full Day\",I2=\"Day Treatment Intensive - Half Day\",\"Day Treatment Intensive - Half Day\",I2=\"Psychiatric Health Facility Day\",\"Psychiatric Health Facility\",I2=\"Sign Language or Oral Interpretive Services\",\"Interpreter Services\",I2=\"Interactive Complexity\",\"Interactive Complexity\")","v":{"$error":"#N/A"}},{"$f":"W2&\"-\"&V2","v":"Individual-0"},{"$f":"IFERROR((IF(AC2>0,VLOOKUP(Z2,Credentials!D:E,2,0),1)),1)","v":1},{"$f":"IFERROR((_xlfn.IFS(B2=\"Medi-Cal DMC\",\"DMC Billable\",B2=\"County Billable SUD\",\"County Billable\",B2=9999,\"County Billable\",B2=\"Medi-Cal MH\",\"Medi-Cal MH\")),\"OHC\")","v":"OHC"},{"$f":"IF(AND(N2>0,G2=\"BedDay, System\"),1,N2)","v":0},{"$f":"F2","v":"00:00:00"},{"$f":"AND(I2=\"Residential Treatment -Substance Use\",G2=\"BedDay, System\")","v":false},{"$f":"IFERROR((_xlfn.IFS(AND(AC2=1,I2=\"Residential Treatment -Substance Use\"),1,AND(AC2=1,I2=\"Residential Withdrawal Management\"),1)),0)","v":0},{"$f":"IFERROR((_xlfn.IFS(I2=\"Residential Treatment -Substance Use\",AF2,I2=\"Residential Withdrawal Management\",AF2)),AC2)","v":0},{"$f":"AND(I2=\"Residential Treatment -Substance Use\",AF2=1)","v":false},null,null,null,null,{"$f":"IF(AND(G2=\"BedDay, System\",AF2=1),1,ROUND((AG2/AA2),0))","v":0},{"$f":"AND(G2=\"BedDay, System\",AF2=1)","v":false},{"$f":"IFERROR((_xlfn.IFS(I2=\"Residential Treatment -Substance Use\",AF2,I2=\"Residential Withdrawal Management\",AF2)),AC2)","v":0}]
[]
[]
[]
[]
[]
[]
[]
[]
[]
[]
[]
[]
[]
[]
[]
[]
[]
[]
[]
[]
[]
[]
[]
[]
[]
[]
[]
[]
[]
[]
[]
[]
[]
[]
[]
[]
[]
[]
[]
[]
[]
[]
[]
[]
[]
[null,null,null,null,null,null,null,null,null,null,null,null,null,null,null,null,null,null,null,null,"SC"]
[null,null,null,null,null,null,null,null,null,null,null,null,null,null,null,null,null,null,null,null,"SC"]
[]
[null,null,null,null,null,null,null,null,null,null,null,null,null,null,null,null,null,null,null,null,"SC"]
[]
[]
[]
[]
[]
[]
[]
[]
[]
{"$rows_left_out":11920}
{"sheet":"Credentials","index":3,"n_rows":204,"n_cols":12,"rows_kept":204,"cut":false,"hidden":true,"merged":[]}
[null,"Credential/Degree Name/Modality (From Smartcare)","Credential (From Invoice Template)",null,"State Rate","Group",null,null,"Procedure Name","Individual/Group"]
["Individual"," Certified AOD Counselor","Alcohol and Drug Counselor",{"$f":"A2&\"-\"&B2","v":"Individual- Certified AOD Counselor"},5.22,1.2,null,null,"Care Coordination Outside System of Care Group","Group","2024-06-30","2025-07-01"]
["Individual","Interactive Complexity",null,{"$f":"A3&\"-\"&B3","v":"Individual-Interactive Complexity"},18.32,null,null,null,"Psychosocial Rehabilitation Group","Group"]
["Individual"," Registered AOD Counselor","Alcohol and Drug Counselor","Individual- Registered AOD Counselor",5.22,1.2,null,null,"Group Therapy","Group"]
["Individual","Certified AOD Counselor","Alcohol and Drug Counselor",{"$f":"A5&\"-\"&B5","v":"Individual-Certified AOD Counselor"},5.22,1.2,null,null,"Multiple-Family Group Psychotherapy","Group"]
["Individual","Registered AOD Counselor","Alcohol and Drug Counselor","Individual-Registered AOD Counselor",5.22,1.2,null,null,"Group Counseling","Group"]
["Individual","AWM - Level 1","Ambulatory WM - Level 1","Individual-AWM - Level 1",319.36,null,null,null,"Medication Training and Support Group","Group"]
["Individual","AWM - Level 2","Ambulatory WM - Level 2","Individual-AWM - Level 2",374.77,null,null,null,"Behavioral Health Prevention Education Group","Group"]
["Individual","Bed Days","Bed Days","Individual-Bed Days",1,null,null,null,"Client Education Group","Group"]
["Individual","Bed Days WM","Bed Days","Individual-Bed Days WM",298.99384799999996]
["Individual","Admin Use Only - Bed Days","Bed Days","Individual-Admin Use Only - Bed Days"]
["Individual","CNS Clinical Nurse Specialist","Clinical Nurse Specialist","Individual-CNS Clinical Nurse Specialist",12.03,2.76]
["Individual","CNS Clinical Nurse Specialist Clinical Trainee","Clinical Nurse Specialist","Individual-CNS Clinical Nurse Specialist Clinical Trainee",12.03,2.76]
["Individual"," CNS Clinical Nurse Specialist","Clinical Nurse Specialist","Individual- CNS Clinical Nurse Specialist",12.03,2.76]
["Individual"," CNS Clinical Nurse Specialist Clinical Trainee","Clinical Nurse Specialist","Individual- CNS Clinical Nurse Specialist Clinical Trainee",12.03,2.76]
["Individual","Community Health Worker","Community Health Worker","Individual-Community Health Worker"]
["Individual"," Community Health Worker","Community Health Worker","Individual- Community Health Worker"]
["Individual","Crisis Residential Day","Crisis Residential Day","Individual-Crisis Residential Day",558.30189599999994]
["Individual","Adult Residential Day","Adult Residential Day","Individual-Adult Residential Day",276.52240799999998]
["Individual","Crisis Stabilization","Crisis Stabilization","Individual-Crisis Stabilization",369.22225199999997]
["Individual","Day Treatment Intensive - Full Day","Day Treatment Intensive - Full Day","Individual-Day Treatment Intensive - Full Day",781.79995199999996]
["Individual","Day Treatment Intensive - Half Day","Day Treatment Intensive - Half Day","Individual-Day Treatment Intensive - Half Day",521.20000000000005]
["Individual","Interpreter Services","Interpreter Services","Individual-Interpreter Services",2.0615999999999999,0.47]
["Individual"," PT Psychiatric Technician","Licensed Psychiatric Technician","Individual- PT Psychiatric Technician",4.42,1.01]
["Individual","PT Psychiatric Technician","Licensed Psychiatric Technician","Individual-PT Psychiatric Technician",4.42,1.01]
["Individual","PT Psychiatric Technician Clinical Trainee","Licensed Psychiatric Technician","Individual-PT Psychiatric Technician Clinical Trainee",4.42,1.01]
["Individual"," PT Psychiatric Technician Clinical Trainee","Licensed Psychiatric Technician","Individual- PT Psychiatric Technician Clinical Trainee",4.42,1.01]
["Individual","LVN Licensed Vocational Nurse","Licensed Vocational Nurse","Individual-LVN Licensed Vocational Nurse",5.16,1.18]
["Individual"," LVN Licensed Vocational Nurse","Licensed Vocational Nurse","Individual- LVN Licensed Vocational Nurse",5.16,1.18]
["Individual","LVN Clinical Trainee","Licensed Vocational Nurse","Individual-LVN Clinical Trainee",5.16,1.18]
["Individual"," LVN Clinical Trainee","Licensed Vocational Nurse","Individual- LVN Clinical Trainee",5.16,1.18]
["Individual"," AMFT Associate Marriage and Family Therapist","LPHA (MFT  LCSW  LPCC)/Intern or\nWaivered LPHA (MFT  LCSW  LPCC)","Individual- AMFT Associate Marriage and Family Therapist",6.29,1.44]
["Individual","LCSW Licensed Clinical Social Worker","LPHA (MFT  LCSW  LPCC)/Intern or\nWaivered LPHA (MFT  LCSW  LPCC)","Individual-LCSW Licensed Clinical Social Worker",6.29,1.44]
["Individual","MFT Marriage and Family Therapist","LPHA (MFT  LCSW  LPCC)/Intern or\nWaivered LPHA (MFT  LCSW  LPCC)","Individual-MFT Marriage and Family Therapist",6.29,1.44]
["Individual"," LPCC Licensed Professional Clinical Counselor","LPHA (MFT  LCSW  LPCC)/Intern or\nWaivered LPHA (MFT  LCSW  LPCC)","Individual- LPCC Licensed Professional Clinical Counselor",6.29,1.44]
["Individual","LPCC Licensed Professional Clinical Counselor","LPHA (MFT  LCSW  LPCC)/Intern or\nWaivered LPHA (MFT  LCSW  LPCC)","Individual-LPCC Licensed Professional Clinical Counselor",6.29,1.44]
["Individual"," MFT Marriage and Family Therapist","LPHA (MFT  LCSW  LPCC)/Intern or\nWaivered LPHA (MFT  LCSW  LPCC)","Individual- MFT Marriage and Family Therapist",6.29,1.44]
["Individual"," ASW Associate Social Worker","LPHA (MFT  LCSW  LPCC)/Intern or\nWaivered LPHA (MFT  LCSW  LPCC)","Individual- ASW Associate Social Worker",6.29,1.44]
["Individual"," Master's Degree LPHA Clinical Trainee","LPHA (MFT  LCSW  LPCC)/Intern or\nWaivered LPHA (MFT  LCSW  LPCC)","Individual- Master's Degree LPHA Clinical Trainee",6.29,1.44]
["Individual","APCC Associate Professional Clinical Counselor","LPHA (MFT  LCSW  LPCC)/Intern or\nWaivered LPHA (MFT  LCSW  LPCC)","Individual-APCC Associate Professional Clinical Counselor",6.29,1.44]
["Individual","Limited Licensed Professional Counselor","LPHA (MFT  LCSW  LPCC)/Intern or\nWaivered LPHA (MFT  LCSW  LPCC)","Individual-Limited Licensed Professional Counselor",6.29,1.44]
["Individual","ASW Associate Social Worker","LPHA (MFT  LCSW  LPCC)/Intern or\nWaivered LPHA (MFT  LCSW  LPCC)","Individual-ASW Associate Social Worker",6.29,1.44]
["Individual","LMHT","LPHA (MFT  LCSW  LPCC)/Intern or\nWaivered LPHA (MFT  LCSW  LPCC)","Individual-LMHT",6.29,1.44]
["Individual","Master's Degree LPHA Clinical Trainee","LPHA (MFT  LCSW  LPCC)/Intern or\nWaivered LPHA (MFT  LCSW  LPCC)","Individual-Master's Degree LPHA Clinical Trainee",6.29,1.44]
["Individual"," LCSW Licensed Clinical Social Worker","LPHA (MFT  LCSW  LPCC)/Intern or\nWaivered LPHA (MFT  LCSW  LPCC)","Individual- LCSW Licensed Clinical Social Worker",6.29,1.44]
["Individual","LPCC Licensed Professional Clinical Counselor Clinical Trainee","LPHA (MFT  LCSW  LPCC)/Intern or\nWaivered LPHA (MFT  LCSW  LPCC)","Individual-LPCC Licensed Professional Clinical Counselor Clinical Trainee",6.29,1.44]
["Individual"," APCC Associate Professional Clinical Counselor","LPHA (MFT  LCSW  LPCC)/Intern or\nWaivered LPHA (MFT  LCSW  LPCC)","Individual- APCC Associate Professional Clinical Counselor",6.29,1.44]
["Individual","AMFT Associate Marriage and Family Therapist","LPHA (MFT  LCSW  LPCC)/Intern or\nWaivered LPHA (MFT  LCSW  LPCC)","Individual-AMFT Associate Marriage and Family Therapist",6.29,1.44]
["Individual","MFT Marriage and Family Therapist Clinical Trainee","LPHA (MFT  LCSW  LPCC)/Intern or\nWaivered LPHA (MFT  LCSW  LPCC)","Individual-MFT Marriage and Family Therapist Clinical Trainee",6.29,1.44]
["Individual"," Limited Licensed Professional Counselor","LPHA (MFT  LCSW  LPCC)/Intern or\nWaivered LPHA (MFT  LCSW  LPCC)","Individual- Limited Licensed Professional Counselor",6.29,1.44]
["Individual"," LMHT","LPHA (MFT  LCSW  LPCC)/Intern or\nWaivered LPHA (MFT  LCSW  LPCC)","Individual- LMHT",6.29,1.44]
["Individual"," MFT Marriage and Family Therapist Clinical Trainee","LPHA (MFT  LCSW  LPCC)/Intern or\nWaivered LPHA (MFT  LCSW  LPCC)","Individual- MFT Marriage and Family Therapist Clinical Trainee",6.29,1.44]
["Individual"," LPCC Licensed Professional Clinical Counselor Clinical Trainee","LPHA (MFT  LCSW  LPCC)/Intern or\nWaivered LPHA (MFT  LCSW  LPCC)","Individual- LPCC Licensed Professional Clinical Counselor Clinical Trainee",6.29,1.44]
["Individual"," Medical Assistant","Medical Assistant","Individual- Medical Assistant",3.55,0.81]
["Individual","Medical Assistant","Medical Assistant","Individual-Medical Assistant",3.55,0.81]
["Individual"," MHRS Mental Health Rehabilitation Specialist","Mental Health Rehabilitation Specialist","Individual- MHRS Mental Health Rehabilitation Specialist",4.74,1.08]
["Individual","MHRS Mental Health Rehabilitation Specialist","Mental Health Rehabilitation Specialist","Individual-MHRS Mental Health Rehabilitation Specialist",4.74,1.08]
["Individual","NP Nurse Practitioner","Nurse Practitioner","Individual-NP Nurse Practitioner",12.03,2.76]
["Individual"," NP Nurse Practitioner Clinical Trainee","Nurse Practitioner","Individual- NP Nurse Practitioner Clinical Trainee",12.03,2.76]
["Individual"," NP Nurse Practitioner","Nurse Practitioner","Individual- NP Nurse Practitioner",12.03,2.76]
{"$rows_left_out":145}
{"sheet":"Summary","index":4,"n_rows":8,"n_cols":5,"rows_kept":8,"cut":false,"hidden":false,"merged":[[0,0,0,4]]}
["Summary of Charges and Claims Report"]
[]
["Months (Service Month)","(All)"]
["Years (Service Month)","(All)"]
[]
["ProgramCode","Credential","Individual/Group","PlanName","Sum of Billable Minutes"]
["(blank)","(blank)","(blank)","(blank)"]
["Grand Total"]

{"sheet":"Filtered Data","index":5,"n_rows":2,"n_cols":31,"rows_kept":2,"cut":false,"hidden":true,"merged":[]}
["ChargeId","PlanName","ClientId","serviceId","GroupServiceId","DateofService","Clinician","LicenceTypeDegree","ProcedureName","ServiceUnit","ServiceUnitType","CodeAndModifiers","Units","Charge","Balance","BilledDate","ModifiedDate","ChargeStatus","ProgramCode","LocationName","Filter1","Credential","Individual/Group","Billable Minutes","Credential","Credential (Concatenate)","Unit Conversation","Funding Source","Charges Updated","Service Month","Month"]
[{"$f":"_xlfn._xlws.FILTER('Charges & Claims'!A:AD,('Charges & Claims'!F:F>Credentials!K2)*('Charges & Claims'!F:F<Credentials!L2))","v":{"$error":"#VALUE!"}}]