{"text_format":"1","workbook":"xlsx","n_sheets":4,"sheets":["Final Recon - Summary","Sheet4","Final Recon - Details (SUD)","Final Recon - CEF (SUD only)"],"not_rendered":{"charts":0,"images":2,"macros":1,"external_links":5,"defined_names":37,"comments":0,"pivot_tables":0},"unopened":[],"bounds":{"document_bytes":16777216,"sheet_cells":100000,"rows_first":2000,"rows_last":500,"rows_between":2000,"halvings":0,"cell_chars":16384,"cell_head_chars":4096},"cells_cut":0,"cells_raw":0,"read":"whole","date_system":"1900"}

{"sheet":"Final Recon - Summary","index":0,"n_rows":529,"n_cols":9,"rows_kept":529,"cut":false,"hidden":false,"merged":[[324,2,324,4],[377,2,377,4],[430,2,430,4],[483,2,483,4],[6,2,6,4],[59,2,59,4],[112,2,112,4],[165,2,165,4],[218,2,218,4],[271,2,271,4],[470,1,470,5],[472,1,472,2],[472,4,472,5],[474,4,474,5],[475,1,475,2],[475,4,475,5],[523,1,523,5],[525,1,525,2],[525,4,525,5],[527,4,527,5],[528,1,528,2],[528,4,528,5],[417,1,417,5],[419,1,419,2],[419,4,419,5],[421,4,421,5],[422,1,422,2],[422,4,422,5],[364,1,364,5],[366,1,366,2],[366,4,366,5],[368,4,368,5],[369,1,369,2],[369,4,369,5],[311,1,311,5],[313,1,313,2],[313,4,313,5],[315,4,315,5],[316,1,316,2],[316,4,316,5],[258,1,258,5],[260,1,260,2],[260,4,260,5],[262,4,262,5],[263,1,263,2],[263,4,263,5],[205,1,205,5],[207,1,207,2],[207,4,207,5],[209,4,209,5],[210,1,210,2],[210,4,210,5],[152,1,152,5],[154,1,154,2],[154,4,154,5],[156,4,156,5],[157,1,157,2],[157,4,157,5],[99,1,99,5],[101,1,101,2],[101,4,101,5],[103,4,103,5],[104,1,104,2],[104,4,104,5],[46,1,46,5],[48,1,48,2],[48,4,48,5],[50,4,50,5],[51,1,51,2],[51,4,51,5]]}
["BEHAVIORAL HEALTH SERVICES"]
["Fiscal Year-End Units Reconciliation"]
[null,null,null,null,null,null,"# of Program Components:",1]
[null,"Contractor:",null,null,null,null,"Fiscal Year:"]
[null,"Contract #:",null,null,null,null,"TUOS Run Date:"]
[null,"Program Name:",null,null,null,null,{"$f":"IF(H6>0,\"Amount Due to Provider\",\"Amount Due to County\")","v":"Amount Due to County"},{"$f":"+I43+I96+I149+I202+I255+I308+I361+I414+I467+I520","v":0}]
[null,"Rate Category:","MH Outpatient - Negative 2.5% Modifer (Exc Interpreter, MD, IC) ",null,null,null,"Invoice Number:"]
[]
["Column1","Service Modalities","Unit","Rate","Final Invoice YTD Units","Final Invoice YTD Amount","Final TUOS Units Reconciliation","Final Amount Reconciliation","Amount Due to Provider / (Amount Due to County)"]
[{"$f":"$C$5","v":0},{"$f":"_xlfn.XLOOKUP(C7,Sheet4!A1:M1,Sheet4!A2:M34,0)","v":"Individual - Clinical Nurse Specialist"},{"$f":"_xlfn.XLOOKUP(C7,Sheet4!A40:M40,Sheet4!A41:M73,0)","v":"Per Billable Minute"},{"$f":"_xlfn.XLOOKUP(C7,Sheet4!A79:M79,Sheet4!A80:M112,0)","v":8.7199999999999989},null,{"$f":"+D10*E10","v":0},{"$f":"'Final Recon - Details (SUD)'!E9","v":0},{"$f":"+D10*G10","v":0},{"$f":"+'Final Recon - Summary'!$H10-'Final Recon - Summary'!$F10","v":0}]
[{"$f":"$C$5","v":0},"Individual - Licensed Psychiatric Technician","Per Billable Minute",3.21,null,{"$f":"+D11*E11","v":0},{"$f":"'Final Recon - Details (SUD)'!E10","v":0},{"$f":"+D11*G11","v":0},{"$f":"+'Final Recon - Summary'!$H11-'Final Recon - Summary'!$F11","v":0}]
[0,"Individual - LPHA (MFT  LCSW  LPCC)/Intern or Waivered LPHA (MFT  LCSW  LPCC)","Per Billable Minute",4.5599999999999996,null,0,{"$f":"'Final Recon - Details (SUD)'!E11","v":0},0,{"$f":"+'Final Recon - Summary'!$H12-'Final Recon - Summary'!$F12","v":0}]
[0,"Individual - Licensed Vocational Nurse (LVN)","Per Billable Minute",3.74,null,0,{"$f":"'Final Recon - Details (SUD)'!E12","v":0},0,{"$f":"+'Final Recon - Summary'!$H13-'Final Recon - Summary'!$F13","v":0}]
[0,"Individual - Medical Assistant","Per Billable Minute",2.5700000000000003,null,0,{"$f":"'Final Recon - Details (SUD)'!E13","v":0},0,{"$f":"+'Final Recon - Summary'!$H14-'Final Recon - Summary'!$F14","v":0}]
[0,"Individual - Mental Health Rehabilitation Specialist","Per Billable Minute",3.44,null,0,{"$f":"'Final Recon - Details (SUD)'!E14","v":0},0,{"$f":"+'Final Recon - Summary'!$H15-'Final Recon - Summary'!$F15","v":0}]
[0,"Individual - Nurse Practitioner","Per Billable Minute",8.7199999999999989,null,0,{"$f":"'Final Recon - Details (SUD)'!E15","v":0},0,{"$f":"+'Final Recon - Summary'!$H16-'Final Recon - Summary'!$F16","v":0}]
[0,"Individual - Occupational Therapist","Per Billable Minute",6.08,null,0,{"$f":"'Final Recon - Details (SUD)'!E16","v":0},0,{"$f":"+'Final Recon - Summary'!$H17-'Final Recon - Summary'!$F17","v":0}]
[0,"Individual - Other Qualified Providers - Other Designated MH staff that bill medical","Per Billable Minute",3.44,null,0,{"$f":"'Final Recon - Details (SUD)'!E17","v":0},0,{"$f":"+'Final Recon - Summary'!$H18-'Final Recon - Summary'!$F18","v":0}]
[0,"Individual - Peer Support Specialist","Per Billable Minute",3.61,null,0,{"$f":"'Final Recon - Details (SUD)'!E18","v":0},0,{"$f":"+'Final Recon - Summary'!$H19-'Final Recon - Summary'!$F19","v":0}]
[0,"Individual - Physician Assistant","Per Billable Minute",7.870000000000001,null,0,{"$f":"'Final Recon - Details (SUD)'!E19","v":0},0,{"$f":"+'Final Recon - Summary'!$H20-'Final Recon - Summary'!$F20","v":0}]
[0,"Individual - Psychologist/Pre-licensed Psychologist","Per Billable Minute",7.06,null,0,{"$f":"'Final Recon - Details (SUD)'!E20","v":0},0,{"$f":"+'Final Recon - Summary'!$H21-'Final Recon - Summary'!$F21","v":0}]
[0,"Individual - Psychiatrist/ Contracted Psychiatrist/Licensed Physician (MD)","Per Billable Minute",10.89,null,0,{"$f":"'Final Recon - Details (SUD)'!E21","v":0},0,{"$f":"+'Final Recon - Summary'!$H22-'Final Recon - Summary'!$F22","v":0}]
[0,"Individual - Registered Nurse (RN)","Per Billable Minute",7.12,null,0,{"$f":"'Final Recon - Details (SUD)'!E22","v":0},0,{"$f":"+'Final Recon - Summary'!$H23-'Final Recon - Summary'!$F23","v":0}]
[0,"Individual - Registered Pharmacist","Per Billable Minute",8.4,null,0,{"$f":"'Final Recon - Details (SUD)'!E23","v":0},0,{"$f":"+'Final Recon - Summary'!$H24-'Final Recon - Summary'!$F24","v":0}]
[0,"Individual - Interpreter Services","Per Billable Minute",1.55,null,0,{"$f":"'Final Recon - Details (SUD)'!E24","v":0},0,{"$f":"+'Final Recon - Summary'!$H25-'Final Recon - Summary'!$F25","v":0}]
[0,"Interactive Complexity","Per Encounter",13.74,null,0,{"$f":"'Final Recon - Details (SUD)'!E25","v":0},0,{"$f":"+'Final Recon - Summary'!$H26-'Final Recon - Summary'!$F26","v":0}]
[0,"Group - Clinical Nurse Specialist","Per Billable Minute",1.9399999999999997,null,0,{"$f":"'Final Recon - Details (SUD)'!E26","v":0},0,{"$f":"+'Final Recon - Summary'!$H27-'Final Recon - Summary'!$F27","v":0}]
[0,"Group - Licensed Psychiatric Technician","Per Billable Minute",0.72,null,0,{"$f":"'Final Recon - Details (SUD)'!E27","v":0},0,{"$f":"+'Final Recon - Summary'!$H28-'Final Recon - Summary'!$F28","v":0}]
[0,"Group - LPHA (MFT  LCSW  LPCC)/Intern or Waivered LPHA (MFT  LCSW  LPCC)","Per Billable Minute",1.02,null,0,{"$f":"'Final Recon - Details (SUD)'!E28","v":0},0,{"$f":"+'Final Recon - Summary'!$H29-'Final Recon - Summary'!$F29","v":0}]
[{"$f":"$C$5","v":0},"Group - Licensed Vocational Nurse (LVN)","Per Billable Minute",0.83,null,0,{"$f":"'Final Recon - Details (SUD)'!E29","v":0},0,{"$f":"+'Final Recon - Summary'!$H30-'Final Recon - Summary'!$F30","v":0}]
[0,"Group - Medical Assistant","Per Billable Minute",0.56999999999999995,null,0,{"$f":"'Final Recon - Details (SUD)'!E30","v":0},0,{"$f":"+'Final Recon - Summary'!$H31-'Final Recon - Summary'!$F31","v":0}]
[{"$f":"$C$5","v":0},"Group - Mental Health Rehabilitation Specialist","Per Billable Minute",0.76,null,0,{"$f":"'Final Recon - Details (SUD)'!E31","v":0},0,{"$f":"+'Final Recon - Summary'!$H32-'Final Recon - Summary'!$F32","v":0}]
[{"$f":"$C$5","v":0},"Group - Nurse Practitioner","Per Billable Minute",1.9399999999999997,null,0,{"$f":"'Final Recon - Details (SUD)'!E32","v":0},0,{"$f":"+'Final Recon - Summary'!$H33-'Final Recon - Summary'!$F33","v":0}]
[{"$f":"$C$5","v":0},"Group - Occupational Therapist","Per Billable Minute",1.3499999999999999,null,0,{"$f":"'Final Recon - Details (SUD)'!E33","v":0},0,{"$f":"+'Final Recon - Summary'!$H34-'Final Recon - Summary'!$F34","v":0}]
[{"$f":"$C$5","v":0},"Group - Other Qualified Providers - Other Designated MH staff that bill medical","Per Billable Minute",0.76,null,0,{"$f":"'Final Recon - Details (SUD)'!E34","v":0},0,{"$f":"+'Final Recon - Summary'!$H35-'Final Recon - Summary'!$F35","v":0}]
[{"$f":"$C$5","v":0},"Group - Peer Support Specialist","Per Billable Minute",0.79999999999999993,null,0,{"$f":"'Final Recon - Details (SUD)'!E35","v":0},0,{"$f":"+'Final Recon - Summary'!$H36-'Final Recon - Summary'!$F36","v":0}]
[0,"Group - Physician Assistant","Per Billable Minute",1.75,null,0,{"$f":"'Final Recon - Details (SUD)'!E36","v":0},0,{"$f":"+'Final Recon - Summary'!$H37-'Final Recon - Summary'!$F37","v":0}]
[0,"Group - Psychologist/Pre-licensed Psychologist","Per Billable Minute",1.57,null,0,{"$f":"'Final Recon - Details (SUD)'!E37","v":0},0,{"$f":"+'Final Recon - Summary'!$H38-'Final Recon - Summary'!$F38","v":0}]
[0,"Group - Psychiatrist/ Contracted Psychiatrist/Licensed Physician (MD)","Per Billable Minute",2.42,null,0,{"$f":"'Final Recon - Details (SUD)'!E38","v":0},0,{"$f":"+'Final Recon - Summary'!$H39-'Final Recon - Summary'!$F39","v":0}]
[0,"Group - Registered Nurse (RN)","Per Billable Minute",1.5899999999999999,null,0,{"$f":"'Final Recon - Details (SUD)'!E39","v":0},0,{"$f":"+'Final Recon - Summary'!$H40-'Final Recon - Summary'!$F40","v":0}]
[0,"Group - Registered Pharmacist","Per Billable Minute",1.8699999999999999,null,0,{"$f":"'Final Recon - Details (SUD)'!E40","v":0},0,{"$f":"+'Final Recon - Summary'!$H41-'Final Recon - Summary'!$F41","v":0}]
[0,"Group - Interpreter Services","Per Billable Minute",0.34,null,0,{"$f":"'Final Recon - Details (SUD)'!E41","v":0},0,{"$f":"+'Final Recon - Summary'!$H42-'Final Recon - Summary'!$F42","v":0}]
[0,"Total",null,null,null,{"$f":"SUM(F10:F42)","v":0},{"$f":"SUM(G10:G42)","v":0},{"$f":"SUM(H10:H42)","v":0},{"$f":"SUM(I10:I42)","v":0}]
[]
[]
[null,"Certification of Exclusion and Debarment (Article 4) & Funding Attestation"]
[null,"I certify, under penalty of perjury under the laws of the State of California, that the deliverables and/or services invoiced were delivered and/or performed specifically for this Agreement in accordance with and compliance to all terms and conditions set forth therein.\n "]
[]
[null,"Contractor Authorized Signature ",null,null,"Print Name & Title",null,null,"Date"]
[]
[]
[null,"PREPARER'S NAME",null,null,"PHONE NUMBER"]
[]
["BEHAVIORAL HEALTH SERVICES"]
["Fical Year-End Units Reconciliation"]
[]
[null,"Contractor:",{"$f":"C4","v":0},null,null,null,"Fiscal Year:",{"$f":"H4","v":0}]
[null,"Contract #:",{"$f":"C5","v":0},null,null,null,"TUOS Run Date:",{"$f":"H5","v":"00:00:00"}]
[null,"Program Name:",{"$f":"'[4]MH & SUD INVOICE (Sch I)'!C118","v":"Program 2"}]
[null,"Rate Category:","MH Outpatient - Positive 7.5% Modifer (Exc Interpreter, MD, IC) "]
[]
["Column1","Service Modalities","Unit","Rate","Final Invoice YTD Units","Final Invoice YTD Amount","Final TUOS Units Reconciliation","Final Amount Reconciliation","Amount Due to Provider / (Amount Due to County)"]
[{"$f":"$C$5","v":0},{"$f":"_xlfn.XLOOKUP(C60,Sheet4!A1:M1,Sheet4!A2:M34,0)","v":"Individual - Clinical Nurse Specialist"},{"$f":"_xlfn.XLOOKUP(C60,Sheet4!A40:M40,Sheet4!A41:M73,0)","v":"Per Billable Minute"},{"$f":"_xlfn.XLOOKUP(C60,Sheet4!A79:M79,Sheet4!A80:M112,0)","v":9.92},null,{"$f":"+D63*E63","v":0},null,{"$f":"+D63*G63","v":0},{"$f":"+'Final Recon - Summary'!$H63-'Final Recon - Summary'!$F63","v":0}]
[{"$f":"$C$5","v":0},"Individual - Licensed Psychiatric Technician","Per Billable Minute",3.65,null,{"$f":"+D64*E64","v":0},null,{"$f":"+D64*G64","v":0},{"$f":"+'Final Recon - Summary'!$H64-'Final Recon - Summary'!$F64","v":0}]
[0,"Individual - LPHA (MFT  LCSW  LPCC)/Intern or Waivered LPHA (MFT  LCSW  LPCC)","Per Billable Minute",5.1899999999999995,null,0,null,0,{"$f":"+'Final Recon - Summary'!$H65-'Final Recon - Summary'!$F65","v":0}]
[0,"Individual - Licensed Vocational Nurse (LVN)","Per Billable Minute",4.26,null,0,null,0,{"$f":"+'Final Recon - Summary'!$H66-'Final Recon - Summary'!$F66","v":0}]
[0,"Individual - Medical Assistant","Per Billable Minute",2.93,null,0,null,0,{"$f":"+'Final Recon - Summary'!$H67-'Final Recon - Summary'!$F67","v":0}]
[0,"Individual - Mental Health Rehabilitation Specialist","Per Billable Minute",3.92,null,0,null,0,{"$f":"+'Final Recon - Summary'!$H68-'Final Recon - Summary'!$F68","v":0}]
[0,"Individual - Nurse Practitioner","Per Billable Minute",9.92,null,0,null,0,{"$f":"+'Final Recon - Summary'!$H69-'Final Recon - Summary'!$F69","v":0}]
[0,"Individual - Occupational Therapist","Per Billable Minute",6.92,null,0,null,0,{"$f":"+'Final Recon - Summary'!$H70-'Final Recon - Summary'!$F70","v":0}]
[0,"Individual - Other Qualified Providers - Other Designated MH staff that bill medical","Per Billable Minute",3.92,null,0,null,0,{"$f":"+'Final Recon - Summary'!$H71-'Final Recon - Summary'!$F71","v":0}]
[0,"Individual - Peer Support Specialist","Per Billable Minute",4.0999999999999996,null,0,null,0,{"$f":"+'Final Recon - Summary'!$H72-'Final Recon - Summary'!$F72","v":0}]
[0,"Individual - Physician Assistant","Per Billable Minute",8.9500000000000011,null,0,null,0,{"$f":"+'Final Recon - Summary'!$H73-'Final Recon - Summary'!$F73","v":0}]
[0,"Individual - Psychologist/Pre-licensed Psychologist","Per Billable Minute",8.0299999999999994,null,0,null,0,{"$f":"+'Final Recon - Summary'!$H74-'Final Recon - Summary'!$F74","v":0}]
[0,"Individual - Psychiatrist/ Contracted Psychiatrist/Licensed Physician (MD)","Per Billable Minute",10.89,null,0,null,0,{"$f":"+'Final Recon - Summary'!$H75-'Final Recon - Summary'!$F75","v":0}]
[0,"Individual - Registered Nurse (RN)","Per Billable Minute",8.11,null,0,null,0,{"$f":"+'Final Recon - Summary'!$H76-'Final Recon - Summary'!$F76","v":0}]
[0,"Individual - Registered Pharmacist","Per Billable Minute",9.5599999999999987,null,0,null,0,{"$f":"+'Final Recon - Summary'!$H77-'Final Recon - Summary'!$F77","v":0}]
[0,"Individual - Interpreter Services","Per Billable Minute",1.55,null,0,null,0,{"$f":"+'Final Recon - Summary'!$H78-'Final Recon - Summary'!$F78","v":0}]
[0,"Interactive Complexity","Per Encounter",13.74,null,0,null,0,{"$f":"+'Final Recon - Summary'!$H79-'Final Recon - Summary'!$F79","v":0}]
[0,"Group - Clinical Nurse Specialist","Per Billable Minute",2.21,null,0,null,0,{"$f":"+'Final Recon - Summary'!$H80-'Final Recon - Summary'!$F80","v":0}]
[0,"Group - Licensed Psychiatric Technician","Per Billable Minute",0.81,null,0,null,0,{"$f":"+'Final Recon - Summary'!$H81-'Final Recon - Summary'!$F81","v":0}]
[0,"Group - LPHA (MFT  LCSW  LPCC)/Intern or Waivered LPHA (MFT  LCSW  LPCC)","Per Billable Minute",1.1500000000000001,null,0,null,0,{"$f":"+'Final Recon - Summary'!$H82-'Final Recon - Summary'!$F82","v":0}]
[0,"Group - Licensed Vocational Nurse (LVN)","Per Billable Minute",0.95,null,0,null,0,{"$f":"+'Final Recon - Summary'!$H83-'Final Recon - Summary'!$F83","v":0}]
[{"$f":"$C$5","v":0},"Group - Medical Assistant","Per Billable Minute",0.64999999999999991,null,0,null,0,{"$f":"+'Final Recon - Summary'!$H84-'Final Recon - Summary'!$F84","v":0}]
[0,"Group - Mental Health Rehabilitation Specialist","Per Billable Minute",0.87,null,0,null,0,{"$f":"+'Final Recon - Summary'!$H85-'Final Recon - Summary'!$F85","v":0}]
[{"$f":"$C$5","v":0},"Group - Nurse Practitioner","Per Billable Minute",2.21,null,0,null,0,{"$f":"+'Final Recon - Summary'!$H86-'Final Recon - Summary'!$F86","v":0}]
[{"$f":"$C$5","v":0},"Group - Occupational Therapist","Per Billable Minute",1.54,null,0,null,0,{"$f":"+'Final Recon - Summary'!$H87-'Final Recon - Summary'!$F87","v":0}]
[{"$f":"$C$5","v":0},"Group - Other Qualified Providers - Other Designated MH staff that bill medical","Per Billable Minute",0.87,null,0,null,0,{"$f":"+'Final Recon - Summary'!$H88-'Final Recon - Summary'!$F88","v":0}]
[{"$f":"$C$5","v":0},"Group - Peer Support Specialist","Per Billable Minute",0.91,null,0,null,0,{"$f":"+'Final Recon - Summary'!$H89-'Final Recon - Summary'!$F89","v":0}]
[{"$f":"$C$5","v":0},"Group - Physician Assistant","Per Billable Minute",1.99,null,0,null,0,{"$f":"+'Final Recon - Summary'!$H90-'Final Recon - Summary'!$F90","v":0}]
[0,"Group - Psychologist/Pre-licensed Psychologist","Per Billable Minute",1.78,null,0,null,0,{"$f":"+'Final Recon - Summary'!$H91-'Final Recon - Summary'!$F91","v":0}]
[0,"Group - Psychiatrist/ Contracted Psychiatrist/Licensed Physician (MD)","Per Billable Minute",2.42,null,0,null,0,{"$f":"+'Final Recon - Summary'!$H92-'Final Recon - Summary'!$F92","v":0}]
[0,"Group - Registered Nurse (RN)","Per Billable Minute",1.7999999999999998,null,0,null,0,{"$f":"+'Final Recon - Summary'!$H93-'Final Recon - Summary'!$F93","v":0}]
[0,"Group - Registered Pharmacist","Per Billable Minute",2.12,null,0,null,0,{"$f":"+'Final Recon - Summary'!$H94-'Final Recon - Summary'!$F94","v":0}]
[0,"Group - Interpreter Services","Per Billable Minute",0.34,null,0,null,0,{"$f":"+'Final Recon - Summary'!$H95-'Final Recon - Summary'!$F95","v":0}]
[0,"Total",null,null,null,{"$f":"SUM(F63:F95)","v":0},{"$f":"SUM(G63:G95)","v":0},{"$f":"SUM(H63:H95)","v":0},{"$f":"SUM(I63:I95)","v":0}]
[]
[]
[null,"Certification of Exclusion and Debarment (Article 4) & Funding Attestation"]
[null,"I certify, under penalty of perjury under the laws of the State of California, that the deliverables and/or services invoiced were delivered and/or performed specifically for this Agreement in accordance with and compliance to all terms and conditions set forth therein.\n "]
[]
[null,"Contractor Authorized Signature ",null,null,"Print Name & Title",null,null,"Date"]
[]
[]
[null,"PREPARER'S NAME",null,null,"PHONE NUMBER"]
[]
["BEHAVIORAL HEALTH SERVICES"]
["Fical Year-End Units Reconciliation"]
[]
[null,"Contractor:",{"$f":"C57","v":0},null,null,null,"Fiscal Year:",{"$f":"H57","v":0}]
[null,"Contract #:",{"$f":"C58","v":0},null,null,null,"TUOS Run Date:",{"$f":"H58","v":"00:00:00"}]
[null,"Program Name:",{"$f":"'[4]MH & SUD INVOICE (Sch I)'!C229","v":"Program 3"}]
[null,"Rate Category:","MH Outpatient - Positive 7.5% Modifer (Exc Interpreter, MD, IC) "]
[]
["Column1","Service Modalities","Unit","Rate","Final Invoice YTD Units","Final Invoice YTD Amount","Final TUOS Units Reconciliation","Final Amount Reconciliation","Amount Due to Provider / (Amount Due to County)"]
[{"$f":"$C$5","v":0},{"$f":"_xlfn.XLOOKUP(C113,Sheet4!A1:M1,Sheet4!A2:M34,0)","v":"Individual - Clinical Nurse Specialist"},{"$f":"_xlfn.XLOOKUP(C113,Sheet4!A40:M40,Sheet4!A41:M73,0)","v":"Per Billable Minute"},{"$f":"_xlfn.XLOOKUP(C113,Sheet4!A79:M79,Sheet4!A80:M112,0)","v":9.92},null,{"$f":"+D116*E116","v":0},null,{"$f":"+D116*G116","v":0},{"$f":"+'Final Recon - Summary'!$H116-'Final Recon - Summary'!$F116","v":0}]
[{"$f":"$C$5","v":0},"Individual - Licensed Psychiatric Technician","Per Billable Minute",3.65,null,{"$f":"+D117*E117","v":0},null,{"$f":"+D117*G117","v":0},{"$f":"+'Final Recon - Summary'!$H117-'Final Recon - Summary'!$F117","v":0}]
[0,"Individual - LPHA (MFT  LCSW  LPCC)/Intern or Waivered LPHA (MFT  LCSW  LPCC)","Per Billable Minute",5.1899999999999995,null,0,null,0,{"$f":"+'Final Recon - Summary'!$H118-'Final Recon - Summary'!$F118","v":0}]
[0,"Individual - Licensed Vocational Nurse (LVN)","Per Billable Minute",4.26,null,0,null,0,{"$f":"+'Final Recon - Summary'!$H119-'Final Recon - Summary'!$F119","v":0}]
[0,"Individual - Medical Assistant","Per Billable Minute",2.93,null,0,null,0,{"$f":"+'Final Recon - Summary'!$H120-'Final Recon - Summary'!$F120","v":0}]
[0,"Individual - Mental Health Rehabilitation Specialist","Per Billable Minute",3.92,null,0,null,0,{"$f":"+'Final Recon - Summary'!$H121-'Final Recon - Summary'!$F121","v":0}]
[0,"Individual - Nurse Practitioner","Per Billable Minute",9.92,null,0,null,0,{"$f":"+'Final Recon - Summary'!$H122-'Final Recon - Summary'!$F122","v":0}]
[0,"Individual - Occupational Therapist","Per Billable Minute",6.92,null,0,null,0,{"$f":"+'Final Recon - Summary'!$H123-'Final Recon - Summary'!$F123","v":0}]
[0,"Individual - Other Qualified Providers - Other Designated MH staff that bill medical","Per Billable Minute",3.92,null,0,null,0,{"$f":"+'Final Recon - Summary'!$H124-'Final Recon - Summary'!$F124","v":0}]
[0,"Individual - Peer Support Specialist","Per Billable Minute",4.0999999999999996,null,0,null,0,{"$f":"+'Final Recon - Summary'!$H125-'Final Recon - Summary'!$F125","v":0}]
[0,"Individual - Physician Assistant","Per Billable Minute",8.9500000000000011,null,0,null,0,{"$f":"+'Final Recon - Summary'!$H126-'Final Recon - Summary'!$F126","v":0}]
[0,"Individual - Psychologist/Pre-licensed Psychologist","Per Billable Minute",8.0299999999999994,null,0,null,0,{"$f":"+'Final Recon - Summary'!$H127-'Final Recon - Summary'!$F127","v":0}]
[0,"Individual - Psychiatrist/ Contracted Psychiatrist/Licensed Physician (MD)","Per Billable Minute",10.89,null,0,null,0,{"$f":"+'Final Recon - Summary'!$H128-'Final Recon - Summary'!$F128","v":0}]
[0,"Individual - Registered Nurse (RN)","Per Billable Minute",8.11,null,0,null,0,{"$f":"+'Final Recon - Summary'!$H129-'Final Recon - Summary'!$F129","v":0}]
[0,"Individual - Registered Pharmacist","Per Billable Minute",9.5599999999999987,null,0,null,0,{"$f":"+'Final Recon - Summary'!$H130-'Final Recon - Summary'!$F130","v":0}]
[0,"Individual - Interpreter Services","Per Billable Minute",1.55,null,0,null,0,{"$f":"+'Final Recon - Summary'!$H131-'Final Recon - Summary'!$F131","v":0}]
[0,"Interactive Complexity","Per Encounter",13.74,null,0,null,0,{"$f":"+'Final Recon - Summary'!$H132-'Final Recon - Summary'!$F132","v":0}]
[0,"Group - Clinical Nurse Specialist","Per Billable Minute",2.21,null,0,null,0,{"$f":"+'Final Recon - Summary'!$H133-'Final Recon - Summary'!$F133","v":0}]
[0,"Group - Licensed Psychiatric Technician","Per Billable Minute",0.81,null,0,null,0,{"$f":"+'Final Recon - Summary'!$H134-'Final Recon - Summary'!$F134","v":0}]
[0,"Group - LPHA (MFT  LCSW  LPCC)/Intern or Waivered LPHA (MFT  LCSW  LPCC)","Per Billable Minute",1.1500000000000001,null,0,null,0,{"$f":"+'Final Recon - Summary'!$H135-'Final Recon - Summary'!$F135","v":0}]
[0,"Group - Licensed Vocational Nurse (LVN)","Per Billable Minute",0.95,null,0,null,0,{"$f":"+'Final Recon - Summary'!$H136-'Final Recon - Summary'!$F136","v":0}]
[{"$f":"$C$5","v":0},"Group - Medical Assistant","Per Billable Minute",0.64999999999999991,null,0,null,0,{"$f":"+'Final Recon - Summary'!$H137-'Final Recon - Summary'!$F137","v":0}]
[0,"Group - Mental Health Rehabilitation Specialist","Per Billable Minute",0.87,null,0,null,0,{"$f":"+'Final Recon - Summary'!$H138-'Final Recon - Summary'!$F138","v":0}]
[{"$f":"$C$5","v":0},"Group - Nurse Practitioner","Per Billable Minute",2.21,null,0,null,0,{"$f":"+'Final Recon - Summary'!$H139-'Final Recon - Summary'!$F139","v":0}]
[{"$f":"$C$5","v":0},"Group - Occupational Therapist","Per Billable Minute",1.54,null,0,null,0,{"$f":"+'Final Recon - Summary'!$H140-'Final Recon - Summary'!$F140","v":0}]
[{"$f":"$C$5","v":0},"Group - Other Qualified Providers - Other Designated MH staff that bill medical","Per Billable Minute",0.87,null,0,null,0,{"$f":"+'Final Recon - Summary'!$H141-'Final Recon - Summary'!$F141","v":0}]
[{"$f":"$C$5","v":0},"Group - Peer Support Specialist","Per Billable Minute",0.91,null,0,null,0,{"$f":"+'Final Recon - Summary'!$H142-'Final Recon - Summary'!$F142","v":0}]
[{"$f":"$C$5","v":0},"Group - Physician Assistant","Per Billable Minute",1.99,null,0,null,0,{"$f":"+'Final Recon - Summary'!$H143-'Final Recon - Summary'!$F143","v":0}]
[0,"Group - Psychologist/Pre-licensed Psychologist","Per Billable Minute",1.78,null,0,null,0,{"$f":"+'Final Recon - Summary'!$H144-'Final Recon - Summary'!$F144","v":0}]
[0,"Group - Psychiatrist/ Contracted Psychiatrist/Licensed Physician (MD)","Per Billable Minute",2.42,null,0,null,0,{"$f":"+'Final Recon - Summary'!$H145-'Final Recon - Summary'!$F145","v":0}]
[0,"Group - Registered Nurse (RN)","Per Billable Minute",1.7999999999999998,null,0,null,0,{"$f":"+'Final Recon - Summary'!$H146-'Final Recon - Summary'!$F146","v":0}]
[0,"Group - Registered Pharmacist","Per Billable Minute",2.12,null,0,null,0,{"$f":"+'Final Recon - Summary'!$H147-'Final Recon - Summary'!$F147","v":0}]
[0,"Group - Interpreter Services","Per Billable Minute",0.34,null,0,null,0,{"$f":"+'Final Recon - Summary'!$H148-'Final Recon - Summary'!$F148","v":0}]
[0,"Total",null,null,null,{"$f":"SUM(F116:F148)","v":0},{"$f":"SUM(G116:G148)","v":0},{"$f":"SUM(H116:H148)","v":0},{"$f":"SUM(I116:I148)","v":0}]
[]
[]
[null,"Certification of Exclusion and Debarment (Article 4) & Funding Attestation"]
[null,"I certify, under penalty of perjury under the laws of the State of California, that the deliverables and/or services invoiced were delivered and/or performed specifically for this Agreement in accordance with and compliance to all terms and conditions set forth therein.\n "]
[]
[null,"Contractor Authorized Signature ",null,null,"Print Name & Title",null,null,"Date"]
[]
[]
[null,"PREPARER'S NAME",null,null,"PHONE NUMBER"]
[]
["BEHAVIORAL HEALTH SERVICES"]
["Fical Year-End Units Reconciliation"]
[]
[null,"Contractor:",{"$f":"C110","v":0},null,null,null,"Fiscal Year:",{"$f":"H110","v":0}]
[null,"Contract #:",{"$f":"C111","v":0},null,null,null,"TUOS Run Date:",{"$f":"H111","v":"00:00:00"}]
[null,"Program Name:",{"$f":"'[4]MH & SUD INVOICE (Sch I)'!C341","v":"Program 4"}]
[null,"Rate Category:","MH Outpatient - Positive 7.5% Modifer (Exc Interpreter, MD, IC) "]
[]
["Column1","Service Modalities","Unit","Rate","Final Invoice YTD Units","Final Invoice YTD Amount","Final TUOS Units Reconciliation","Final Amount Reconciliation","Amount Due to Provider / (Amount Due to County)"]
[{"$f":"$C$5","v":0},{"$f":"_xlfn.XLOOKUP(C166,Sheet4!A1:M1,Sheet4!A2:M34,0)","v":"Individual - Clinical Nurse Specialist"},{"$f":"_xlfn.XLOOKUP(C166,Sheet4!A40:M40,Sheet4!A41:M73,0)","v":"Per Billable Minute"},{"$f":"_xlfn.XLOOKUP(C166,Sheet4!A79:M79,Sheet4!A80:M112,0)","v":9.92},null,{"$f":"+D169*E169","v":0},null,{"$f":"+D169*G169","v":0},{"$f":"+'Final Recon - Summary'!$H169-'Final Recon - Summary'!$F169","v":0}]
[{"$f":"$C$5","v":0},"Individual - Licensed Psychiatric Technician","Per Billable Minute",3.65,null,{"$f":"+D170*E170","v":0},null,{"$f":"+D170*G170","v":0},{"$f":"+'Final Recon - Summary'!$H170-'Final Recon - Summary'!$F170","v":0}]
[0,"Individual - LPHA (MFT  LCSW  LPCC)/Intern or Waivered LPHA (MFT  LCSW  LPCC)","Per Billable Minute",5.1899999999999995,null,0,null,0,{"$f":"+'Final Recon - Summary'!$H171-'Final Recon - Summary'!$F171","v":0}]
[0,"Individual - Licensed Vocational Nurse (LVN)","Per Billable Minute",4.26,null,0,null,0,{"$f":"+'Final Recon - Summary'!$H172-'Final Recon - Summary'!$F172","v":0}]
[0,"Individual - Medical Assistant","Per Billable Minute",2.93,null,0,null,0,{"$f":"+'Final Recon - Summary'!$H173-'Final Recon - Summary'!$F173","v":0}]
[0,"Individual - Mental Health Rehabilitation Specialist","Per Billable Minute",3.92,null,0,null,0,{"$f":"+'Final Recon - Summary'!$H174-'Final Recon - Summary'!$F174","v":0}]
[0,"Individual - Nurse Practitioner","Per Billable Minute",9.92,null,0,null,0,{"$f":"+'Final Recon - Summary'!$H175-'Final Recon - Summary'!$F175","v":0}]
[0,"Individual - Occupational Therapist","Per Billable Minute",6.92,null,0,null,0,{"$f":"+'Final Recon - Summary'!$H176-'Final Recon - Summary'!$F176","v":0}]
[0,"Individual - Other Qualified Providers - Other Designated MH staff that bill medical","Per Billable Minute",3.92,null,0,null,0,{"$f":"+'Final Recon - Summary'!$H177-'Final Recon - Summary'!$F177","v":0}]
[0,"Individual - Peer Support Specialist","Per Billable Minute",4.0999999999999996,null,0,null,0,{"$f":"+'Final Recon - Summary'!$H178-'Final Recon - Summary'!$F178","v":0}]
[0,"Individual - Physician Assistant","Per Billable Minute",8.9500000000000011,null,0,null,0,{"$f":"+'Final Recon - Summary'!$H179-'Final Recon - Summary'!$F179","v":0}]
[0,"Individual - Psychologist/Pre-licensed Psychologist","Per Billable Minute",8.0299999999999994,null,0,null,0,{"$f":"+'Final Recon - Summary'!$H180-'Final Recon - Summary'!$F180","v":0}]
[0,"Individual - Psychiatrist/ Contracted Psychiatrist/Licensed Physician (MD)","Per Billable Minute",10.89,null,0,null,0,{"$f":"+'Final Recon - Summary'!$H181-'Final Recon - Summary'!$F181","v":0}]
[0,"Individual - Registered Nurse (RN)","Per Billable Minute",8.11,null,0,null,0,{"$f":"+'Final Recon - Summary'!$H182-'Final Recon - Summary'!$F182","v":0}]
[0,"Individual - Registered Pharmacist","Per Billable Minute",9.5599999999999987,null,0,null,0,{"$f":"+'Final Recon - Summary'!$H183-'Final Recon - Summary'!$F183","v":0}]
[0,"Individual - Interpreter Services","Per Billable Minute",1.55,null,0,null,0,{"$f":"+'Final Recon - Summary'!$H184-'Final Recon - Summary'!$F184","v":0}]
[0,"Interactive Complexity","Per Encounter",13.74,null,0,null,0,{"$f":"+'Final Recon - Summary'!$H185-'Final Recon - Summary'!$F185","v":0}]
[0,"Group - Clinical Nurse Specialist","Per Billable Minute",2.21,null,0,null,0,{"$f":"+'Final Recon - Summary'!$H186-'Final Recon - Summary'!$F186","v":0}]
[0,"Group - Licensed Psychiatric Technician","Per Billable Minute",0.81,null,0,null,0,{"$f":"+'Final Recon - Summary'!$H187-'Final Recon - Summary'!$F187","v":0}]
[0,"Group - LPHA (MFT  LCSW  LPCC)/Intern or Waivered LPHA (MFT  LCSW  LPCC)","Per Billable Minute",1.1500000000000001,null,0,null,0,{"$f":"+'Final Recon - Summary'!$H188-'Final Recon - Summary'!$F188","v":0}]
[0,"Group - Licensed Vocational Nurse (LVN)","Per Billable Minute",0.95,null,0,null,0,{"$f":"+'Final Recon - Summary'!$H189-'Final Recon - Summary'!$F189","v":0}]
[{"$f":"$C$5","v":0},"Group - Medical Assistant","Per Billable Minute",0.64999999999999991,null,0,null,0,{"$f":"+'Final Recon - Summary'!$H190-'Final Recon - Summary'!$F190","v":0}]
[0,"Group - Mental Health Rehabilitation Specialist","Per Billable Minute",0.87,null,0,null,0,{"$f":"+'Final Recon - Summary'!$H191-'Final Recon - Summary'!$F191","v":0}]
[{"$f":"$C$5","v":0},"Group - Nurse Practitioner","Per Billable Minute",2.21,null,0,null,0,{"$f":"+'Final Recon - Summary'!$H192-'Final Recon - Summary'!$F192","v":0}]
[{"$f":"$C$5","v":0},"Group - Occupational Therapist","Per Billable Minute",1.54,null,0,null,0,{"$f":"+'Final Recon - Summary'!$H193-'Final Recon - Summary'!$F193","v":0}]
[{"$f":"$C$5","v":0},"Group - Other Qualified Providers - Other Designated MH staff that bill medical","Per Billable Minute",0.87,null,0,null,0,{"$f":"+'Final Recon - Summary'!$H194-'Final Recon - Summary'!$F194","v":0}]
[{"$f":"$C$5","v":0},"Group - Peer Support Specialist","Per Billable Minute",0.91,null,0,null,0,{"$f":"+'Final Recon - Summary'!$H195-'Final Recon - Summary'!$F195","v":0}]
[{"$f":"$C$5","v":0},"Group - Physician Assistant","Per Billable Minute",1.99,null,0,null,0,{"$f":"+'Final Recon - Summary'!$H196-'Final Recon - Summary'!$F196","v":0}]
[0,"Group - Psychologist/Pre-licensed Psychologist","Per Billable Minute",1.78,null,0,null,0,{"$f":"+'Final Recon - Summary'!$H197-'Final Recon - Summary'!$F197","v":0}]
[0,"Group - Psychiatrist/ Contracted Psychiatrist/Licensed Physician (MD)","Per Billable Minute",2.42,null,0,null,0,{"$f":"+'Final Recon - Summary'!$H198-'Final Recon - Summary'!$F198","v":0}]
[0,"Group - Registered Nurse (RN)","Per Billable Minute",1.7999999999999998,null,0,null,0,{"$f":"+'Final Recon - Summary'!$H199-'Final Recon - Summary'!$F199","v":0}]
[0,"Group - Registered Pharmacist","Per Billable Minute",2.12,null,0,null,0,{"$f":"+'Final Recon - Summary'!$H200-'Final Recon - Summary'!$F200","v":0}]
[0,"Group - Interpreter Services","Per Billable Minute",0.34,null,0,null,0,{"$f":"+'Final Recon - Summary'!$H201-'Final Recon - Summary'!$F201","v":0}]
[0,"Total",null,null,null,{"$f":"SUM(F169:F201)","v":0},{"$f":"SUM(G169:G201)","v":0},{"$f":"SUM(H169:H201)","v":0},{"$f":"SUM(I169:I201)","v":0}]
[]
[]
[null,"Certification of Exclusion and Debarment (Article 4) & Funding Attestation"]
[null,"I certify, under penalty of perjury under the laws of the State of California, that the deliverables and/or services invoiced were delivered and/or performed specifically for this Agreement in accordance with and compliance to all terms and conditions set forth therein.\n "]
[]
[null,"Contractor Authorized Signature ",null,null,"Print Name & Title",null,null,"Date"]
[]
[]
[null,"PREPARER'S NAME",null,null,"PHONE NUMBER"]
[]
["BEHAVIORAL HEALTH SERVICES"]
["Fical Year-End Units Reconciliation"]
[]
[null,"Contractor:",{"$f":"C163","v":0},null,null,null,"Fiscal Year:",{"$f":"H163","v":0}]
[null,"Contract #:",{"$f":"C164","v":0},null,null,null,"TUOS Run Date:",{"$f":"H164","v":"00:00:00"}]
[null,"Program Name:",{"$f":"'[4]MH & SUD INVOICE (Sch I)'!C452","v":"Program 5"}]
[null,"Rate Category:","MH Outpatient - Positive 7.5% Modifer (Exc Interpreter, MD, IC) "]
[]
["Column1","Service Modalities","Unit","Rate","Final Invoice YTD Units","Final Invoice YTD Amount","Final TUOS Units Reconciliation","Final Amount Reconciliation","Amount Due to Provider / (Amount Due to County)"]
[{"$f":"$C$5","v":0},{"$f":"_xlfn.XLOOKUP(C219,Sheet4!A1:M1,Sheet4!A2:M34,0)","v":"Individual - Clinical Nurse Specialist"},{"$f":"_xlfn.XLOOKUP(C219,Sheet4!A40:M40,Sheet4!A41:M73,0)","v":"Per Billable Minute"},{"$f":"_xlfn.XLOOKUP(C219,Sheet4!A79:M79,Sheet4!A80:M112,0)","v":9.92},null,{"$f":"+D222*E222","v":0},null,{"$f":"+D222*G222","v":0},{"$f":"+'Final Recon - Summary'!$H222-'Final Recon - Summary'!$F222","v":0}]
[{"$f":"$C$5","v":0},"Individual - Licensed Psychiatric Technician","Per Billable Minute",3.65,null,{"$f":"+D223*E223","v":0},null,{"$f":"+D223*G223","v":0},{"$f":"+'Final Recon - Summary'!$H223-'Final Recon - Summary'!$F223","v":0}]
[0,"Individual - LPHA (MFT  LCSW  LPCC)/Intern or Waivered LPHA (MFT  LCSW  LPCC)","Per Billable Minute",5.1899999999999995,null,0,null,0,{"$f":"+'Final Recon - Summary'!$H224-'Final Recon - Summary'!$F224","v":0}]
[0,"Individual - Licensed Vocational Nurse (LVN)","Per Billable Minute",4.26,null,0,null,0,{"$f":"+'Final Recon - Summary'!$H225-'Final Recon - Summary'!$F225","v":0}]
[0,"Individual - Medical Assistant","Per Billable Minute",2.93,null,0,null,0,{"$f":"+'Final Recon - Summary'!$H226-'Final Recon - Summary'!$F226","v":0}]
[0,"Individual - Mental Health Rehabilitation Specialist","Per Billable Minute",3.92,null,0,null,0,{"$f":"+'Final Recon - Summary'!$H227-'Final Recon - Summary'!$F227","v":0}]
[0,"Individual - Nurse Practitioner","Per Billable Minute",9.92,null,0,null,0,{"$f":"+'Final Recon - Summary'!$H228-'Final Recon - Summary'!$F228","v":0}]
[0,"Individual - Occupational Therapist","Per Billable Minute",6.92,null,0,null,0,{"$f":"+'Final Recon - Summary'!$H229-'Final Recon - Summary'!$F229","v":0}]
[0,"Individual - Other Qualified Providers - Other Designated MH staff that bill medical","Per Billable Minute",3.92,null,0,null,0,{"$f":"+'Final Recon - Summary'!$H230-'Final Recon - Summary'!$F230","v":0}]
[0,"Individual - Peer Support Specialist","Per Billable Minute",4.0999999999999996,null,0,null,0,{"$f":"+'Final Recon - Summary'!$H231-'Final Recon - Summary'!$F231","v":0}]
[0,"Individual - Physician Assistant","Per Billable Minute",8.9500000000000011,null,0,null,0,{"$f":"+'Final Recon - Summary'!$H232-'Final Recon - Summary'!$F232","v":0}]
[0,"Individual - Psychologist/Pre-licensed Psychologist","Per Billable Minute",8.0299999999999994,null,0,null,0,{"$f":"+'Final Recon - Summary'!$H233-'Final Recon - Summary'!$F233","v":0}]
[0,"Individual - Psychiatrist/ Contracted Psychiatrist/Licensed Physician (MD)","Per Billable Minute",10.89,null,0,null,0,{"$f":"+'Final Recon - Summary'!$H234-'Final Recon - Summary'!$F234","v":0}]
[0,"Individual - Registered Nurse (RN)","Per Billable Minute",8.11,null,0,null,0,{"$f":"+'Final Recon - Summary'!$H235-'Final Recon - Summary'!$F235","v":0}]
[0,"Individual - Registered Pharmacist","Per Billable Minute",9.5599999999999987,null,0,null,0,{"$f":"+'Final Recon - Summary'!$H236-'Final Recon - Summary'!$F236","v":0}]
[0,"Individual - Interpreter Services","Per Billable Minute",1.55,null,0,null,0,{"$f":"+'Final Recon - Summary'!$H237-'Final Recon - Summary'!$F237","v":0}]
[0,"Interactive Complexity","Per Encounter",13.74,null,0,null,0,{"$f":"+'Final Recon - Summary'!$H238-'Final Recon - Summary'!$F238","v":0}]
[0,"Group - Clinical Nurse Specialist","Per Billable Minute",2.21,null,0,null,0,{"$f":"+'Final Recon - Summary'!$H239-'Final Recon - Summary'!$F239","v":0}]
[0,"Group - Licensed Psychiatric Technician","Per Billable Minute",0.81,null,0,null,0,{"$f":"+'Final Recon - Summary'!$H240-'Final Recon - Summary'!$F240","v":0}]
[0,"Group - LPHA (MFT  LCSW  LPCC)/Intern or Waivered LPHA (MFT  LCSW  LPCC)","Per Billable Minute",1.1500000000000001,null,0,null,0,{"$f":"+'Final Recon - Summary'!$H241-'Final Recon - Summary'!$F241","v":0}]
[0,"Group - Licensed Vocational Nurse (LVN)","Per Billable Minute",0.95,null,0,null,0,{"$f":"+'Final Recon - Summary'!$H242-'Final Recon - Summary'!$F242","v":0}]
[{"$f":"$C$5","v":0},"Group - Medical Assistant","Per Billable Minute",0.64999999999999991,null,0,null,0,{"$f":"+'Final Recon - Summary'!$H243-'Final Recon - Summary'!$F243","v":0}]
[0,"Group - Mental Health Rehabilitation Specialist","Per Billable Minute",0.87,null,0,null,0,{"$f":"+'Final Recon - Summary'!$H244-'Final Recon - Summary'!$F244","v":0}]
[{"$f":"$C$5","v":0},"Group - Nurse Practitioner","Per Billable Minute",2.21,null,0,null,0,{"$f":"+'Final Recon - Summary'!$H245-'Final Recon - Summary'!$F245","v":0}]
[{"$f":"$C$5","v":0},"Group - Occupational Therapist","Per Billable Minute",1.54,null,0,null,0,{"$f":"+'Final Recon - Summary'!$H246-'Final Recon - Summary'!$F246","v":0}]
[{"$f":"$C$5","v":0},"Group - Other Qualified Providers - Other Designated MH staff that bill medical","Per Billable Minute",0.87,null,0,null,0,{"$f":"+'Final Recon - Summary'!$H247-'Final Recon - Summary'!$F247","v":0}]
[{"$f":"$C$5","v":0},"Group - Peer Support Specialist","Per Billable Minute",0.91,null,0,null,0,{"$f":"+'Final Recon - Summary'!$H248-'Final Recon - Summary'!$F248","v":0}]
[{"$f":"$C$5","v":0},"Group - Physician Assistant","Per Billable Minute",1.99,null,0,null,0,{"$f":"+'Final Recon - Summary'!$H249-'Final Recon - Summary'!$F249","v":0}]
[0,"Group - Psychologist/Pre-licensed Psychologist","Per Billable Minute",1.78,null,0,null,0,{"$f":"+'Final Recon - Summary'!$H250-'Final Recon - Summary'!$F250","v":0}]
[0,"Group - Psychiatrist/ Contracted Psychiatrist/Licensed Physician (MD)","Per Billable Minute",2.42,null,0,null,0,{"$f":"+'Final Recon - Summary'!$H251-'Final Recon - Summary'!$F251","v":0}]
[0,"Group - Registered Nurse (RN)","Per Billable Minute",1.7999999999999998,null,0,null,0,{"$f":"+'Final Recon - Summary'!$H252-'Final Recon - Summary'!$F252","v":0}]
[0,"Group - Registered Pharmacist","Per Billable Minute",2.12,null,0,null,0,{"$f":"+'Final Recon - Summary'!$H253-'Final Recon - Summary'!$F253","v":0}]
[0,"Group - Interpreter Services","Per Billable Minute",0.34,null,0,null,0,{"$f":"+'Final Recon - Summary'!$H254-'Final Recon - Summary'!$F254","v":0}]
[0,"Total",null,null,null,{"$f":"SUM(F222:F254)","v":0},{"$f":"SUM(G222:G254)","v":0},{"$f":"SUM(H222:H254)","v":0},{"$f":"SUM(I222:I254)","v":0}]
[]
[]
[null,"Certification of Exclusion and Debarment (Article 4) & Funding Attestation"]
[null,"I certify, under penalty of perjury under the laws of the State of California, that the deliverables and/or services invoiced were delivered and/or performed specifically for this Agreement in accordance with and compliance to all terms and conditions set forth therein.\n "]
[]
[null,"Contractor Authorized Signature ",null,null,"Print Name & Title",null,null,"Date"]
[]
[]
[null,"PREPARER'S NAME",null,null,"PHONE NUMBER"]
[]
["BEHAVIORAL HEALTH SERVICES"]
["Fical Year-End Units Reconciliation"]
[]
[null,"Contractor:",{"$f":"C216","v":0},null,null,null,"Fiscal Year:",{"$f":"H216","v":0}]
[null,"Contract #:",{"$f":"C217","v":0},null,null,null,"TUOS Run Date:",{"$f":"H217","v":"00:00:00"}]
[null,"Program Name:",{"$f":"'[4]MH & SUD INVOICE (Sch I)'!C563","v":"Program 6"}]
[null,"Rate Category:","MH Outpatient - Positive 7.5% Modifer (Exc Interpreter, MD, IC) "]
[]
["Column1","Service Modalities","Unit","Rate","Final Invoice YTD Units","Final Invoice YTD Amount","Final TUOS Units Reconciliation","Final Amount Reconciliation","Amount Due to Provider / (Amount Due to County)"]
[{"$f":"$C$5","v":0},{"$f":"_xlfn.XLOOKUP(C272,Sheet4!A1:M1,Sheet4!A2:M34,0)","v":"Individual - Clinical Nurse Specialist"},{"$f":"_xlfn.XLOOKUP(C272,Sheet4!A40:M40,Sheet4!A41:M73,0)","v":"Per Billable Minute"},{"$f":"_xlfn.XLOOKUP(C272,Sheet4!A79:M79,Sheet4!A80:M112,0)","v":9.92},null,{"$f":"+D275*E275","v":0},null,{"$f":"+D275*G275","v":0},{"$f":"+'Final Recon - Summary'!$H275-'Final Recon - Summary'!$F275","v":0}]
[{"$f":"$C$5","v":0},"Individual - Licensed Psychiatric Technician","Per Billable Minute",3.65,null,{"$f":"+D276*E276","v":0},null,{"$f":"+D276*G276","v":0},{"$f":"+'Final Recon - Summary'!$H276-'Final Recon - Summary'!$F276","v":0}]
[0,"Individual - LPHA (MFT  LCSW  LPCC)/Intern or Waivered LPHA (MFT  LCSW  LPCC)","Per Billable Minute",5.1899999999999995,null,0,null,0,{"$f":"+'Final Recon - Summary'!$H277-'Final Recon - Summary'!$F277","v":0}]
[0,"Individual - Licensed Vocational Nurse (LVN)","Per Billable Minute",4.26,null,0,null,0,{"$f":"+'Final Recon - Summary'!$H278-'Final Recon - Summary'!$F278","v":0}]
[0,"Individual - Medical Assistant","Per Billable Minute",2.93,null,0,null,0,{"$f":"+'Final Recon - Summary'!$H279-'Final Recon - Summary'!$F279","v":0}]
[0,"Individual - Mental Health Rehabilitation Specialist","Per Billable Minute",3.92,null,0,null,0,{"$f":"+'Final Recon - Summary'!$H280-'Final Recon - Summary'!$F280","v":0}]
[0,"Individual - Nurse Practitioner","Per Billable Minute",9.92,null,0,null,0,{"$f":"+'Final Recon - Summary'!$H281-'Final Recon - Summary'!$F281","v":0}]
[0,"Individual - Occupational Therapist","Per Billable Minute",6.92,null,0,null,0,{"$f":"+'Final Recon - Summary'!$H282-'Final Recon - Summary'!$F282","v":0}]
[0,"Individual - Other Qualified Providers - Other Designated MH staff that bill medical","Per Billable Minute",3.92,null,0,null,0,{"$f":"+'Final Recon - Summary'!$H283-'Final Recon - Summary'!$F283","v":0}]
[0,"Individual - Peer Support Specialist","Per Billable Minute",4.0999999999999996,null,0,null,0,{"$f":"+'Final Recon - Summary'!$H284-'Final Recon - Summary'!$F284","v":0}]
[0,"Individual - Physician Assistant","Per Billable Minute",8.9500000000000011,null,0,null,0,{"$f":"+'Final Recon - Summary'!$H285-'Final Recon - Summary'!$F285","v":0}]
[0,"Individual - Psychologist/Pre-licensed Psychologist","Per Billable Minute",8.0299999999999994,null,0,null,0,{"$f":"+'Final Recon - Summary'!$H286-'Final Recon - Summary'!$F286","v":0}]
[0,"Individual - Psychiatrist/ Contracted Psychiatrist/Licensed Physician (MD)","Per Billable Minute",10.89,null,0,null,0,{"$f":"+'Final Recon - Summary'!$H287-'Final Recon - Summary'!$F287","v":0}]
[0,"Individual - Registered Nurse (RN)","Per Billable Minute",8.11,null,0,null,0,{"$f":"+'Final Recon - Summary'!$H288-'Final Recon - Summary'!$F288","v":0}]
[0,"Individual - Registered Pharmacist","Per Billable Minute",9.5599999999999987,null,0,null,0,{"$f":"+'Final Recon - Summary'!$H289-'Final Recon - Summary'!$F289","v":0}]
[0,"Individual - Interpreter Services","Per Billable Minute",1.55,null,0,null,0,{"$f":"+'Final Recon - Summary'!$H290-'Final Recon - Summary'!$F290","v":0}]
[0,"Interactive Complexity","Per Encounter",13.74,null,0,null,0,{"$f":"+'Final Recon - Summary'!$H291-'Final Recon - Summary'!$F291","v":0}]
[0,"Group - Clinical Nurse Specialist","Per Billable Minute",2.21,null,0,null,0,{"$f":"+'Final Recon - Summary'!$H292-'Final Recon - Summary'!$F292","v":0}]
[0,"Group - Licensed Psychiatric Technician","Per Billable Minute",0.81,null,0,null,0,{"$f":"+'Final Recon - Summary'!$H293-'Final Recon - Summary'!$F293","v":0}]
[0,"Group - LPHA (MFT  LCSW  LPCC)/Intern or Waivered LPHA (MFT  LCSW  LPCC)","Per Billable Minute",1.1500000000000001,null,0,null,0,{"$f":"+'Final Recon - Summary'!$H294-'Final Recon - Summary'!$F294","v":0}]
[0,"Group - Licensed Vocational Nurse (LVN)","Per Billable Minute",0.95,null,0,null,0,{"$f":"+'Final Recon - Summary'!$H295-'Final Recon - Summary'!$F295","v":0}]
[{"$f":"$C$5","v":0},"Group - Medical Assistant","Per Billable Minute",0.64999999999999991,null,0,null,0,{"$f":"+'Final Recon - Summary'!$H296-'Final Recon - Summary'!$F296","v":0}]
[0,"Group - Mental Health Rehabilitation Specialist","Per Billable Minute",0.87,null,0,null,0,{"$f":"+'Final Recon - Summary'!$H297-'Final Recon - Summary'!$F297","v":0}]
[{"$f":"$C$5","v":0},"Group - Nurse Practitioner","Per Billable Minute",2.21,null,0,null,0,{"$f":"+'Final Recon - Summary'!$H298-'Final Recon - Summary'!$F298","v":0}]
[{"$f":"$C$5","v":0},"Group - Occupational Therapist","Per Billable Minute",1.54,null,0,null,0,{"$f":"+'Final Recon - Summary'!$H299-'Final Recon - Summary'!$F299","v":0}]
[{"$f":"$C$5","v":0},"Group - Other Qualified Providers - Other Designated MH staff that bill medical","Per Billable Minute",0.87,null,0,null,0,{"$f":"+'Final Recon - Summary'!$H300-'Final Recon - Summary'!$F300","v":0}]
[{"$f":"$C$5","v":0},"Group - Peer Support Specialist","Per Billable Minute",0.91,null,0,null,0,{"$f":"+'Final Recon - Summary'!$H301-'Final Recon - Summary'!$F301","v":0}]
[{"$f":"$C$5","v":0},"Group - Physician Assistant","Per Billable Minute",1.99,null,0,null,0,{"$f":"+'Final Recon - Summary'!$H302-'Final Recon - Summary'!$F302","v":0}]
[0,"Group - Psychologist/Pre-licensed Psychologist","Per Billable Minute",1.78,null,0,null,0,{"$f":"+'Final Recon - Summary'!$H303-'Final Recon - Summary'!$F303","v":0}]
[0,"Group - Psychiatrist/ Contracted Psychiatrist/Licensed Physician (MD)","Per Billable Minute",2.42,null,0,null,0,{"$f":"+'Final Recon - Summary'!$H304-'Final Recon - Summary'!$F304","v":0}]
[0,"Group - Registered Nurse (RN)","Per Billable Minute",1.7999999999999998,null,0,null,0,{"$f":"+'Final Recon - Summary'!$H305-'Final Recon - Summary'!$F305","v":0}]
[0,"Group - Registered Pharmacist","Per Billable Minute",2.12,null,0,null,0,{"$f":"+'Final Recon - Summary'!$H306-'Final Recon - Summary'!$F306","v":0}]
[0,"Group - Interpreter Services","Per Billable Minute",0.34,null,0,null,0,{"$f":"+'Final Recon - Summary'!$H307-'Final Recon - Summary'!$F307","v":0}]
[0,"Total",null,null,null,{"$f":"SUM(F275:F307)","v":0},{"$f":"SUM(G275:G307)","v":0},{"$f":"SUM(H275:H307)","v":0},{"$f":"SUM(I275:I307)","v":0}]
[]
[]
[null,"Certification of Exclusion and Debarment (Article 4) & Funding Attestation"]
[null,"I certify, under penalty of perjury under the laws of the State of California, that the deliverables and/or services invoiced were delivered and/or performed specifically for this Agreement in accordance with and compliance to all terms and conditions set forth therein.\n "]
[]
[null,"Contractor Authorized Signature ",null,null,"Print Name & Title",null,null,"Date"]
[]
[]
[null,"PREPARER'S NAME",null,null,"PHONE NUMBER"]
[]
["BEHAVIORAL HEALTH SERVICES"]
["Fical Year-End Units Reconciliation"]
[]
[null,"Contractor:",{"$f":"C269","v":0},null,null,null,"Fiscal Year:",{"$f":"H269","v":0}]
[null,"Contract #:",{"$f":"C270","v":0},null,null,null,"TUOS Run Date:",{"$f":"H270","v":"00:00:00"}]
[null,"Program Name:",{"$f":"'[4]MH & SUD INVOICE (Sch I)'!C675","v":"Program 7"}]
[null,"Rate Category:","MH Outpatient - Positive 7.5% Modifer (Exc Interpreter, MD, IC) "]
[]
["Column1","Service Modalities","Unit","Rate","Final Invoice YTD Units","Final Invoice YTD Amount","Final TUOS Units Reconciliation","Final Amount Reconciliation","Amount Due to Provider / (Amount Due to County)"]
[{"$f":"$C$5","v":0},{"$f":"_xlfn.XLOOKUP(C325,Sheet4!A1:M1,Sheet4!A2:M34,0)","v":"Individual - Clinical Nurse Specialist"},{"$f":"_xlfn.XLOOKUP(C325,Sheet4!A40:M40,Sheet4!A41:M73,0)","v":"Per Billable Minute"},{"$f":"_xlfn.XLOOKUP(C325,Sheet4!A79:M79,Sheet4!A80:M112,0)","v":9.92},null,{"$f":"+D328*E328","v":0},null,{"$f":"+D328*G328","v":0},{"$f":"+'Final Recon - Summary'!$H328-'Final Recon - Summary'!$F328","v":0}]
[{"$f":"$C$5","v":0},"Individual - Licensed Psychiatric Technician","Per Billable Minute",3.65,null,{"$f":"+D329*E329","v":0},null,{"$f":"+D329*G329","v":0},{"$f":"+'Final Recon - Summary'!$H329-'Final Recon - Summary'!$F329","v":0}]
[0,"Individual - LPHA (MFT  LCSW  LPCC)/Intern or Waivered LPHA (MFT  LCSW  LPCC)","Per Billable Minute",5.1899999999999995,null,0,null,0,{"$f":"+'Final Recon - Summary'!$H330-'Final Recon - Summary'!$F330","v":0}]
[0,"Individual - Licensed Vocational Nurse (LVN)","Per Billable Minute",4.26,null,0,null,0,{"$f":"+'Final Recon - Summary'!$H331-'Final Recon - Summary'!$F331","v":0}]
[0,"Individual - Medical Assistant","Per Billable Minute",2.93,null,0,null,0,{"$f":"+'Final Recon - Summary'!$H332-'Final Recon - Summary'!$F332","v":0}]
[0,"Individual - Mental Health Rehabilitation Specialist","Per Billable Minute",3.92,null,0,null,0,{"$f":"+'Final Recon - Summary'!$H333-'Final Recon - Summary'!$F333","v":0}]
[0,"Individual - Nurse Practitioner","Per Billable Minute",9.92,null,0,null,0,{"$f":"+'Final Recon - Summary'!$H334-'Final Recon - Summary'!$F334","v":0}]
[0,"Individual - Occupational Therapist","Per Billable Minute",6.92,null,0,null,0,{"$f":"+'Final Recon - Summary'!$H335-'Final Recon - Summary'!$F335","v":0}]
[0,"Individual - Other Qualified Providers - Other Designated MH staff that bill medical","Per Billable Minute",3.92,null,0,null,0,{"$f":"+'Final Recon - Summary'!$H336-'Final Recon - Summary'!$F336","v":0}]
[0,"Individual - Peer Support Specialist","Per Billable Minute",4.0999999999999996,null,0,null,0,{"$f":"+'Final Recon - Summary'!$H337-'Final Recon - Summary'!$F337","v":0}]
[0,"Individual - Physician Assistant","Per Billable Minute",8.9500000000000011,null,0,null,0,{"$f":"+'Final Recon - Summary'!$H338-'Final Recon - Summary'!$F338","v":0}]
[0,"Individual - Psychologist/Pre-licensed Psychologist","Per Billable Minute",8.0299999999999994,null,0,null,0,{"$f":"+'Final Recon - Summary'!$H339-'Final Recon - Summary'!$F339","v":0}]
[0,"Individual - Psychiatrist/ Contracted Psychiatrist/Licensed Physician (MD)","Per Billable Minute",10.89,null,0,null,0,{"$f":"+'Final Recon - Summary'!$H340-'Final Recon - Summary'!$F340","v":0}]
[0,"Individual - Registered Nurse (RN)","Per Billable Minute",8.11,null,0,null,0,{"$f":"+'Final Recon - Summary'!$H341-'Final Recon - Summary'!$F341","v":0}]
[0,"Individual - Registered Pharmacist","Per Billable Minute",9.5599999999999987,null,0,null,0,{"$f":"+'Final Recon - Summary'!$H342-'Final Recon - Summary'!$F342","v":0}]
[0,"Individual - Interpreter Services","Per Billable Minute",1.55,null,0,null,0,{"$f":"+'Final Recon - Summary'!$H343-'Final Recon - Summary'!$F343","v":0}]
[0,"Interactive Complexity","Per Encounter",13.74,null,0,null,0,{"$f":"+'Final Recon - Summary'!$H344-'Final Recon - Summary'!$F344","v":0}]
[0,"Group - Clinical Nurse Specialist","Per Billable Minute",2.21,null,0,null,0,{"$f":"+'Final Recon - Summary'!$H345-'Final Recon - Summary'!$F345","v":0}]
[0,"Group - Licensed Psychiatric Technician","Per Billable Minute",0.81,null,0,null,0,{"$f":"+'Final Recon - Summary'!$H346-'Final Recon - Summary'!$F346","v":0}]
[0,"Group - LPHA (MFT  LCSW  LPCC)/Intern or Waivered LPHA (MFT  LCSW  LPCC)","Per Billable Minute",1.1500000000000001,null,0,null,0,{"$f":"+'Final Recon - Summary'!$H347-'Final Recon - Summary'!$F347","v":0}]
[0,"Group - Licensed Vocational Nurse (LVN)","Per Billable Minute",0.95,null,0,null,0,{"$f":"+'Final Recon - Summary'!$H348-'Final Recon - Summary'!$F348","v":0}]
[{"$f":"$C$5","v":0},"Group - Medical Assistant","Per Billable Minute",0.64999999999999991,null,0,null,0,{"$f":"+'Final Recon - Summary'!$H349-'Final Recon - Summary'!$F349","v":0}]
[0,"Group - Mental Health Rehabilitation Specialist","Per Billable Minute",0.87,null,0,null,0,{"$f":"+'Final Recon - Summary'!$H350-'Final Recon - Summary'!$F350","v":0}]
[{"$f":"$C$5","v":0},"Group - Nurse Practitioner","Per Billable Minute",2.21,null,0,null,0,{"$f":"+'Final Recon - Summary'!$H351-'Final Recon - Summary'!$F351","v":0}]
[{"$f":"$C$5","v":0},"Group - Occupational Therapist","Per Billable Minute",1.54,null,0,null,0,{"$f":"+'Final Recon - Summary'!$H352-'Final Recon - Summary'!$F352","v":0}]
[{"$f":"$C$5","v":0},"Group - Other Qualified Providers - Other Designated MH staff that bill medical","Per Billable Minute",0.87,null,0,null,0,{"$f":"+'Final Recon - Summary'!$H353-'Final Recon - Summary'!$F353","v":0}]
[{"$f":"$C$5","v":0},"Group - Peer Support Specialist","Per Billable Minute",0.91,null,0,null,0,{"$f":"+'Final Recon - Summary'!$H354-'Final Recon - Summary'!$F354","v":0}]
[{"$f":"$C$5","v":0},"Group - Physician Assistant","Per Billable Minute",1.99,null,0,null,0,{"$f":"+'Final Recon - Summary'!$H355-'Final Recon - Summary'!$F355","v":0}]
[0,"Group - Psychologist/Pre-licensed Psychologist","Per Billable Minute",1.78,null,0,null,0,{"$f":"+'Final Recon - Summary'!$H356-'Final Recon - Summary'!$F356","v":0}]
[0,"Group - Psychiatrist/ Contracted Psychiatrist/Licensed Physician (MD)","Per Billable Minute",2.42,null,0,null,0,{"$f":"+'Final Recon - Summary'!$H357-'Final Recon - Summary'!$F357","v":0}]
[0,"Group - Registered Nurse (RN)","Per Billable Minute",1.7999999999999998,null,0,null,0,{"$f":"+'Final Recon - Summary'!$H358-'Final Recon - Summary'!$F358","v":0}]
[0,"Group - Registered Pharmacist","Per Billable Minute",2.12,null,0,null,0,{"$f":"+'Final Recon - Summary'!$H359-'Final Recon - Summary'!$F359","v":0}]
[0,"Group - Interpreter Services","Per Billable Minute",0.34,null,0,null,0,{"$f":"+'Final Recon - Summary'!$H360-'Final Recon - Summary'!$F360","v":0}]
[0,"Total",null,null,null,{"$f":"SUM(F328:F360)","v":0},{"$f":"SUM(G328:G360)","v":0},{"$f":"SUM(H328:H360)","v":0},{"$f":"SUM(I328:I360)","v":0}]
[]
[]
[null,"Certification of Exclusion and Debarment (Article 4) & Funding Attestation"]
[null,"I certify, under penalty of perjury under the laws of the State of California, that the deliverables and/or services invoiced were delivered and/or performed specifically for this Agreement in accordance with and compliance to all terms and conditions set forth therein.\n "]
[]
[null,"Contractor Authorized Signature ",null,null,"Print Name & Title",null,null,"Date"]
[]
[]
[null,"PREPARER'S NAME",null,null,"PHONE NUMBER"]
[]
["BEHAVIORAL HEALTH SERVICES"]
["Fical Year-End Units Reconciliation"]
[]
[null,"Contractor:",{"$f":"C322","v":0},null,null,null,"Fiscal Year:",{"$f":"H322","v":0}]
[null,"Contract #:",{"$f":"C323","v":0},null,null,null,"TUOS Run Date:",{"$f":"H323","v":"00:00:00"}]
[null,"Program Name:",{"$f":"'[4]MH & SUD INVOICE (Sch I)'!C786","v":"Program 8"}]
[null,"Rate Category:","MH Outpatient - Positive 7.5% Modifer (Exc Interpreter, MD, IC) "]
[]
["Column1","Service Modalities","Unit","Rate","Final Invoice YTD Units","Final Invoice YTD Amount","Final TUOS Units Reconciliation","Final Amount Reconciliation","Amount Due to Provider / (Amount Due to County)"]
[{"$f":"$C$5","v":0},{"$f":"_xlfn.XLOOKUP(C378,Sheet4!A1:M1,Sheet4!A2:M34,0)","v":"Individual - Clinical Nurse Specialist"},{"$f":"_xlfn.XLOOKUP(C378,Sheet4!A40:M40,Sheet4!A41:M73,0)","v":"Per Billable Minute"},{"$f":"_xlfn.XLOOKUP(C378,Sheet4!A79:M79,Sheet4!A80:M112,0)","v":9.92},null,{"$f":"+D381*E381","v":0},null,{"$f":"+D381*G381","v":0},{"$f":"+'Final Recon - Summary'!$H381-'Final Recon - Summary'!$F381","v":0}]
[{"$f":"$C$5","v":0},"Individual - Licensed Psychiatric Technician","Per Billable Minute",3.65,null,{"$f":"+D382*E382","v":0},null,{"$f":"+D382*G382","v":0},{"$f":"+'Final Recon - Summary'!$H382-'Final Recon - Summary'!$F382","v":0}]
[0,"Individual - LPHA (MFT  LCSW  LPCC)/Intern or Waivered LPHA (MFT  LCSW  LPCC)","Per Billable Minute",5.1899999999999995,null,0,null,0,{"$f":"+'Final Recon - Summary'!$H383-'Final Recon - Summary'!$F383","v":0}]
[0,"Individual - Licensed Vocational Nurse (LVN)","Per Billable Minute",4.26,null,0,null,0,{"$f":"+'Final Recon - Summary'!$H384-'Final Recon - Summary'!$F384","v":0}]
[0,"Individual - Medical Assistant","Per Billable Minute",2.93,null,0,null,0,{"$f":"+'Final Recon - Summary'!$H385-'Final Recon - Summary'!$F385","v":0}]
[0,"Individual - Mental Health Rehabilitation Specialist","Per Billable Minute",3.92,null,0,null,0,{"$f":"+'Final Recon - Summary'!$H386-'Final Recon - Summary'!$F386","v":0}]
[0,"Individual - Nurse Practitioner","Per Billable Minute",9.92,null,0,null,0,{"$f":"+'Final Recon - Summary'!$H387-'Final Recon - Summary'!$F387","v":0}]
[0,"Individual - Occupational Therapist","Per Billable Minute",6.92,null,0,null,0,{"$f":"+'Final Recon - Summary'!$H388-'Final Recon - Summary'!$F388","v":0}]
[0,"Individual - Other Qualified Providers - Other Designated MH staff that bill medical","Per Billable Minute",3.92,null,0,null,0,{"$f":"+'Final Recon - Summary'!$H389-'Final Recon - Summary'!$F389","v":0}]
[0,"Individual - Peer Support Specialist","Per Billable Minute",4.0999999999999996,null,0,null,0,{"$f":"+'Final Recon - Summary'!$H390-'Final Recon - Summary'!$F390","v":0}]
[0,"Individual - Physician Assistant","Per Billable Minute",8.9500000000000011,null,0,null,0,{"$f":"+'Final Recon - Summary'!$H391-'Final Recon - Summary'!$F391","v":0}]
[0,"Individual - Psychologist/Pre-licensed Psychologist","Per Billable Minute",8.0299999999999994,null,0,null,0,{"$f":"+'Final Recon - Summary'!$H392-'Final Recon - Summary'!$F392","v":0}]
[0,"Individual - Psychiatrist/ Contracted Psychiatrist/Licensed Physician (MD)","Per Billable Minute",10.89,null,0,null,0,{"$f":"+'Final Recon - Summary'!$H393-'Final Recon - Summary'!$F393","v":0}]
[0,"Individual - Registered Nurse (RN)","Per Billable Minute",8.11,null,0,null,0,{"$f":"+'Final Recon - Summary'!$H394-'Final Recon - Summary'!$F394","v":0}]
[0,"Individual - Registered Pharmacist","Per Billable Minute",9.5599999999999987,null,0,null,0,{"$f":"+'Final Recon - Summary'!$H395-'Final Recon - Summary'!$F395","v":0}]
[0,"Individual - Interpreter Services","Per Billable Minute",1.55,null,0,null,0,{"$f":"+'Final Recon - Summary'!$H396-'Final Recon - Summary'!$F396","v":0}]
[0,"Interactive Complexity","Per Encounter",13.74,null,0,null,0,{"$f":"+'Final Recon - Summary'!$H397-'Final Recon - Summary'!$F397","v":0}]
[0,"Group - Clinical Nurse Specialist","Per Billable Minute",2.21,null,0,null,0,{"$f":"+'Final Recon - Summary'!$H398-'Final Recon - Summary'!$F398","v":0}]
[0,"Group - Licensed Psychiatric Technician","Per Billable Minute",0.81,null,0,null,0,{"$f":"+'Final Recon - Summary'!$H399-'Final Recon - Summary'!$F399","v":0}]
[0,"Group - LPHA (MFT  LCSW  LPCC)/Intern or Waivered LPHA (MFT  LCSW  LPCC)","Per Billable Minute",1.1500000000000001,null,0,null,0,{"$f":"+'Final Recon - Summary'!$H400-'Final Recon - Summary'!$F400","v":0}]
[0,"Group - Licensed Vocational Nurse (LVN)","Per Billable Minute",0.95,null,0,null,0,{"$f":"+'Final Recon - Summary'!$H401-'Final Recon - Summary'!$F401","v":0}]
[{"$f":"$C$5","v":0},"Group - Medical Assistant","Per Billable Minute",0.64999999999999991,null,0,null,0,{"$f":"+'Final Recon - Summary'!$H402-'Final Recon - Summary'!$F402","v":0}]
[0,"Group - Mental Health Rehabilitation Specialist","Per Billable Minute",0.87,null,0,null,0,{"$f":"+'Final Recon - Summary'!$H403-'Final Recon - Summary'!$F403","v":0}]
[{"$f":"$C$5","v":0},"Group - Nurse Practitioner","Per Billable Minute",2.21,null,0,null,0,{"$f":"+'Final Recon - Summary'!$H404-'Final Recon - Summary'!$F404","v":0}]
[{"$f":"$C$5","v":0},"Group - Occupational Therapist","Per Billable Minute",1.54,null,0,null,0,{"$f":"+'Final Recon - Summary'!$H405-'Final Recon - Summary'!$F405","v":0}]
[{"$f":"$C$5","v":0},"Group - Other Qualified Providers - Other Designated MH staff that bill medical","Per Billable Minute",0.87,null,0,null,0,{"$f":"+'Final Recon - Summary'!$H406-'Final Recon - Summary'!$F406","v":0}]
[{"$f":"$C$5","v":0},"Group - Peer Support Specialist","Per Billable Minute",0.91,null,0,null,0,{"$f":"+'Final Recon - Summary'!$H407-'Final Recon - Summary'!$F407","v":0}]
[{"$f":"$C$5","v":0},"Group - Physician Assistant","Per Billable Minute",1.99,null,0,null,0,{"$f":"+'Final Recon - Summary'!$H408-'Final Recon - Summary'!$F408","v":0}]
[0,"Group - Psychologist/Pre-licensed Psychologist","Per Billable Minute",1.78,null,0,null,0,{"$f":"+'Final Recon - Summary'!$H409-'Final Recon - Summary'!$F409","v":0}]
[0,"Group - Psychiatrist/ Contracted Psychiatrist/Licensed Physician (MD)","Per Billable Minute",2.42,null,0,null,0,{"$f":"+'Final Recon - Summary'!$H410-'Final Recon - Summary'!$F410","v":0}]
[0,"Group - Registered Nurse (RN)","Per Billable Minute",1.7999999999999998,null,0,null,0,{"$f":"+'Final Recon - Summary'!$H411-'Final Recon - Summary'!$F411","v":0}]
[0,"Group - Registered Pharmacist","Per Billable Minute",2.12,null,0,null,0,{"$f":"+'Final Recon - Summary'!$H412-'Final Recon - Summary'!$F412","v":0}]
[0,"Group - Interpreter Services","Per Billable Minute",0.34,null,0,null,0,{"$f":"+'Final Recon - Summary'!$H413-'Final Recon - Summary'!$F413","v":0}]
[0,"Total",null,null,null,{"$f":"SUM(F381:F413)","v":0},{"$f":"SUM(G381:G413)","v":0},{"$f":"SUM(H381:H413)","v":0},{"$f":"SUM(I381:I413)","v":0}]
[]
[]
[null,"Certification of Exclusion and Debarment (Article 4) & Funding Attestation"]
[null,"I certify, under penalty of perjury under the laws of the State of California, that the deliverables and/or services invoiced were delivered and/or performed specifically for this Agreement in accordance with and compliance to all terms and conditions set forth therein.\n "]
[]
[null,"Contractor Authorized Signature ",null,null,"Print Name & Title",null,null,"Date"]
[]
[]
[null,"PREPARER'S NAME",null,null,"PHONE NUMBER"]
[]
["BEHAVIORAL HEALTH SERVICES"]
["Fical Year-End Units Reconciliation"]
[]
[null,"Contractor:",{"$f":"C375","v":0},null,null,null,"Fiscal Year:",{"$f":"H375","v":0}]
[null,"Contract #:",{"$f":"C376","v":0},null,null,null,"TUOS Run Date:",{"$f":"H376","v":"00:00:00"}]
[null,"Program Name:",{"$f":"'[4]MH & SUD INVOICE (Sch I)'!C897","v":"Program 9"}]
[null,"Rate Category:","MH Outpatient - Positive 7.5% Modifer (Exc Interpreter, MD, IC) "]
[]
["Column1","Service Modalities","Unit","Rate","Final Invoice YTD Units","Final Invoice YTD Amount","Final TUOS Units Reconciliation","Final Amount Reconciliation","Amount Due to Provider / (Amount Due to County)"]
[{"$f":"$C$5","v":0},{"$f":"_xlfn.XLOOKUP(C431,Sheet4!A1:M1,Sheet4!A2:M34,0)","v":"Individual - Clinical Nurse Specialist"},{"$f":"_xlfn.XLOOKUP(C431,Sheet4!A40:M40,Sheet4!A41:M73,0)","v":"Per Billable Minute"},{"$f":"_xlfn.XLOOKUP(C431,Sheet4!A79:M79,Sheet4!A80:M112,0)","v":9.92},null,{"$f":"+D434*E434","v":0},null,{"$f":"+D434*G434","v":0},{"$f":"+'Final Recon - Summary'!$H434-'Final Recon - Summary'!$F434","v":0}]
[{"$f":"$C$5","v":0},"Individual - Licensed Psychiatric Technician","Per Billable Minute",3.65,null,{"$f":"+D435*E435","v":0},null,{"$f":"+D435*G435","v":0},{"$f":"+'Final Recon - Summary'!$H435-'Final Recon - Summary'!$F435","v":0}]
[0,"Individual - LPHA (MFT  LCSW  LPCC)/Intern or Waivered LPHA (MFT  LCSW  LPCC)","Per Billable Minute",5.1899999999999995,null,0,null,0,{"$f":"+'Final Recon - Summary'!$H436-'Final Recon - Summary'!$F436","v":0}]
[0,"Individual - Licensed Vocational Nurse (LVN)","Per Billable Minute",4.26,null,0,null,0,{"$f":"+'Final Recon - Summary'!$H437-'Final Recon - Summary'!$F437","v":0}]
[0,"Individual - Medical Assistant","Per Billable Minute",2.93,null,0,null,0,{"$f":"+'Final Recon - Summary'!$H438-'Final Recon - Summary'!$F438","v":0}]
[0,"Individual - Mental Health Rehabilitation Specialist","Per Billable Minute",3.92,null,0,null,0,{"$f":"+'Final Recon - Summary'!$H439-'Final Recon - Summary'!$F439","v":0}]
[0,"Individual - Nurse Practitioner","Per Billable Minute",9.92,null,0,null,0,{"$f":"+'Final Recon - Summary'!$H440-'Final Recon - Summary'!$F440","v":0}]
[0,"Individual - Occupational Therapist","Per Billable Minute",6.92,null,0,null,0,{"$f":"+'Final Recon - Summary'!$H441-'Final Recon - Summary'!$F441","v":0}]
[0,"Individual - Other Qualified Providers - Other Designated MH staff that bill medical","Per Billable Minute",3.92,null,0,null,0,{"$f":"+'Final Recon - Summary'!$H442-'Final Recon - Summary'!$F442","v":0}]
[0,"Individual - Peer Support Specialist","Per Billable Minute",4.0999999999999996,null,0,null,0,{"$f":"+'Final Recon - Summary'!$H443-'Final Recon - Summary'!$F443","v":0}]
[0,"Individual - Physician Assistant","Per Billable Minute",8.9500000000000011,null,0,null,0,{"$f":"+'Final Recon - Summary'!$H444-'Final Recon - Summary'!$F444","v":0}]
[0,"Individual - Psychologist/Pre-licensed Psychologist","Per Billable Minute",8.0299999999999994,null,0,null,0,{"$f":"+'Final Recon - Summary'!$H445-'Final Recon - Summary'!$F445","v":0}]
[0,"Individual - Psychiatrist/ Contracted Psychiatrist/Licensed Physician (MD)","Per Billable Minute",10.89,null,0,null,0,{"$f":"+'Final Recon - Summary'!$H446-'Final Recon - Summary'!$F446","v":0}]
[0,"Individual - Registered Nurse (RN)","Per Billable Minute",8.11,null,0,null,0,{"$f":"+'Final Recon - Summary'!$H447-'Final Recon - Summary'!$F447","v":0}]
[0,"Individual - Registered Pharmacist","Per Billable Minute",9.5599999999999987,null,0,null,0,{"$f":"+'Final Recon - Summary'!$H448-'Final Recon - Summary'!$F448","v":0}]
[0,"Individual - Interpreter Services","Per Billable Minute",1.55,null,0,null,0,{"$f":"+'Final Recon - Summary'!$H449-'Final Recon - Summary'!$F449","v":0}]
[0,"Interactive Complexity","Per Encounter",13.74,null,0,null,0,{"$f":"+'Final Recon - Summary'!$H450-'Final Recon - Summary'!$F450","v":0}]
[0,"Group - Clinical Nurse Specialist","Per Billable Minute",2.21,null,0,null,0,{"$f":"+'Final Recon - Summary'!$H451-'Final Recon - Summary'!$F451","v":0}]
[0,"Group - Licensed Psychiatric Technician","Per Billable Minute",0.81,null,0,null,0,{"$f":"+'Final Recon - Summary'!$H452-'Final Recon - Summary'!$F452","v":0}]
[0,"Group - LPHA (MFT  LCSW  LPCC)/Intern or Waivered LPHA (MFT  LCSW  LPCC)","Per Billable Minute",1.1500000000000001,null,0,null,0,{"$f":"+'Final Recon - Summary'!$H453-'Final Recon - Summary'!$F453","v":0}]
[0,"Group - Licensed Vocational Nurse (LVN)","Per Billable Minute",0.95,null,0,null,0,{"$f":"+'Final Recon - Summary'!$H454-'Final Recon - Summary'!$F454","v":0}]
[{"$f":"$C$5","v":0},"Group - Medical Assistant","Per Billable Minute",0.64999999999999991,null,0,null,0,{"$f":"+'Final Recon - Summary'!$H455-'Final Recon - Summary'!$F455","v":0}]
[0,"Group - Mental Health Rehabilitation Specialist","Per Billable Minute",0.87,null,0,null,0,{"$f":"+'Final Recon - Summary'!$H456-'Final Recon - Summary'!$F456","v":0}]
[{"$f":"$C$5","v":0},"Group - Nurse Practitioner","Per Billable Minute",2.21,null,0,null,0,{"$f":"+'Final Recon - Summary'!$H457-'Final Recon - Summary'!$F457","v":0}]
[{"$f":"$C$5","v":0},"Group - Occupational Therapist","Per Billable Minute",1.54,null,0,null,0,{"$f":"+'Final Recon - Summary'!$H458-'Final Recon - Summary'!$F458","v":0}]
[{"$f":"$C$5","v":0},"Group - Other Qualified Providers - Other Designated MH staff that bill medical","Per Billable Minute",0.87,null,0,null,0,{"$f":"+'Final Recon - Summary'!$H459-'Final Recon - Summary'!$F459","v":0}]
[{"$f":"$C$5","v":0},"Group - Peer Support Specialist","Per Billable Minute",0.91,null,0,null,0,{"$f":"+'Final Recon - Summary'!$H460-'Final Recon - Summary'!$F460","v":0}]
[{"$f":"$C$5","v":0},"Group - Physician Assistant","Per Billable Minute",1.99,null,0,null,0,{"$f":"+'Final Recon - Summary'!$H461-'Final Recon - Summary'!$F461","v":0}]
[0,"Group - Psychologist/Pre-licensed Psychologist","Per Billable Minute",1.78,null,0,null,0,{"$f":"+'Final Recon - Summary'!$H462-'Final Recon - Summary'!$F462","v":0}]
[0,"Group - Psychiatrist/ Contracted Psychiatrist/Licensed Physician (MD)","Per Billable Minute",2.42,null,0,null,0,{"$f":"+'Final Recon - Summary'!$H463-'Final Recon - Summary'!$F463","v":0}]
[0,"Group - Registered Nurse (RN)","Per Billable Minute",1.7999999999999998,null,0,null,0,{"$f":"+'Final Recon - Summary'!$H464-'Final Recon - Summary'!$F464","v":0}]
[0,"Group - Registered Pharmacist","Per Billable Minute",2.12,null,0,null,0,{"$f":"+'Final Recon - Summary'!$H465-'Final Recon - Summary'!$F465","v":0}]
[0,"Group - Interpreter Services","Per Billable Minute",0.34,null,0,null,0,{"$f":"+'Final Recon - Summary'!$H466-'Final Recon - Summary'!$F466","v":0}]
[0,"Total",null,null,null,{"$f":"SUM(F434:F466)","v":0},{"$f":"SUM(G434:G466)","v":0},{"$f":"SUM(H434:H466)","v":0},{"$f":"SUM(I434:I466)","v":0}]
[]
[]
[null,"Certification of Exclusion and Debarment (Article 4) & Funding Attestation"]
[null,"I certify, under penalty of perjury under the laws of the State of California, that the deliverables and/or services invoiced were delivered and/or performed specifically for this Agreement in accordance with and compliance to all terms and conditions set forth therein.\n "]
[]
[null,"Contractor Authorized Signature ",null,null,"Print Name & Title",null,null,"Date"]
[]
[]
[null,"PREPARER'S NAME",null,null,"PHONE NUMBER"]
[]
["BEHAVIORAL HEALTH SERVICES"]
["Fical Year-End Units Reconciliation"]
[]
[null,"Contractor:",{"$f":"C428","v":0},null,null,null,"Fiscal Year:",{"$f":"H428","v":0}]
[null,"Contract #:",{"$f":"C429","v":0},null,null,null,"TUOS Run Date:",{"$f":"H429","v":"00:00:00"}]
[null,"Program Name:",{"$f":"'[4]MH & SUD INVOICE (Sch I)'!C1008","v":"Program 10"}]
[null,"Rate Category:","MH Outpatient - Positive 7.5% Modifer (Exc Interpreter, MD, IC) "]
[]
["Column1","Service Modalities","Unit","Rate","Final Invoice YTD Units","Final Invoice YTD Amount","Final TUOS Units Reconciliation","Final Amount Reconciliation","Amount Due to Provider / (Amount Due to County)"]
[{"$f":"$C$5","v":0},{"$f":"_xlfn.XLOOKUP(C484,Sheet4!A1:M1,Sheet4!A2:M34,0)","v":"Individual - Clinical Nurse Specialist"},{"$f":"_xlfn.XLOOKUP(C484,Sheet4!A40:M40,Sheet4!A41:M73,0)","v":"Per Billable Minute"},{"$f":"_xlfn.XLOOKUP(C484,Sheet4!A79:M79,Sheet4!A80:M112,0)","v":9.92},null,{"$f":"+D487*E487","v":0},null,{"$f":"+D487*G487","v":0},{"$f":"+'Final Recon - Summary'!$H487-'Final Recon - Summary'!$F487","v":0}]
[{"$f":"$C$5","v":0},"Individual - Licensed Psychiatric Technician","Per Billable Minute",3.65,null,{"$f":"+D488*E488","v":0},null,{"$f":"+D488*G488","v":0},{"$f":"+'Final Recon - Summary'!$H488-'Final Recon - Summary'!$F488","v":0}]
[0,"Individual - LPHA (MFT  LCSW  LPCC)/Intern or Waivered LPHA (MFT  LCSW  LPCC)","Per Billable Minute",5.1899999999999995,null,0,null,0,{"$f":"+'Final Recon - Summary'!$H489-'Final Recon - Summary'!$F489","v":0}]
[0,"Individual - Licensed Vocational Nurse (LVN)","Per Billable Minute",4.26,null,0,null,0,{"$f":"+'Final Recon - Summary'!$H490-'Final Recon - Summary'!$F490","v":0}]
[0,"Individual - Medical Assistant","Per Billable Minute",2.93,null,0,null,0,{"$f":"+'Final Recon - Summary'!$H491-'Final Recon - Summary'!$F491","v":0}]
[0,"Individual - Mental Health Rehabilitation Specialist","Per Billable Minute",3.92,null,0,null,0,{"$f":"+'Final Recon - Summary'!$H492-'Final Recon - Summary'!$F492","v":0}]
[0,"Individual - Nurse Practitioner","Per Billable Minute",9.92,null,0,null,0,{"$f":"+'Final Recon - Summary'!$H493-'Final Recon - Summary'!$F493","v":0}]
[0,"Individual - Occupational Therapist","Per Billable Minute",6.92,null,0,null,0,{"$f":"+'Final Recon - Summary'!$H494-'Final Recon - Summary'!$F494","v":0}]
[0,"Individual - Other Qualified Providers - Other Designated MH staff that bill medical","Per Billable Minute",3.92,null,0,null,0,{"$f":"+'Final Recon - Summary'!$H495-'Final Recon - Summary'!$F495","v":0}]
[0,"Individual - Peer Support Specialist","Per Billable Minute",4.0999999999999996,null,0,null,0,{"$f":"+'Final Recon - Summary'!$H496-'Final Recon - Summary'!$F496","v":0}]
[0,"Individual - Physician Assistant","Per Billable Minute",8.9500000000000011,null,0,null,0,{"$f":"+'Final Recon - Summary'!$H497-'Final Recon - Summary'!$F497","v":0}]
[0,"Individual - Psychologist/Pre-licensed Psychologist","Per Billable Minute",8.0299999999999994,null,0,null,0,{"$f":"+'Final Recon - Summary'!$H498-'Final Recon - Summary'!$F498","v":0}]
[0,"Individual - Psychiatrist/ Contracted Psychiatrist/Licensed Physician (MD)","Per Billable Minute",10.89,null,0,null,0,{"$f":"+'Final Recon - Summary'!$H499-'Final Recon - Summary'!$F499","v":0}]
[0,"Individual - Registered Nurse (RN)","Per Billable Minute",8.11,null,0,null,0,{"$f":"+'Final Recon - Summary'!$H500-'Final Recon - Summary'!$F500","v":0}]
[0,"Individual - Registered Pharmacist","Per Billable Minute",9.5599999999999987,null,0,null,0,{"$f":"+'Final Recon - Summary'!$H501-'Final Recon - Summary'!$F501","v":0}]
[0,"Individual - Interpreter Services","Per Billable Minute",1.55,null,0,null,0,{"$f":"+'Final Recon - Summary'!$H502-'Final Recon - Summary'!$F502","v":0}]
[0,"Interactive Complexity","Per Encounter",13.74,null,0,null,0,{"$f":"+'Final Recon - Summary'!$H503-'Final Recon - Summary'!$F503","v":0}]
[0,"Group - Clinical Nurse Specialist","Per Billable Minute",2.21,null,0,null,0,{"$f":"+'Final Recon - Summary'!$H504-'Final Recon - Summary'!$F504","v":0}]
[0,"Group - Licensed Psychiatric Technician","Per Billable Minute",0.81,null,0,null,0,{"$f":"+'Final Recon - Summary'!$H505-'Final Recon - Summary'!$F505","v":0}]
[0,"Group - LPHA (MFT  LCSW  LPCC)/Intern or Waivered LPHA (MFT  LCSW  LPCC)","Per Billable Minute",1.1500000000000001,null,0,null,0,{"$f":"+'Final Recon - Summary'!$H506-'Final Recon - Summary'!$F506","v":0}]
[0,"Group - Licensed Vocational Nurse (LVN)","Per Billable Minute",0.95,null,0,null,0,{"$f":"+'Final Recon - Summary'!$H507-'Final Recon - Summary'!$F507","v":0}]
[{"$f":"$C$5","v":0},"Group - Medical Assistant","Per Billable Minute",0.64999999999999991,null,0,null,0,{"$f":"+'Final Recon - Summary'!$H508-'Final Recon - Summary'!$F508","v":0}]
[0,"Group - Mental Health Rehabilitation Specialist","Per Billable Minute",0.87,null,0,null,0,{"$f":"+'Final Recon - Summary'!$H509-'Final Recon - Summary'!$F509","v":0}]
[{"$f":"$C$5","v":0},"Group - Nurse Practitioner","Per Billable Minute",2.21,null,0,null,0,{"$f":"+'Final Recon - Summary'!$H510-'Final Recon - Summary'!$F510","v":0}]
[{"$f":"$C$5","v":0},"Group - Occupational Therapist","Per Billable Minute",1.54,null,0,null,0,{"$f":"+'Final Recon - Summary'!$H511-'Final Recon - Summary'!$F511","v":0}]
[{"$f":"$C$5","v":0},"Group - Other Qualified Providers - Other Designated MH staff that bill medical","Per Billable Minute",0.87,null,0,null,0,{"$f":"+'Final Recon - Summary'!$H512-'Final Recon - Summary'!$F512","v":0}]
[{"$f":"$C$5","v":0},"Group - Peer Support Specialist","Per Billable Minute",0.91,null,0,null,0,{"$f":"+'Final Recon - Summary'!$H513-'Final Recon - Summary'!$F513","v":0}]
[{"$f":"$C$5","v":0},"Group - Physician Assistant","Per Billable Minute",1.99,null,0,null,0,{"$f":"+'Final Recon - Summary'!$H514-'Final Recon - Summary'!$F514","v":0}]
[0,"Group - Psychologist/Pre-licensed Psychologist","Per Billable Minute",1.78,null,0,null,0,{"$f":"+'Final Recon - Summary'!$H515-'Final Recon - Summary'!$F515","v":0}]
[0,"Group - Psychiatrist/ Contracted Psychiatrist/Licensed Physician (MD)","Per Billable Minute",2.42,null,0,null,0,{"$f":"+'Final Recon - Summary'!$H516-'Final Recon - Summary'!$F516","v":0}]
[0,"Group - Registered Nurse (RN)","Per Billable Minute",1.7999999999999998,null,0,null,0,{"$f":"+'Final Recon - Summary'!$H517-'Final Recon - Summary'!$F517","v":0}]
[0,"Group - Registered Pharmacist","Per Billable Minute",2.12,null,0,null,0,{"$f":"+'Final Recon - Summary'!$H518-'Final Recon - Summary'!$F518","v":0}]
[0,"Group - Interpreter Services","Per Billable Minute",0.34,null,0,null,0,{"$f":"+'Final Recon - Summary'!$H519-'Final Recon - Summary'!$F519","v":0}]
[0,"Total",null,null,null,{"$f":"SUM(F487:F519)","v":0},{"$f":"SUM(G487:G519)","v":0},{"$f":"SUM(H487:H519)","v":0},{"$f":"SUM(I487:I519)","v":0}]
[]
[]
[null,"Certification of Exclusion and Debarment (Article 4) & Funding Attestation"]
[null,"I certify, under penalty of perjury under the laws of the State of California, that the deliverables and/or services invoiced were delivered and/or performed specifically for this Agreement in accordance with and compliance to all terms and conditions set forth therein.\n "]
[]
[null,"Contractor Authorized Signature ",null,null,"Print Name & Title",null,null,"Date"]
[]
[]
[null,"PREPARER'S NAME",null,null,"PHONE NUMBER"]

{"sheet":"Sheet4","index":1,"n_rows":116,"n_cols":23,"rows_kept":116,"cut":false,"hidden":true,"merged":[]}
["MH Outpatient - No Modifier","MH Outpatient - Negative 2.5% Modifer (Exc Interpreter, MD, IC) ","MH Outpatient - Positive 2.5% Modifer (Exc Interpreter, MD, IC) ","MH Outpatient - Positive 5% Modifer (Exc Interpreter, MD, IC) ","MH Outpatient - Positive 7.5% Modifer (Exc Interpreter, MD, IC) ","MH Outpatient - Positive 10% Modifer (Exc Interpreter, MD, IC) ","MH Outpatient - Positive 12.5% Modifer (Exc Interpreter, MD, IC) ","MH Outpatient - Positive 15% Modifer (Exc Interpreter, MD, IC) ","MH Outpatient - Positive 20% Modifer (Exc Interpreter, MD, IC) ","SUD Outpatient - No Modifier","SUD Outpatient - Positive 5% Modifer (Exc Interpreter, MD, AWM) ","SUD Outpatient - Positive 10% Modifer (Exc Interpreter, MD, AWM) ","SUD Outpatient - Positive 20% Modifer (Exc Interpreter, MD, AWM) ",null,null,null,null,null,null,null,null,null,"MH Outpatient - No Modifier"]
["Individual - Clinical Nurse Specialist","Individual - Clinical Nurse Specialist","Individual - Clinical Nurse Specialist","Individual - Clinical Nurse Specialist","Individual - Clinical Nurse Specialist","Individual - Clinical Nurse Specialist","Individual - Clinical Nurse Specialist","Individual - Clinical Nurse Specialist","Individual - Clinical Nurse Specialist","Individual - Alcohol and Drug Counselor","Individual - Alcohol and Drug Counselor","Individual - Alcohol and Drug Counselor","Individual - Alcohol and Drug Counselor",null,null,null,null,null,null,null,null,null,"MH Outpatient - Negative 2.5% Modifer (Exc Interpreter, MD, IC) "]
["Individual - Licensed Psychiatric Technician","Individual - Licensed Psychiatric Technician","Individual - Licensed Psychiatric Technician","Individual - Licensed Psychiatric Technician","Individual - Licensed Psychiatric Technician","Individual - Licensed Psychiatric Technician","Individual - Licensed Psychiatric Technician","Individual - Licensed Psychiatric Technician","Individual - Licensed Psychiatric Technician","Individual - Licensed Psychiatric Technician","Individual - Licensed Psychiatric Technician","Individual - Licensed Psychiatric Technician","Individual - Licensed Psychiatric Technician",null,null,null,null,null,null,null,null,null,"MH Outpatient - Positive 2.5% Modifer (Exc Interpreter, MD, IC) "]
["Individual - LPHA (MFT  LCSW  LPCC)/Intern or Waivered LPHA (MFT  LCSW  LPCC)","Individual - LPHA (MFT  LCSW  LPCC)/Intern or Waivered LPHA (MFT  LCSW  LPCC)","Individual - LPHA (MFT  LCSW  LPCC)/Intern or Waivered LPHA (MFT  LCSW  LPCC)","Individual - LPHA (MFT  LCSW  LPCC)/Intern or Waivered LPHA (MFT  LCSW  LPCC)","Individual - LPHA (MFT  LCSW  LPCC)/Intern or Waivered LPHA (MFT  LCSW  LPCC)","Individual - LPHA (MFT  LCSW  LPCC)/Intern or Waivered LPHA (MFT  LCSW  LPCC)","Individual - LPHA (MFT  LCSW  LPCC)/Intern or Waivered LPHA (MFT  LCSW  LPCC)","Individual - LPHA (MFT  LCSW  LPCC)/Intern or Waivered LPHA (MFT  LCSW  LPCC)","Individual - LPHA (MFT  LCSW  LPCC)/Intern or Waivered LPHA (MFT  LCSW  LPCC)","Individual - Licensed Physician (MD)","Individual - Licensed Physician (MD)","Individual - Licensed Physician (MD)","Individual - Licensed Physician (MD)",null,null,null,null,null,null,null,null,null,"MH Outpatient - Positive 5% Modifer (Exc Interpreter, MD, IC) "]
["Individual - Licensed Vocational Nurse (LVN)","Individual - Licensed Vocational Nurse (LVN)","Individual - Licensed Vocational Nurse (LVN)","Individual - Licensed Vocational Nurse (LVN)","Individual - Licensed Vocational Nurse (LVN)","Individual - Licensed Vocational Nurse (LVN)","Individual - Licensed Vocational Nurse (LVN)","Individual - Licensed Vocational Nurse (LVN)","Individual - Licensed Vocational Nurse (LVN)","Individual - Licensed Vocational Nurse","Individual - Licensed Vocational Nurse","Individual - Licensed Vocational Nurse","Individual - Licensed Vocational Nurse",null,null,null,null,null,null,null,null,null,"MH Outpatient - Positive 7.5% Modifer (Exc Interpreter, MD, IC) "]
["Individual - Medical Assistant","Individual - Medical Assistant","Individual - Medical Assistant","Individual - Medical Assistant","Individual - Medical Assistant","Individual - Medical Assistant","Individual - Medical Assistant","Individual - Medical Assistant","Individual - Medical Assistant","Individual - LPHA (MFT  LCSW  LPCC)/Intern or\nWaivered LPHA (MFT  LCSW  LPCC)","Individual - LPHA (MFT  LCSW  LPCC)/Intern or\nWaivered LPHA (MFT  LCSW  LPCC)","Individual - LPHA (MFT  LCSW  LPCC)/Intern or\nWaivered LPHA (MFT  LCSW  LPCC)","Individual - LPHA (MFT  LCSW  LPCC)/Intern or\nWaivered LPHA (MFT  LCSW  LPCC)",null,null,null,null,null,null,null,null,null,"MH Outpatient - Positive 10% Modifer (Exc Interpreter, MD, IC) "]
["Individual - Mental Health Rehabilitation Specialist","Individual - Mental Health Rehabilitation Specialist","Individual - Mental Health Rehabilitation Specialist","Individual - Mental Health Rehabilitation Specialist","Individual - Mental Health Rehabilitation Specialist","Individual - Mental Health Rehabilitation Specialist","Individual - Mental Health Rehabilitation Specialist","Individual - Mental Health Rehabilitation Specialist","Individual - Mental Health Rehabilitation Specialist","Individual - Medical Assistant","Individual - Medical Assistant","Individual - Medical Assistant","Individual - Medical Assistant",null,null,null,null,null,null,null,null,null,"MH Outpatient - Positive 12.5% Modifer (Exc Interpreter, MD, IC) "]
["Individual - Nurse Practitioner","Individual - Nurse Practitioner","Individual - Nurse Practitioner","Individual - Nurse Practitioner","Individual - Nurse Practitioner","Individual - Nurse Practitioner","Individual - Nurse Practitioner","Individual - Nurse Practitioner","Individual - Nurse Practitioner","Individual - Nurse Practitioner","Individual - Nurse Practitioner","Individual - Nurse Practitioner","Individual - Nurse Practitioner",null,null,null,null,null,null,null,null,null,"MH Outpatient - Positive 15% Modifer (Exc Interpreter, MD, IC) "]
["Individual - Occupational Therapist","Individual - Occupational Therapist","Individual - Occupational Therapist","Individual - Occupational Therapist","Individual - Occupational Therapist","Individual - Occupational Therapist","Individual - Occupational Therapist","Individual - Occupational Therapist","Individual - Occupational Therapist","Individual - Occupational Therapist","Individual - Occupational Therapist","Individual - Occupational Therapist","Individual - Occupational Therapist",null,null,null,null,null,null,null,null,null,"MH Outpatient - Positive 20% Modifer (Exc Interpreter, MD, IC) "]
["Individual - Other Qualified Providers - Other Designated MH staff that bill medical","Individual - Other Qualified Providers - Other Designated MH staff that bill medical","Individual - Other Qualified Providers - Other Designated MH staff that bill medical","Individual - Other Qualified Providers - Other Designated MH staff that bill medical","Individual - Other Qualified Providers - Other Designated MH staff that bill medical","Individual - Other Qualified Providers - Other Designated MH staff that bill medical","Individual - Other Qualified Providers - Other Designated MH staff that bill medical","Individual - Other Qualified Providers - Other Designated MH staff that bill medical","Individual - Other Qualified Providers - Other Designated MH staff that bill medical","Individual - Peer Support Specialist","Individual - Peer Support Specialist","Individual - Peer Support Specialist","Individual - Peer Support Specialist",null,null,null,null,null,null,null,null,null,"SUD Outpatient - No Modifier"]
["Individual - Peer Support Specialist","Individual - Peer Support Specialist","Individual - Peer Support Specialist","Individual - Peer Support Specialist","Individual - Peer Support Specialist","Individual - Peer Support Specialist","Individual - Peer Support Specialist","Individual - Peer Support Specialist","Individual - Peer Support Specialist","Individual - Physician Assistant","Individual - Physician Assistant","Individual - Physician Assistant","Individual - Physician Assistant",null,null,null,null,null,null,null,null,null,"SUD Outpatient - Positive 5% Modifer (Exc Interpreter, MD, AWM) "]
["Individual - Physician Assistant","Individual - Physician Assistant","Individual - Physician Assistant","Individual - Physician Assistant","Individual - Physician Assistant","Individual - Physician Assistant","Individual - Physician Assistant","Individual - Physician Assistant","Individual - Physician Assistant","Individual - Psychologist/Pre-licensed Psychologist","Individual - Psychologist/Pre-licensed Psychologist","Individual - Psychologist/Pre-licensed Psychologist","Individual - Psychologist/Pre-licensed Psychologist",null,null,null,null,null,null,null,null,null,"SUD Outpatient - Positive 10% Modifer (Exc Interpreter, MD, AWM) "]
["Individual - Psychologist/Pre-licensed Psychologist","Individual - Psychologist/Pre-licensed Psychologist","Individual - Psychologist/Pre-licensed Psychologist","Individual - Psychologist/Pre-licensed Psychologist","Individual - Psychologist/Pre-licensed Psychologist","Individual - Psychologist/Pre-licensed Psychologist","Individual - Psychologist/Pre-licensed Psychologist","Individual - Psychologist/Pre-licensed Psychologist","Individual - Psychologist/Pre-licensed Psychologist","Individual - Registered Nurse (RN)","Individual - Registered Nurse (RN)","Individual - Registered Nurse (RN)","Individual - Registered Nurse (RN)",null,null,null,null,null,null,null,null,null,"SUD Outpatient - Positive 20% Modifer (Exc Interpreter, MD, AWM) "]
["Individual - Psychiatrist/ Contracted Psychiatrist/Licensed Physician (MD)","Individual - Psychiatrist/ Contracted Psychiatrist/Licensed Physician (MD)","Individual - Psychiatrist/ Contracted Psychiatrist/Licensed Physician (MD)","Individual - Psychiatrist/ Contracted Psychiatrist/Licensed Physician (MD)","Individual - Psychiatrist/ Contracted Psychiatrist/Licensed Physician (MD)","Individual - Psychiatrist/ Contracted Psychiatrist/Licensed Physician (MD)","Individual - Psychiatrist/ Contracted Psychiatrist/Licensed Physician (MD)","Individual - Psychiatrist/ Contracted Psychiatrist/Licensed Physician (MD)","Individual - Psychiatrist/ Contracted Psychiatrist/Licensed Physician (MD)","Individual - Registered Pharmacist","Individual - Registered Pharmacist","Individual - Registered Pharmacist","Individual - Registered Pharmacist"]
["Individual - Registered Nurse (RN)","Individual - Registered Nurse (RN)","Individual - Registered Nurse (RN)","Individual - Registered Nurse (RN)","Individual - Registered Nurse (RN)","Individual - Registered Nurse (RN)","Individual - Registered Nurse (RN)","Individual - Registered Nurse (RN)","Individual - Registered Nurse (RN)","Individual - Interpreter Services","Individual - Interpreter Services","Individual - Interpreter Services","Individual - Interpreter Services"]
["Individual - Registered Pharmacist","Individual - Registered Pharmacist","Individual - Registered Pharmacist","Individual - Registered Pharmacist","Individual - Registered Pharmacist","Individual - Registered Pharmacist","Individual - Registered Pharmacist","Individual - Registered Pharmacist","Individual - Registered Pharmacist","Ambulatory Withdrawal Management 1","Ambulatory Withdrawal Management 1","Ambulatory Withdrawal Management 1","Ambulatory Withdrawal Management 1"]
["Individual - Interpreter Services","Individual - Interpreter Services","Individual - Interpreter Services","Individual - Interpreter Services","Individual - Interpreter Services","Individual - Interpreter Services","Individual - Interpreter Services","Individual - Interpreter Services","Individual - Interpreter Services","Ambulatory Withdrawal Management 2","Ambulatory Withdrawal Management 2","Ambulatory Withdrawal Management 2","Ambulatory Withdrawal Management 2"]
["Interactive Complexity","Interactive Complexity","Interactive Complexity","Interactive Complexity","Interactive Complexity","Interactive Complexity","Interactive Complexity","Interactive Complexity","Interactive Complexity","Interactive Complexity","Interactive Complexity","Interactive Complexity","Interactive Complexity"]
["Group - Clinical Nurse Specialist","Group - Clinical Nurse Specialist","Group - Clinical Nurse Specialist","Group - Clinical Nurse Specialist","Group - Clinical Nurse Specialist","Group - Clinical Nurse Specialist","Group - Clinical Nurse Specialist","Group - Clinical Nurse Specialist","Group - Clinical Nurse Specialist","Group - Alcohol and Drug Counselor","Group - Alcohol and Drug Counselor","Group - Alcohol and Drug Counselor","Group - Alcohol and Drug Counselor"]
["Group - Licensed Psychiatric Technician","Group - Licensed Psychiatric Technician","Group - Licensed Psychiatric Technician","Group - Licensed Psychiatric Technician","Group - Licensed Psychiatric Technician","Group - Licensed Psychiatric Technician","Group - Licensed Psychiatric Technician","Group - Licensed Psychiatric Technician","Group - Licensed Psychiatric Technician","Group - Licensed Psychiatric Technician","Group - Licensed Psychiatric Technician","Group - Licensed Psychiatric Technician","Group - Licensed Psychiatric Technician"]
["Group - LPHA (MFT  LCSW  LPCC)/Intern or Waivered LPHA (MFT  LCSW  LPCC)","Group - LPHA (MFT  LCSW  LPCC)/Intern or Waivered LPHA (MFT  LCSW  LPCC)","Group - LPHA (MFT  LCSW  LPCC)/Intern or Waivered LPHA (MFT  LCSW  LPCC)","Group - LPHA (MFT  LCSW  LPCC)/Intern or Waivered LPHA (MFT  LCSW  LPCC)","Group - LPHA (MFT  LCSW  LPCC)/Intern or Waivered LPHA (MFT  LCSW  LPCC)","Group - LPHA (MFT  LCSW  LPCC)/Intern or Waivered LPHA (MFT  LCSW  LPCC)","Group - LPHA (MFT  LCSW  LPCC)/Intern or Waivered LPHA (MFT  LCSW  LPCC)","Group - LPHA (MFT  LCSW  LPCC)/Intern or Waivered LPHA (MFT  LCSW  LPCC)","Group - LPHA (MFT  LCSW  LPCC)/Intern or Waivered LPHA (MFT  LCSW  LPCC)","Group - Licensed Physician (MD)","Group - Licensed Physician (MD)","Group - Licensed Physician (MD)","Group - Licensed Physician (MD)"]
["Group - Licensed Vocational Nurse (LVN)","Group - Licensed Vocational Nurse (LVN)","Group - Licensed Vocational Nurse (LVN)","Group - Licensed Vocational Nurse (LVN)","Group - Licensed Vocational Nurse (LVN)","Group - Licensed Vocational Nurse (LVN)","Group - Licensed Vocational Nurse (LVN)","Group - Licensed Vocational Nurse (LVN)","Group - Licensed Vocational Nurse (LVN)","Group - Licensed Vocational Nurse","Group - Licensed Vocational Nurse","Group - Licensed Vocational Nurse","Group - Licensed Vocational Nurse"]
["Group - Medical Assistant","Group - Medical Assistant","Group - Medical Assistant","Group - Medical Assistant","Group - Medical Assistant","Group - Medical Assistant","Group - Medical Assistant","Group - Medical Assistant","Group - Medical Assistant","Group - LPHA (MFT  LCSW  LPCC)/Intern or\nWaivered LPHA (MFT  LCSW  LPCC)","Group - LPHA (MFT  LCSW  LPCC)/Intern or\nWaivered LPHA (MFT  LCSW  LPCC)","Group - LPHA (MFT  LCSW  LPCC)/Intern or\nWaivered LPHA (MFT  LCSW  LPCC)","Group - LPHA (MFT  LCSW  LPCC)/Intern or\nWaivered LPHA (MFT  LCSW  LPCC)"]
["Group - Mental Health Rehabilitation Specialist","Group - Mental Health Rehabilitation Specialist","Group - Mental Health Rehabilitation Specialist","Group - Mental Health Rehabilitation Specialist","Group - Mental Health Rehabilitation Specialist","Group - Mental Health Rehabilitation Specialist","Group - Mental Health Rehabilitation Specialist","Group - Mental Health Rehabilitation Specialist","Group - Mental Health Rehabilitation Specialist","Group - Medical Assistant","Group - Medical Assistant","Group - Medical Assistant","Group - Medical Assistant"]
["Group - Nurse Practitioner","Group - Nurse Practitioner","Group - Nurse Practitioner","Group - Nurse Practitioner","Group - Nurse Practitioner","Group - Nurse Practitioner","Group - Nurse Practitioner","Group - Nurse Practitioner","Group - Nurse Practitioner","Group - Nurse Practitioner","Group - Nurse Practitioner","Group - Nurse Practitioner","Group - Nurse Practitioner"]
["Group - Occupational Therapist","Group - Occupational Therapist","Group - Occupational Therapist","Group - Occupational Therapist","Group - Occupational Therapist","Group - Occupational Therapist","Group - Occupational Therapist","Group - Occupational Therapist","Group - Occupational Therapist","Group - Occupational Therapist","Group - Occupational Therapist","Group - Occupational Therapist","Group - Occupational Therapist"]
["Group - Other Qualified Providers - Other Designated MH staff that bill medical","Group - Other Qualified Providers - Other Designated MH staff that bill medical","Group - Other Qualified Providers - Other Designated MH staff that bill medical","Group - Other Qualified Providers - Other Designated MH staff that bill medical","Group - Other Qualified Providers - Other Designated MH staff that bill medical","Group - Other Qualified Providers - Other Designated MH staff that bill medical","Group - Other Qualified Providers - Other Designated MH staff that bill medical","Group - Other Qualified Providers - Other Designated MH staff that bill medical","Group - Other Qualified Providers - Other Designated MH staff that bill medical","Group - Peer Support Specialist","Group - Peer Support Specialist","Group - Peer Support Specialist","Group - Peer Support Specialist"]
["Group - Peer Support Specialist","Group - Peer Support Specialist","Group - Peer Support Specialist","Group - Peer Support Specialist","Group - Peer Support Specialist","Group - Peer Support Specialist","Group - Peer Support Specialist","Group - Peer Support Specialist","Group - Peer Support Specialist","Group - Physician Assistant","Group - Physician Assistant","Group - Physician Assistant","Group - Physician Assistant"]
["Group - Physician Assistant","Group - Physician Assistant","Group - Physician Assistant","Group - Physician Assistant","Group - Physician Assistant","Group - Physician Assistant","Group - Physician Assistant","Group - Physician Assistant","Group - Physician Assistant","Group - Psychologist/Pre-licensed Psychologist","Group - Psychologist/Pre-licensed Psychologist","Group - Psychologist/Pre-licensed Psychologist","Group - Psychologist/Pre-licensed Psychologist"]
["Group - Psychologist/Pre-licensed Psychologist","Group - Psychologist/Pre-licensed Psychologist","Group - Psychologist/Pre-licensed Psychologist","Group - Psychologist/Pre-licensed Psychologist","Group - Psychologist/Pre-licensed Psychologist","Group - Psychologist/Pre-licensed Psychologist","Group - Psychologist/Pre-licensed Psychologist","Group - Psychologist/Pre-licensed Psychologist","Group - Psychologist/Pre-licensed Psychologist","Group - Registered Nurse (RN)","Group - Registered Nurse (RN)","Group - Registered Nurse (RN)","Group - Registered Nurse (RN)"]
["Group - Psychiatrist/ Contracted Psychiatrist/Licensed Physician (MD)","Group - Psychiatrist/ Contracted Psychiatrist/Licensed Physician (MD)","Group - Psychiatrist/ Contracted Psychiatrist/Licensed Physician (MD)","Group - Psychiatrist/ Contracted Psychiatrist/Licensed Physician (MD)","Group - Psychiatrist/ Contracted Psychiatrist/Licensed Physician (MD)","Group - Psychiatrist/ Contracted Psychiatrist/Licensed Physician (MD)","Group - Psychiatrist/ Contracted Psychiatrist/Licensed Physician (MD)","Group - Psychiatrist/ Contracted Psychiatrist/Licensed Physician (MD)","Group - Psychiatrist/ Contracted Psychiatrist/Licensed Physician (MD)","Group - Registered Pharmacist","Group - Registered Pharmacist","Group - Registered Pharmacist","Group - Registered Pharmacist"]
["Group - Registered Nurse (RN)","Group - Registered Nurse (RN)","Group - Registered Nurse (RN)","Group - Registered Nurse (RN)","Group - Registered Nurse (RN)","Group - Registered Nurse (RN)","Group - Registered Nurse (RN)","Group - Registered Nurse (RN)","Group - Registered Nurse (RN)","Group - Interpreter Services","Group - Interpreter Services","Group - Interpreter Services","Group - Interpreter Services"]
["Group - Registered Pharmacist","Group - Registered Pharmacist","Group - Registered Pharmacist","Group - Registered Pharmacist","Group - Registered Pharmacist","Group - Registered Pharmacist","Group - Registered Pharmacist","Group - Registered Pharmacist","Group - Registered Pharmacist"]
["Group - Interpreter Services","Group - Interpreter Services","Group - Interpreter Services","Group - Interpreter Services","Group - Interpreter Services","Group - Interpreter Services","Group - Interpreter Services","Group - Interpreter Services","Group - Interpreter Services"," "," "," "," "]
[null,null,null,null,null,null," "," "," "," "," "," "," "]
["Housing*","Housing*","Housing*","Housing*","Housing*","Housing*","Housing*","Housing*","Housing*","Recovery Residence*","Recovery Residence*","Recovery Residence*","Recovery Residence*"]
["Move In/Move Out Housing Cost","Move In/Move Out Housing Cost","Move In/Move Out Housing Cost","Move In/Move Out Housing Cost","Move In/Move Out Housing Cost","Move In/Move Out Housing Cost","Move In/Move Out Housing Cost","Move In/Move Out Housing Cost","Move In/Move Out Housing Cost"]
["Admin Cost (Move In/Move Out, Partial, Subsidize etc.)","Move In/Move Out Admin Cost","Move In/Move Out Admin Cost","Move In/Move Out Admin Cost","Move In/Move Out Admin Cost","Move In/Move Out Admin Cost","Move In/Move Out Admin Cost","Move In/Move Out Admin Cost","Move In/Move Out Admin Cost"]
[]
["MH Outpatient - No Modifier","MH Outpatient - Negative 2.5% Modifer (Exc Interpreter, MD, IC) ","MH Outpatient - Positive 2.5% Modifer (Exc Interpreter, MD, IC) ","MH Outpatient - Positive 5% Modifer (Exc Interpreter, MD, IC) ","MH Outpatient - Positive 7.5% Modifer (Exc Interpreter, MD, IC) ","MH Outpatient - Positive 10% Modifer (Exc Interpreter, MD, IC) ","MH Outpatient - Positive 12.5% Modifer (Exc Interpreter, MD, IC) ","MH Outpatient - Positive 15% Modifer (Exc Interpreter, MD, IC) ","MH Outpatient - Positive 20% Modifer (Exc Interpreter, MD, IC) ","SUD Outpatient - No Modifier","SUD Outpatient - Positive 5% Modifer (Exc Interpreter, MD, AWM) ","SUD Outpatient - Positive 10% Modifer (Exc Interpreter, MD, AWM) ","SUD Outpatient - Positive 20% Modifer (Exc Interpreter, MD, AWM) "]
["Per Billable Minute","Per Billable Minute","Per Billable Minute","Per Billable Minute","Per Billable Minute","Per Billable Minute","Per Billable Minute","Per Billable Minute","Per Billable Minute","Per Billable Minute","Per Billable Minute","Per Billable Minute","Per Billable Minute"]
["Per Billable Minute","Per Billable Minute","Per Billable Minute","Per Billable Minute","Per Billable Minute","Per Billable Minute","Per Billable Minute","Per Billable Minute","Per Billable Minute","Per Billable Minute","Per Billable Minute","Per Billable Minute","Per Billable Minute"]
["Per Billable Minute","Per Billable Minute","Per Billable Minute","Per Billable Minute","Per Billable Minute","Per Billable Minute","Per Billable Minute","Per Billable Minute","Per Billable Minute","Per Billable Minute","Per Billable Minute","Per Billable Minute","Per Billable Minute"]
["Per Billable Minute","Per Billable Minute","Per Billable Minute","Per Billable Minute","Per Billable Minute","Per Billable Minute","Per Billable Minute","Per Billable Minute","Per Billable Minute","Per Billable Minute","Per Billable Minute","Per Billable Minute","Per Billable Minute"]
["Per Billable Minute","Per Billable Minute","Per Billable Minute","Per Billable Minute","Per Billable Minute","Per Billable Minute","Per Billable Minute","Per Billable Minute","Per Billable Minute","Per Billable Minute","Per Billable Minute","Per Billable Minute","Per Billable Minute"]
["Per Billable Minute","Per Billable Minute","Per Billable Minute","Per Billable Minute","Per Billable Minute","Per Billable Minute","Per Billable Minute","Per Billable Minute","Per Billable Minute","Per Billable Minute","Per Billable Minute","Per Billable Minute","Per Billable Minute"]
["Per Billable Minute","Per Billable Minute","Per Billable Minute","Per Billable Minute","Per Billable Minute","Per Billable Minute","Per Billable Minute","Per Billable Minute","Per Billable Minute","Per Billable Minute","Per Billable Minute","Per Billable Minute","Per Billable Minute"]
["Per Billable Minute","Per Billable Minute","Per Billable Minute","Per Billable Minute","Per Billable Minute","Per Billable Minute","Per Billable Minute","Per Billable Minute","Per Billable Minute","Per Billable Minute","Per Billable Minute","Per Billable Minute","Per Billable Minute"]
["Per Billable Minute","Per Billable Minute","Per Billable Minute","Per Billable Minute","Per Billable Minute","Per Billable Minute","Per Billable Minute","Per Billable Minute","Per Billable Minute","Per Billable Minute","Per Billable Minute","Per Billable Minute","Per Billable Minute"]
["Per Billable Minute","Per Billable Minute","Per Billable Minute","Per Billable Minute","Per Billable Minute","Per Billable Minute","Per Billable Minute","Per Billable Minute","Per Billable Minute","Per Billable Minute","Per Billable Minute","Per Billable Minute","Per Billable Minute"]
["Per Billable Minute","Per Billable Minute","Per Billable Minute","Per Billable Minute","Per Billable Minute","Per Billable Minute","Per Billable Minute","Per Billable Minute","Per Billable Minute","Per Billable Minute","Per Billable Minute","Per Billable Minute","Per Billable Minute"]
["Per Billable Minute","Per Billable Minute","Per Billable Minute","Per Billable Minute","Per Billable Minute","Per Billable Minute","Per Billable Minute","Per Billable Minute","Per Billable Minute","Per Billable Minute","Per Billable Minute","Per Billable Minute","Per Billable Minute"]
["Per Billable Minute","Per Billable Minute","Per Billable Minute","Per Billable Minute","Per Billable Minute","Per Billable Minute","Per Billable Minute","Per Billable Minute","Per Billable Minute","Per Billable Minute","Per Billable Minute","Per Billable Minute","Per Billable Minute"]
["Per Billable Minute","Per Billable Minute","Per Billable Minute","Per Billable Minute","Per Billable Minute","Per Billable Minute","Per Billable Minute","Per Billable Minute","Per Billable Minute","Per Billable Minute","Per Billable Minute","Per Billable Minute","Per Billable Minute"]
["Per Billable Minute","Per Billable Minute","Per Billable Minute","Per Billable Minute","Per Billable Minute","Per Billable Minute","Per Billable Minute","Per Billable Minute","Per Billable Minute","Per Hour","Per Hour","Per Hour","Per Hour"]
["Per Billable Minute","Per Billable Minute","Per Billable Minute","Per Billable Minute","Per Billable Minute","Per Billable Minute","Per Billable Minute","Per Billable Minute","Per Billable Minute","Per Hour","Per Hour","Per Hour","Per Hour"]
["Per Encounter","Per Encounter","Per Encounter","Per Encounter","Per Encounter","Per Encounter","Per Encounter","Per Encounter","Per Encounter","Per Occurrence","Per Occurrence","Per Occurrence","Per Occurrence"]
["Per Billable Minute","Per Billable Minute","Per Billable Minute","Per Billable Minute","Per Billable Minute","Per Billable Minute","Per Billable Minute","Per Billable Minute","Per Billable Minute","Per Billable Minute","Per Billable Minute","Per Billable Minute","Per Billable Minute"]
["Per Billable Minute","Per Billable Minute","Per Billable Minute","Per Billable Minute","Per Billable Minute","Per Billable Minute","Per Billable Minute","Per Billable Minute","Per Billable Minute","Per Billable Minute","Per Billable Minute","Per Billable Minute","Per Billable Minute"]
["Per Billable Minute","Per Billable Minute","Per Billable Minute","Per Billable Minute","Per Billable Minute","Per Billable Minute","Per Billable Minute","Per Billable Minute","Per Billable Minute","Per Billable Minute","Per Billable Minute","Per Billable Minute","Per Billable Minute"]
["Per Billable Minute","Per Billable Minute","Per Billable Minute","Per Billable Minute","Per Billable Minute","Per Billable Minute","Per Billable Minute","Per Billable Minute","Per Billable Minute","Per Billable Minute","Per Billable Minute","Per Billable Minute","Per Billable Minute"]
["Per Billable Minute","Per Billable Minute","Per Billable Minute","Per Billable Minute","Per Billable Minute","Per Billable Minute","Per Billable Minute","Per Billable Minute","Per Billable Minute","Per Billable Minute","Per Billable Minute","Per Billable Minute","Per Billable Minute"]
["Per Billable Minute","Per Billable Minute","Per Billable Minute","Per Billable Minute","Per Billable Minute","Per Billable Minute","Per Billable Minute","Per Billable Minute","Per Billable Minute","Per Billable Minute","Per Billable Minute","Per Billable Minute","Per Billable Minute"]
["Per Billable Minute","Per Billable Minute","Per Billable Minute","Per Billable Minute","Per Billable Minute","Per Billable Minute","Per Billable Minute","Per Billable Minute","Per Billable Minute","Per Billable Minute","Per Billable Minute","Per Billable Minute","Per Billable Minute"]
["Per Billable Minute","Per Billable Minute","Per Billable Minute","Per Billable Minute","Per Billable Minute","Per Billable Minute","Per Billable Minute","Per Billable Minute","Per Billable Minute","Per Billable Minute","Per Billable Minute","Per Billable Minute","Per Billable Minute"]
["Per Billable Minute","Per Billable Minute","Per Billable Minute","Per Billable Minute","Per Billable Minute","Per Billable Minute","Per Billable Minute","Per Billable Minute","Per Billable Minute","Per Billable Minute","Per Billable Minute","Per Billable Minute","Per Billable Minute"]
["Per Billable Minute","Per Billable Minute","Per Billable Minute","Per Billable Minute","Per Billable Minute","Per Billable Minute","Per Billable Minute","Per Billable Minute","Per Billable Minute","Per Billable Minute","Per Billable Minute","Per Billable Minute","Per Billable Minute"]
["Per Billable Minute","Per Billable Minute","Per Billable Minute","Per Billable Minute","Per Billable Minute","Per Billable Minute","Per Billable Minute","Per Billable Minute","Per Billable Minute","Per Billable Minute","Per Billable Minute","Per Billable Minute","Per Billable Minute"]
["Per Billable Minute","Per Billable Minute","Per Billable Minute","Per Billable Minute","Per Billable Minute","Per Billable Minute","Per Billable Minute","Per Billable Minute","Per Billable Minute","Per Billable Minute","Per Billable Minute","Per Billable Minute","Per Billable Minute"]
["Per Billable Minute","Per Billable Minute","Per Billable Minute","Per Billable Minute","Per Billable Minute","Per Billable Minute","Per Billable Minute","Per Billable Minute","Per Billable Minute","Per Billable Minute","Per Billable Minute","Per Billable Minute","Per Billable Minute"]
["Per Billable Minute","Per Billable Minute","Per Billable Minute","Per Billable Minute","Per Billable Minute","Per Billable Minute","Per Billable Minute","Per Billable Minute","Per Billable Minute","Per Billable Minute","Per Billable Minute","Per Billable Minute","Per Billable Minute"]
["Per Billable Minute","Per Billable Minute","Per Billable Minute","Per Billable Minute","Per Billable Minute","Per Billable Minute","Per Billable Minute","Per Billable Minute","Per Billable Minute"," "," "," "," "]
["Per Billable Minute","Per Billable Minute","Per Billable Minute","Per Billable Minute","Per Billable Minute","Per Billable Minute","Per Billable Minute","Per Billable Minute","Per Billable Minute"," "," "," "," "]
[" "," "," "," "," "," "," "," "," "," "," "," "," "]
["Clients Housed","Clients Housed","Clients Housed","Clients Housed","Clients Housed","Clients Housed","Clients Housed","Clients Housed","Clients Housed","Per Day","Per Day","Per Day","Per Day"]
["Per Day","Per Day","Per Day","Per Day","Per Day","Per Day","Per Day","Per Day","Per Day"]
["Per Client","Per Client","Per Client","Per Client","Per Client","Per Client","Per Client","Per Client","Per Client"]
[]
["MH Outpatient - No Modifier","MH Outpatient - Negative 2.5% Modifer (Exc Interpreter, MD, IC) ","MH Outpatient - Positive 2.5% Modifer (Exc Interpreter, MD, IC) ","MH Outpatient - Positive 5% Modifer (Exc Interpreter, MD, IC) ","MH Outpatient - Positive 7.5% Modifer (Exc Interpreter, MD, IC) ","MH Outpatient - Positive 10% Modifer (Exc Interpreter, MD, IC) ","MH Outpatient - Positive 12.5% Modifer (Exc Interpreter, MD, IC) ","MH Outpatient - Positive 15% Modifer (Exc Interpreter, MD, IC) ","MH Outpatient - Positive 20% Modifer (Exc Interpreter, MD, IC) ","SUD Outpatient - No Modifier","SUD Outpatient - Positive 5% Modifer (Exc Interpreter, MD, AWM) ","SUD Outpatient - Positive 10% Modifer (Exc Interpreter, MD, AWM) ","SUD Outpatient - Positive 20% Modifer (Exc Interpreter, MD, AWM) "]
[9.02,8.7199999999999989,9.33,9.6199999999999992,9.92,10.219999999999999,10.53,10.83,11.419999999999998,3.92,4.18,4.4399999999999995,4.96]
[3.32,3.21,3.44,3.54,3.65,3.76,3.88,3.99,4.1999999999999993,3.32,3.54,3.76,4.2]
[4.72,4.5599999999999996,4.88,5.0299999999999994,5.1899999999999995,5.35,5.51,5.67,5.9799999999999995,10.89,10.89,10.89,10.89]
[3.87,3.74,4,4.13,4.26,4.3900000000000006,4.5200000000000005,4.6500000000000004,4.9000000000000004,3.87,4.13,4.3900000000000006,4.9000000000000004]
[2.66,2.5700000000000003,2.75,2.8400000000000003,2.93,3.02,3.1100000000000003,3.2,3.37,4.72,5.0299999999999994,5.35,5.9799999999999995]
[3.56,3.44,3.68,3.8,3.92,4.03,4.16,4.2699999999999996,4.5,2.66,2.8400000000000003,3.02,3.37]
[9.02,8.7199999999999989,9.33,9.6199999999999992,9.92,10.219999999999999,10.53,10.83,11.43,9.02,9.6199999999999992,10.219999999999999,11.43]
[6.29,6.08,6.5,6.71,6.92,7.13,7.34,7.55,7.97,6.29,6.71,7.13,7.97]
[3.56,3.44,3.68,3.8,3.92,4.03,4.16,4.28,4.5,3.73,3.98,4.2300000000000004,4.72]
[3.73,3.61,3.86,3.98,4.0999999999999996,4.2300000000000004,4.3600000000000003,4.4800000000000004,4.72,8.14,8.68,9.23,10.31]
[8.14,7.870000000000001,8.42,8.68,8.9500000000000011,9.23,9.5,9.7700000000000014,10.31,7.3,7.79,8.27,9.25]
[7.3,7.06,7.55,7.79,8.0299999999999994,8.27,8.52,8.76,9.25,7.37,7.86,8.35,9.33]
[10.89,10.89,10.89,10.89,10.89,10.89,10.89,12.1,10.89,8.69,9.27,9.85,11.01]
[7.37,7.12,7.62,7.86,8.11,8.35,8.6,8.85,9.3299999999999983,1.55,1.55,1.55,1.55]
[8.69,8.4,8.98,9.27,9.5599999999999987,9.85,10.139999999999999,10.43,11.01,239.52,239.52,239.52,239.52]
[1.55,1.55,1.55,1.55,1.55,1.55,1.55,1.55,1.55,281.08,281.08,281.08,281.08]
[13.74,13.74,13.74,13.74,13.74,13.74,13.74,13.74,13.74,13.74,13.74,13.74,13.74]
[2.0099999999999998,1.9399999999999997,2.0799999999999996,2.1399999999999997,2.21,2.2799999999999998,2.35,2.41,2.5499999999999998,0.87,0.92999999999999994,0.99,1.1000000000000001]
[0.74,0.72,0.77,0.79,0.81,0.84,0.87,0.89,0.94,0.74,0.79,0.84,0.94]
[1.05,1.02,1.0900000000000001,1.1200000000000001,1.1500000000000001,1.19,1.23,1.26,1.3299999999999998,2.42,2.42,2.42,2.42]
[0.86,0.83,0.89,0.91999999999999993,0.95,0.97,1.01,1.04,1.0900000000000001,0.86,0.91999999999999993,0.97,1.0900000000000001]
[0.59,0.56999999999999995,0.61,0.63,0.64999999999999991,0.66999999999999993,0.69,0.71,0.74999999999999989,1.05,1.1200000000000001,1.19,1.33]
[0.79,0.76,0.82000000000000006,0.84000000000000008,0.87,0.9,0.93,0.95000000000000007,1.01,0.59,0.63,0.66999999999999993,0.75]
[2.0099999999999998,1.9399999999999997,2.0799999999999996,2.1399999999999997,2.21,2.2799999999999998,2.35,2.41,2.54,2.0099999999999998,2.1399999999999997,2.2799999999999998,2.54]
[1.4,1.3499999999999999,1.45,1.49,1.54,1.5899999999999999,1.64,1.68,1.77,1.4,1.49,1.5899999999999999,1.77]
[0.79,0.76,0.82000000000000006,0.84000000000000008,0.87,0.9,0.93,0.95000000000000007,1.01,0.83,0.8899999999999999,0.94,1.05]
[0.83,0.79999999999999993,0.86,0.8899999999999999,0.91,0.94,0.97,1,1.0499999999999998,1.81,1.9300000000000002,2.0499999999999998,2.29]
[1.81,1.75,1.88,1.9300000000000002,1.99,2.0499999999999998,2.12,2.1800000000000002,2.2899999999999996,1.62,1.7300000000000002,1.84,2.0499999999999998]
[1.62,1.57,1.68,1.7300000000000002,1.78,1.84,1.9,1.9500000000000002,2.0499999999999998,1.64,1.75,1.8599999999999999,2.08]
[2.42,2.42,2.42,2.42,2.42,2.42,2.42,2.69,2.42,1.93,2.06,2.19,2.44]
[1.64,1.5899999999999999,1.7,1.75,1.7999999999999998,1.8599999999999999,1.92,1.97,2.08,0.34,0.34,0.34,0.34]
[1.93,1.8699999999999999,2,2.06,2.12,2.19,2.2599999999999998,2.3199999999999998,2.44,0,0,0,0]
[0.34,0.34,0.34,0.34,0.34,0.34,0.34,0.34,0.34,0,0,0,0]
[" "," "," "," "," "," "," "," ",null,0,0,0,0]
[1500,1500,1500,1500,1500,1500,1500,1500,1500,50,50,50,50]
[40,40,40,40,40,40,40,40,40]
[300,300,300,300,300,300,300,300,300]

{"sheet":"Final Recon - Details (SUD)","index":2,"n_rows":600,"n_cols":22,"rows_kept":600,"cut":false,"hidden":false,"merged":[[5,2,5,4]]}
["BEHAVIORAL HEALTH SERVICES"]
["Fiscal Year-End Units Details"]
[]
[null,"Contractor:",{"$f":"'Final Recon - Summary'!C4","v":0}]
[null,"Contract #:",{"$f":"'Final Recon - Summary'!C5","v":0}]
[null,"Rate Category:","SUD Outpatient - Positive 5% Modifer (Exc Interpreter, MD, AWM) "]
[]
["Column1","Service Modalities","Unit","Rate","Final TUOS Units Reconciliation","Final Amount Reconciliation","ODS DMC General Units","ODS DMC General Amount","ODS General Units","ODS General Amount","ODS DMC AB109 Units","ODS DMC AB109 Amount","ODS AB109 Units","ODS AB109 Amount","SUD Non-Billable Units","SUD Non-Billable Amount","Room & Board Units","Room & Board Amount",null,"Total Units (Summary)","Total Units (Details)","Checkpoint"]
[{"$f":"$C$5","v":0},{"$f":"_xlfn.XLOOKUP(C6,Sheet4!J1:M1,Sheet4!J2:M32,0)","v":"Individual - Alcohol and Drug Counselor"},{"$f":"_xlfn.XLOOKUP(C6,Sheet4!J40:M40,Sheet4!J41:M71,0)","v":"Per Billable Minute"},{"$f":"_xlfn.XLOOKUP(C6,Sheet4!J79:M79,Sheet4!J80:M110,0)","v":4.18},{"$f":"'Final Recon - Details (SUD)'!$G9+'Final Recon - Details (SUD)'!$I9+'Final Recon - Details (SUD)'!$K9+'Final Recon - Details (SUD)'!$M9+'Final Recon - Details (SUD)'!$Q9+'Final Recon - Details (SUD)'!$O9","v":0},{"$f":"+D9*E9","v":0},null,{"$f":"+D9*G9","v":0},null,{"$f":"'Final Recon - Details (SUD)'!$I9*'Final Recon - Details (SUD)'!$D9","v":0},null,{"$f":"'Final Recon - Details (SUD)'!$D9*'Final Recon - Details (SUD)'!$K9","v":0},null,{"$f":"'Final Recon - Details (SUD)'!$D9*'Final Recon - Details (SUD)'!$M9","v":0},null,{"$f":"'Final Recon - Details (SUD)'!$D9*'Final Recon - Details (SUD)'!$O9","v":0},null,{"$f":"'Final Recon - Details (SUD)'!$D9*'Final Recon - Details (SUD)'!$Q9","v":0},null,{"$f":"'[4]Final Recon - Summary'!G10","v":0},{"$f":"'Final Recon - Details (SUD)'!$G9+'Final Recon - Details (SUD)'!$I9+'Final Recon - Details (SUD)'!$K9+'Final Recon - Details (SUD)'!$M9+'Final Recon - Details (SUD)'!$O9+'Final Recon - Details (SUD)'!$Q9","v":0},{"$f":"T9-U9","v":0}]
[0,"Individual - Licensed Psychiatric Technician","Per Billable Minute",3.54,{"$f":"'Final Recon - Details (SUD)'!$G10+'Final Recon - Details (SUD)'!$I10+'Final Recon - Details (SUD)'!$K10+'Final Recon - Details (SUD)'!$M10+'Final Recon - Details (SUD)'!$Q10+'Final Recon - Details (SUD)'!$O10","v":0},0,null,0,null,{"$f":"'Final Recon - Details (SUD)'!$I10*'Final Recon - Details (SUD)'!$D10","v":0},null,{"$f":"'Final Recon - Details (SUD)'!$D10*'Final Recon - Details (SUD)'!$K10","v":0},null,{"$f":"'Final Recon - Details (SUD)'!$D10*'Final Recon - Details (SUD)'!$M10","v":0},null,{"$f":"'Final Recon - Details (SUD)'!$D10*'Final Recon - Details (SUD)'!$O10","v":0},null,{"$f":"'Final Recon - Details (SUD)'!$D10*'Final Recon - Details (SUD)'!$Q10","v":0},null,{"$f":"'[4]Final Recon - Summary'!G11","v":0},{"$f":"'Final Recon - Details (SUD)'!$G10+'Final Recon - Details (SUD)'!$I10+'Final Recon - Details (SUD)'!$K10+'Final Recon - Details (SUD)'!$M10+'Final Recon - Details (SUD)'!$O10+'Final Recon - Details (SUD)'!$Q10","v":0},0]
[0,"Individual - Licensed Physician (MD)","Per Billable Minute",10.89,{"$f":"'Final Recon - Details (SUD)'!$G11+'Final Recon - Details (SUD)'!$I11+'Final Recon - Details (SUD)'!$K11+'Final Recon - Details (SUD)'!$M11+'Final Recon - Details (SUD)'!$Q11+'Final Recon - Details (SUD)'!$O11","v":0},0,null,0,null,{"$f":"'Final Recon - Details (SUD)'!$I11*'Final Recon - Details (SUD)'!$D11","v":0},null,{"$f":"'Final Recon - Details (SUD)'!$D11*'Final Recon - Details (SUD)'!$K11","v":0},null,{"$f":"'Final Recon - Details (SUD)'!$D11*'Final Recon - Details (SUD)'!$M11","v":0},null,{"$f":"'Final Recon - Details (SUD)'!$D11*'Final Recon - Details (SUD)'!$O11","v":0},null,{"$f":"'Final Recon - Details (SUD)'!$D11*'Final Recon - Details (SUD)'!$Q11","v":0},null,{"$f":"'[4]Final Recon - Summary'!G12","v":0},{"$f":"'Final Recon - Details (SUD)'!$G11+'Final Recon - Details (SUD)'!$I11+'Final Recon - Details (SUD)'!$K11+'Final Recon - Details (SUD)'!$M11+'Final Recon - Details (SUD)'!$O11+'Final Recon - Details (SUD)'!$Q11","v":0},0]
[0,"Individual - Licensed Vocational Nurse","Per Billable Minute",4.13,{"$f":"'Final Recon - Details (SUD)'!$G12+'Final Recon - Details (SUD)'!$I12+'Final Recon - Details (SUD)'!$K12+'Final Recon - Details (SUD)'!$M12+'Final Recon - Details (SUD)'!$Q12+'Final Recon - Details (SUD)'!$O12","v":0},0,null,0,null,{"$f":"'Final Recon - Details (SUD)'!$I12*'Final Recon - Details (SUD)'!$D12","v":0},null,{"$f":"'Final Recon - Details (SUD)'!$D12*'Final Recon - Details (SUD)'!$K12","v":0},null,{"$f":"'Final Recon - Details (SUD)'!$D12*'Final Recon - Details (SUD)'!$M12","v":0},null,{"$f":"'Final Recon - Details (SUD)'!$D12*'Final Recon - Details (SUD)'!$O12","v":0},null,{"$f":"'Final Recon - Details (SUD)'!$D12*'Final Recon - Details (SUD)'!$Q12","v":0},null,{"$f":"'[4]Final Recon - Summary'!G13","v":0},{"$f":"'Final Recon - Details (SUD)'!$G12+'Final Recon - Details (SUD)'!$I12+'Final Recon - Details (SUD)'!$K12+'Final Recon - Details (SUD)'!$M12+'Final Recon - Details (SUD)'!$O12+'Final Recon - Details (SUD)'!$Q12","v":0},0]
[0,"Individual - LPHA (MFT  LCSW  LPCC)/Intern or\nWaivered LPHA (MFT  LCSW  LPCC)","Per Billable Minute",5.0299999999999994,{"$f":"'Final Recon - Details (SUD)'!$G13+'Final Recon - Details (SUD)'!$I13+'Final Recon - Details (SUD)'!$K13+'Final Recon - Details (SUD)'!$M13+'Final Recon - Details (SUD)'!$Q13+'Final Recon - Details (SUD)'!$O13","v":0},0,null,0,null,{"$f":"'Final Recon - Details (SUD)'!$I13*'Final Recon - Details (SUD)'!$D13","v":0},null,{"$f":"'Final Recon - Details (SUD)'!$D13*'Final Recon - Details (SUD)'!$K13","v":0},null,{"$f":"'Final Recon - Details (SUD)'!$D13*'Final Recon - Details (SUD)'!$M13","v":0},null,{"$f":"'Final Recon - Details (SUD)'!$D13*'Final Recon - Details (SUD)'!$O13","v":0},null,{"$f":"'Final Recon - Details (SUD)'!$D13*'Final Recon - Details (SUD)'!$Q13","v":0},null,{"$f":"'[4]Final Recon - Summary'!G14","v":0},{"$f":"'Final Recon - Details (SUD)'!$G13+'Final Recon - Details (SUD)'!$I13+'Final Recon - Details (SUD)'!$K13+'Final Recon - Details (SUD)'!$M13+'Final Recon - Details (SUD)'!$O13+'Final Recon - Details (SUD)'!$Q13","v":0},0]
[0,"Individual - Medical Assistant","Per Billable Minute",2.8400000000000003,{"$f":"'Final Recon - Details (SUD)'!$G14+'Final Recon - Details (SUD)'!$I14+'Final Recon - Details (SUD)'!$K14+'Final Recon - Details (SUD)'!$M14+'Final Recon - Details (SUD)'!$Q14+'Final Recon - Details (SUD)'!$O14","v":0},0,null,0,null,{"$f":"'Final Recon - Details (SUD)'!$I14*'Final Recon - Details (SUD)'!$D14","v":0},null,{"$f":"'Final Recon - Details (SUD)'!$D14*'Final Recon - Details (SUD)'!$K14","v":0},null,{"$f":"'Final Recon - Details (SUD)'!$D14*'Final Recon - Details (SUD)'!$M14","v":0},null,{"$f":"'Final Recon - Details (SUD)'!$D14*'Final Recon - Details (SUD)'!$O14","v":0},null,{"$f":"'Final Recon - Details (SUD)'!$D14*'Final Recon - Details (SUD)'!$Q14","v":0},null,{"$f":"'[4]Final Recon - Summary'!G15","v":0},{"$f":"'Final Recon - Details (SUD)'!$G14+'Final Recon - Details (SUD)'!$I14+'Final Recon - Details (SUD)'!$K14+'Final Recon - Details (SUD)'!$M14+'Final Recon - Details (SUD)'!$O14+'Final Recon - Details (SUD)'!$Q14","v":0},0]
[0,"Individual - Nurse Practitioner","Per Billable Minute",9.6199999999999992,{"$f":"'Final Recon - Details (SUD)'!$G15+'Final Recon - Details (SUD)'!$I15+'Final Recon - Details (SUD)'!$K15+'Final Recon - Details (SUD)'!$M15+'Final Recon - Details (SUD)'!$Q15+'Final Recon - Details (SUD)'!$O15","v":0},0,null,0,null,{"$f":"'Final Recon - Details (SUD)'!$I15*'Final Recon - Details (SUD)'!$D15","v":0},null,{"$f":"'Final Recon - Details (SUD)'!$D15*'Final Recon - Details (SUD)'!$K15","v":0},null,{"$f":"'Final Recon - Details (SUD)'!$D15*'Final Recon - Details (SUD)'!$M15","v":0},null,{"$f":"'Final Recon - Details (SUD)'!$D15*'Final Recon - Details (SUD)'!$O15","v":0},null,{"$f":"'Final Recon - Details (SUD)'!$D15*'Final Recon - Details (SUD)'!$Q15","v":0},null,{"$f":"'[4]Final Recon - Summary'!G16","v":0},{"$f":"'Final Recon - Details (SUD)'!$G15+'Final Recon - Details (SUD)'!$I15+'Final Recon - Details (SUD)'!$K15+'Final Recon - Details (SUD)'!$M15+'Final Recon - Details (SUD)'!$O15+'Final Recon - Details (SUD)'!$Q15","v":0},0]
[0,"Individual - Occupational Therapist","Per Billable Minute",6.71,{"$f":"'Final Recon - Details (SUD)'!$G16+'Final Recon - Details (SUD)'!$I16+'Final Recon - Details (SUD)'!$K16+'Final Recon - Details (SUD)'!$M16+'Final Recon - Details (SUD)'!$Q16+'Final Recon - Details (SUD)'!$O16","v":0},0,null,0,null,{"$f":"'Final Recon - Details (SUD)'!$I16*'Final Recon - Details (SUD)'!$D16","v":0},null,{"$f":"'Final Recon - Details (SUD)'!$D16*'Final Recon - Details (SUD)'!$K16","v":0},null,{"$f":"'Final Recon - Details (SUD)'!$D16*'Final Recon - Details (SUD)'!$M16","v":0},null,{"$f":"'Final Recon - Details (SUD)'!$D16*'Final Recon - Details (SUD)'!$O16","v":0},null,{"$f":"'Final Recon - Details (SUD)'!$D16*'Final Recon - Details (SUD)'!$Q16","v":0},null,{"$f":"'[4]Final Recon - Summary'!G17","v":0},{"$f":"'Final Recon - Details (SUD)'!$G16+'Final Recon - Details (SUD)'!$I16+'Final Recon - Details (SUD)'!$K16+'Final Recon - Details (SUD)'!$M16+'Final Recon - Details (SUD)'!$O16+'Final Recon - Details (SUD)'!$Q16","v":0},0]
[0,"Individual - Peer Support Specialist","Per Billable Minute",3.98,{"$f":"'Final Recon - Details (SUD)'!$G17+'Final Recon - Details (SUD)'!$I17+'Final Recon - Details (SUD)'!$K17+'Final Recon - Details (SUD)'!$M17+'Final Recon - Details (SUD)'!$Q17+'Final Recon - Details (SUD)'!$O17","v":0},0,null,0,null,{"$f":"'Final Recon - Details (SUD)'!$I17*'Final Recon - Details (SUD)'!$D17","v":0},null,{"$f":"'Final Recon - Details (SUD)'!$D17*'Final Recon - Details (SUD)'!$K17","v":0},null,{"$f":"'Final Recon - Details (SUD)'!$D17*'Final Recon - Details (SUD)'!$M17","v":0},null,{"$f":"'Final Recon - Details (SUD)'!$D17*'Final Recon - Details (SUD)'!$O17","v":0},null,{"$f":"'Final Recon - Details (SUD)'!$D17*'Final Recon - Details (SUD)'!$Q17","v":0},null,{"$f":"'[4]Final Recon - Summary'!G18","v":0},{"$f":"'Final Recon - Details (SUD)'!$G17+'Final Recon - Details (SUD)'!$I17+'Final Recon - Details (SUD)'!$K17+'Final Recon - Details (SUD)'!$M17+'Final Recon - Details (SUD)'!$O17+'Final Recon - Details (SUD)'!$Q17","v":0},0]
[0,"Individual - Physician Assistant","Per Billable Minute",8.68,{"$f":"'Final Recon - Details (SUD)'!$G18+'Final Recon - Details (SUD)'!$I18+'Final Recon - Details (SUD)'!$K18+'Final Recon - Details (SUD)'!$M18+'Final Recon - Details (SUD)'!$Q18+'Final Recon - Details (SUD)'!$O18","v":0},0,null,0,null,{"$f":"'Final Recon - Details (SUD)'!$I18*'Final Recon - Details (SUD)'!$D18","v":0},null,{"$f":"'Final Recon - Details (SUD)'!$D18*'Final Recon - Details (SUD)'!$K18","v":0},null,{"$f":"'Final Recon - Details (SUD)'!$D18*'Final Recon - Details (SUD)'!$M18","v":0},null,{"$f":"'Final Recon - Details (SUD)'!$D18*'Final Recon - Details (SUD)'!$O18","v":0},null,{"$f":"'Final Recon - Details (SUD)'!$D18*'Final Recon - Details (SUD)'!$Q18","v":0},null,{"$f":"'[4]Final Recon - Summary'!G19","v":0},{"$f":"'Final Recon - Details (SUD)'!$G18+'Final Recon - Details (SUD)'!$I18+'Final Recon - Details (SUD)'!$K18+'Final Recon - Details (SUD)'!$M18+'Final Recon - Details (SUD)'!$O18+'Final Recon - Details (SUD)'!$Q18","v":0},0]
[0,"Individual - Psychologist/Pre-licensed Psychologist","Per Billable Minute",7.79,{"$f":"'Final Recon - Details (SUD)'!$G19+'Final Recon - Details (SUD)'!$I19+'Final Recon - Details (SUD)'!$K19+'Final Recon - Details (SUD)'!$M19+'Final Recon - Details (SUD)'!$Q19+'Final Recon - Details (SUD)'!$O19","v":0},0,null,0,null,{"$f":"'Final Recon - Details (SUD)'!$I19*'Final Recon - Details (SUD)'!$D19","v":0},null,{"$f":"'Final Recon - Details (SUD)'!$D19*'Final Recon - Details (SUD)'!$K19","v":0},null,{"$f":"'Final Recon - Details (SUD)'!$D19*'Final Recon - Details (SUD)'!$M19","v":0},null,{"$f":"'Final Recon - Details (SUD)'!$D19*'Final Recon - Details (SUD)'!$O19","v":0},null,{"$f":"'Final Recon - Details (SUD)'!$D19*'Final Recon - Details (SUD)'!$Q19","v":0},null,{"$f":"'[4]Final Recon - Summary'!G20","v":0},{"$f":"'Final Recon - Details (SUD)'!$G19+'Final Recon - Details (SUD)'!$I19+'Final Recon - Details (SUD)'!$K19+'Final Recon - Details (SUD)'!$M19+'Final Recon - Details (SUD)'!$O19+'Final Recon - Details (SUD)'!$Q19","v":0},0]
[0,"Individual - Registered Nurse (RN)","Per Billable Minute",7.86,{"$f":"'Final Recon - Details (SUD)'!$G20+'Final Recon - Details (SUD)'!$I20+'Final Recon - Details (SUD)'!$K20+'Final Recon - Details (SUD)'!$M20+'Final Recon - Details (SUD)'!$Q20+'Final Recon - Details (SUD)'!$O20","v":0},0,null,0,null,{"$f":"'Final Recon - Details (SUD)'!$I20*'Final Recon - Details (SUD)'!$D20","v":0},null,{"$f":"'Final Recon - Details (SUD)'!$D20*'Final Recon - Details (SUD)'!$K20","v":0},null,{"$f":"'Final Recon - Details (SUD)'!$D20*'Final Recon - Details (SUD)'!$M20","v":0},null,{"$f":"'Final Recon - Details (SUD)'!$D20*'Final Recon - Details (SUD)'!$O20","v":0},null,{"$f":"'Final Recon - Details (SUD)'!$D20*'Final Recon - Details (SUD)'!$Q20","v":0},null,{"$f":"'[4]Final Recon - Summary'!G21","v":0},{"$f":"'Final Recon - Details (SUD)'!$G20+'Final Recon - Details (SUD)'!$I20+'Final Recon - Details (SUD)'!$K20+'Final Recon - Details (SUD)'!$M20+'Final Recon - Details (SUD)'!$O20+'Final Recon - Details (SUD)'!$Q20","v":0},0]
[0,"Individual - Registered Pharmacist","Per Billable Minute",9.27,{"$f":"'Final Recon - Details (SUD)'!$G21+'Final Recon - Details (SUD)'!$I21+'Final Recon - Details (SUD)'!$K21+'Final Recon - Details (SUD)'!$M21+'Final Recon - Details (SUD)'!$Q21+'Final Recon - Details (SUD)'!$O21","v":0},0,null,0,null,{"$f":"'Final Recon - Details (SUD)'!$I21*'Final Recon - Details (SUD)'!$D21","v":0},null,{"$f":"'Final Recon - Details (SUD)'!$D21*'Final Recon - Details (SUD)'!$K21","v":0},null,{"$f":"'Final Recon - Details (SUD)'!$D21*'Final Recon - Details (SUD)'!$M21","v":0},null,{"$f":"'Final Recon - Details (SUD)'!$D21*'Final Recon - Details (SUD)'!$O21","v":0},null,{"$f":"'Final Recon - Details (SUD)'!$D21*'Final Recon - Details (SUD)'!$Q21","v":0},null,{"$f":"'[4]Final Recon - Summary'!G22","v":0},{"$f":"'Final Recon - Details (SUD)'!$G21+'Final Recon - Details (SUD)'!$I21+'Final Recon - Details (SUD)'!$K21+'Final Recon - Details (SUD)'!$M21+'Final Recon - Details (SUD)'!$O21+'Final Recon - Details (SUD)'!$Q21","v":0},0]
[0,"Individual - Interpreter Services","Per Billable Minute",1.55,{"$f":"'Final Recon - Details (SUD)'!$G22+'Final Recon - Details (SUD)'!$I22+'Final Recon - Details (SUD)'!$K22+'Final Recon - Details (SUD)'!$M22+'Final Recon - Details (SUD)'!$Q22+'Final Recon - Details (SUD)'!$O22","v":0},0,null,0,null,{"$f":"'Final Recon - Details (SUD)'!$I22*'Final Recon - Details (SUD)'!$D22","v":0},null,{"$f":"'Final Recon - Details (SUD)'!$D22*'Final Recon - Details (SUD)'!$K22","v":0},null,{"$f":"'Final Recon - Details (SUD)'!$D22*'Final Recon - Details (SUD)'!$M22","v":0},null,{"$f":"'Final Recon - Details (SUD)'!$D22*'Final Recon - Details (SUD)'!$O22","v":0},null,{"$f":"'Final Recon - Details (SUD)'!$D22*'Final Recon - Details (SUD)'!$Q22","v":0},null,{"$f":"'[4]Final Recon - Summary'!G23","v":0},{"$f":"'Final Recon - Details (SUD)'!$G22+'Final Recon - Details (SUD)'!$I22+'Final Recon - Details (SUD)'!$K22+'Final Recon - Details (SUD)'!$M22+'Final Recon - Details (SUD)'!$O22+'Final Recon - Details (SUD)'!$Q22","v":0},0]
[0,"Ambulatory Withdrawal Management 1","Per Hour",239.52,{"$f":"'Final Recon - Details (SUD)'!$G23+'Final Recon - Details (SUD)'!$I23+'Final Recon - Details (SUD)'!$K23+'Final Recon - Details (SUD)'!$M23+'Final Recon - Details (SUD)'!$Q23+'Final Recon - Details (SUD)'!$O23","v":0},0,null,0,null,{"$f":"'Final Recon - Details (SUD)'!$I23*'Final Recon - Details (SUD)'!$D23","v":0},null,{"$f":"'Final Recon - Details (SUD)'!$D23*'Final Recon - Details (SUD)'!$K23","v":0},null,{"$f":"'Final Recon - Details (SUD)'!$D23*'Final Recon - Details (SUD)'!$M23","v":0},null,{"$f":"'Final Recon - Details (SUD)'!$D23*'Final Recon - Details (SUD)'!$O23","v":0},null,{"$f":"'Final Recon - Details (SUD)'!$D23*'Final Recon - Details (SUD)'!$Q23","v":0},null,{"$f":"'[4]Final Recon - Summary'!G24","v":0},{"$f":"'Final Recon - Details (SUD)'!$G23+'Final Recon - Details (SUD)'!$I23+'Final Recon - Details (SUD)'!$K23+'Final Recon - Details (SUD)'!$M23+'Final Recon - Details (SUD)'!$O23+'Final Recon - Details (SUD)'!$Q23","v":0},0]
[0,"Ambulatory Withdrawal Management 2","Per Hour",281.08,{"$f":"'Final Recon - Details (SUD)'!$G24+'Final Recon - Details (SUD)'!$I24+'Final Recon - Details (SUD)'!$K24+'Final Recon - Details (SUD)'!$M24+'Final Recon - Details (SUD)'!$Q24+'Final Recon - Details (SUD)'!$O24","v":0},0,null,0,null,{"$f":"'Final Recon - Details (SUD)'!$I24*'Final Recon - Details (SUD)'!$D24","v":0},null,{"$f":"'Final Recon - Details (SUD)'!$D24*'Final Recon - Details (SUD)'!$K24","v":0},null,{"$f":"'Final Recon - Details (SUD)'!$D24*'Final Recon - Details (SUD)'!$M24","v":0},null,{"$f":"'Final Recon - Details (SUD)'!$D24*'Final Recon - Details (SUD)'!$O24","v":0},null,{"$f":"'Final Recon - Details (SUD)'!$D24*'Final Recon - Details (SUD)'!$Q24","v":0},null,{"$f":"'[4]Final Recon - Summary'!G25","v":0},{"$f":"'Final Recon - Details (SUD)'!$G24+'Final Recon - Details (SUD)'!$I24+'Final Recon - Details (SUD)'!$K24+'Final Recon - Details (SUD)'!$M24+'Final Recon - Details (SUD)'!$O24+'Final Recon - Details (SUD)'!$Q24","v":0},0]
[0,"Interactive Complexity","Per Occurrence",13.74,{"$f":"'Final Recon - Details (SUD)'!$G25+'Final Recon - Details (SUD)'!$I25+'Final Recon - Details (SUD)'!$K25+'Final Recon - Details (SUD)'!$M25+'Final Recon - Details (SUD)'!$Q25+'Final Recon - Details (SUD)'!$O25","v":0},0,null,0,null,{"$f":"'Final Recon - Details (SUD)'!$I25*'Final Recon - Details (SUD)'!$D25","v":0},null,{"$f":"'Final Recon - Details (SUD)'!$D25*'Final Recon - Details (SUD)'!$K25","v":0},null,{"$f":"'Final Recon - Details (SUD)'!$D25*'Final Recon - Details (SUD)'!$M25","v":0},null,{"$f":"'Final Recon - Details (SUD)'!$D25*'Final Recon - Details (SUD)'!$O25","v":0},null,{"$f":"'Final Recon - Details (SUD)'!$D25*'Final Recon - Details (SUD)'!$Q25","v":0},null,{"$f":"'[4]Final Recon - Summary'!G26","v":0},{"$f":"'Final Recon - Details (SUD)'!$G25+'Final Recon - Details (SUD)'!$I25+'Final Recon - Details (SUD)'!$K25+'Final Recon - Details (SUD)'!$M25+'Final Recon - Details (SUD)'!$O25+'Final Recon - Details (SUD)'!$Q25","v":0},0]
[0,"Group - Alcohol and Drug Counselor","Per Billable Minute",0.92999999999999994,{"$f":"'Final Recon - Details (SUD)'!$G26+'Final Recon - Details (SUD)'!$I26+'Final Recon - Details (SUD)'!$K26+'Final Recon - Details (SUD)'!$M26+'Final Recon - Details (SUD)'!$Q26+'Final Recon - Details (SUD)'!$O26","v":0},0,null,0,null,{"$f":"'Final Recon - Details (SUD)'!$I26*'Final Recon - Details (SUD)'!$D26","v":0},null,{"$f":"'Final Recon - Details (SUD)'!$D26*'Final Recon - Details (SUD)'!$K26","v":0},null,{"$f":"'Final Recon - Details (SUD)'!$D26*'Final Recon - Details (SUD)'!$M26","v":0},null,{"$f":"'Final Recon - Details (SUD)'!$D26*'Final Recon - Details (SUD)'!$O26","v":0},null,{"$f":"'Final Recon - Details (SUD)'!$D26*'Final Recon - Details (SUD)'!$Q26","v":0},null,{"$f":"'[4]Final Recon - Summary'!G27","v":0},{"$f":"'Final Recon - Details (SUD)'!$G26+'Final Recon - Details (SUD)'!$I26+'Final Recon - Details (SUD)'!$K26+'Final Recon - Details (SUD)'!$M26+'Final Recon - Details (SUD)'!$O26+'Final Recon - Details (SUD)'!$Q26","v":0},0]
[0,"Group - Licensed Psychiatric Technician","Per Billable Minute",0.79,{"$f":"'Final Recon - Details (SUD)'!$G27+'Final Recon - Details (SUD)'!$I27+'Final Recon - Details (SUD)'!$K27+'Final Recon - Details (SUD)'!$M27+'Final Recon - Details (SUD)'!$Q27+'Final Recon - Details (SUD)'!$O27","v":0},0,null,0,null,{"$f":"'Final Recon - Details (SUD)'!$I27*'Final Recon - Details (SUD)'!$D27","v":0},null,{"$f":"'Final Recon - Details (SUD)'!$D27*'Final Recon - Details (SUD)'!$K27","v":0},null,{"$f":"'Final Recon - Details (SUD)'!$D27*'Final Recon - Details (SUD)'!$M27","v":0},null,{"$f":"'Final Recon - Details (SUD)'!$D27*'Final Recon - Details (SUD)'!$O27","v":0},null,{"$f":"'Final Recon - Details (SUD)'!$D27*'Final Recon - Details (SUD)'!$Q27","v":0},null,{"$f":"'[4]Final Recon - Summary'!G28","v":0},{"$f":"'Final Recon - Details (SUD)'!$G27+'Final Recon - Details (SUD)'!$I27+'Final Recon - Details (SUD)'!$K27+'Final Recon - Details (SUD)'!$M27+'Final Recon - Details (SUD)'!$O27+'Final Recon - Details (SUD)'!$Q27","v":0},0]
[0,"Group - Licensed Physician (MD)","Per Billable Minute",2.42,{"$f":"'Final Recon - Details (SUD)'!$G28+'Final Recon - Details (SUD)'!$I28+'Final Recon - Details (SUD)'!$K28+'Final Recon - Details (SUD)'!$M28+'Final Recon - Details (SUD)'!$Q28+'Final Recon - Details (SUD)'!$O28","v":0},0,null,0,null,{"$f":"'Final Recon - Details (SUD)'!$I28*'Final Recon - Details (SUD)'!$D28","v":0},null,{"$f":"'Final Recon - Details (SUD)'!$D28*'Final Recon - Details (SUD)'!$K28","v":0},null,{"$f":"'Final Recon - Details (SUD)'!$D28*'Final Recon - Details (SUD)'!$M28","v":0},null,{"$f":"'Final Recon - Details (SUD)'!$D28*'Final Recon - Details (SUD)'!$O28","v":0},null,{"$f":"'Final Recon - Details (SUD)'!$D28*'Final Recon - Details (SUD)'!$Q28","v":0},null,{"$f":"'[4]Final Recon - Summary'!G29","v":0},{"$f":"'Final Recon - Details (SUD)'!$G28+'Final Recon - Details (SUD)'!$I28+'Final Recon - Details (SUD)'!$K28+'Final Recon - Details (SUD)'!$M28+'Final Recon - Details (SUD)'!$O28+'Final Recon - Details (SUD)'!$Q28","v":0},0]
[0,"Group - Licensed Vocational Nurse","Per Billable Minute",0.91999999999999993,{"$f":"'Final Recon - Details (SUD)'!$G29+'Final Recon - Details (SUD)'!$I29+'Final Recon - Details (SUD)'!$K29+'Final Recon - Details (SUD)'!$M29+'Final Recon - Details (SUD)'!$Q29+'Final Recon - Details (SUD)'!$O29","v":0},0,null,0,null,{"$f":"'Final Recon - Details (SUD)'!$I29*'Final Recon - Details (SUD)'!$D29","v":0},null,{"$f":"'Final Recon - Details (SUD)'!$D29*'Final Recon - Details (SUD)'!$K29","v":0},null,{"$f":"'Final Recon - Details (SUD)'!$D29*'Final Recon - Details (SUD)'!$M29","v":0},null,{"$f":"'Final Recon - Details (SUD)'!$D29*'Final Recon - Details (SUD)'!$O29","v":0},null,{"$f":"'Final Recon - Details (SUD)'!$D29*'Final Recon - Details (SUD)'!$Q29","v":0},null,{"$f":"'[4]Final Recon - Summary'!G30","v":0},{"$f":"'Final Recon - Details (SUD)'!$G29+'Final Recon - Details (SUD)'!$I29+'Final Recon - Details (SUD)'!$K29+'Final Recon - Details (SUD)'!$M29+'Final Recon - Details (SUD)'!$O29+'Final Recon - Details (SUD)'!$Q29","v":0},0]
[0,"Group - LPHA (MFT  LCSW  LPCC)/Intern or\nWaivered LPHA (MFT  LCSW  LPCC)","Per Billable Minute",1.1200000000000001,{"$f":"'Final Recon - Details (SUD)'!$G30+'Final Recon - Details (SUD)'!$I30+'Final Recon - Details (SUD)'!$K30+'Final Recon - Details (SUD)'!$M30+'Final Recon - Details (SUD)'!$Q30+'Final Recon - Details (SUD)'!$O30","v":0},0,null,0,null,{"$f":"'Final Recon - Details (SUD)'!$I30*'Final Recon - Details (SUD)'!$D30","v":0},null,{"$f":"'Final Recon - Details (SUD)'!$D30*'Final Recon - Details (SUD)'!$K30","v":0},null,{"$f":"'Final Recon - Details (SUD)'!$D30*'Final Recon - Details (SUD)'!$M30","v":0},null,{"$f":"'Final Recon - Details (SUD)'!$D30*'Final Recon - Details (SUD)'!$O30","v":0},null,{"$f":"'Final Recon - Details (SUD)'!$D30*'Final Recon - Details (SUD)'!$Q30","v":0},null,{"$f":"'[4]Final Recon - Summary'!G31","v":0},{"$f":"'Final Recon - Details (SUD)'!$G30+'Final Recon - Details (SUD)'!$I30+'Final Recon - Details (SUD)'!$K30+'Final Recon - Details (SUD)'!$M30+'Final Recon - Details (SUD)'!$O30+'Final Recon - Details (SUD)'!$Q30","v":0},0]
[0,"Group - Medical Assistant","Per Billable Minute",0.63,{"$f":"'Final Recon - Details (SUD)'!$G31+'Final Recon - Details (SUD)'!$I31+'Final Recon - Details (SUD)'!$K31+'Final Recon - Details (SUD)'!$M31+'Final Recon - Details (SUD)'!$Q31+'Final Recon - Details (SUD)'!$O31","v":0},0,null,0,null,{"$f":"'Final Recon - Details (SUD)'!$I31*'Final Recon - Details (SUD)'!$D31","v":0},null,{"$f":"'Final Recon - Details (SUD)'!$D31*'Final Recon - Details (SUD)'!$K31","v":0},null,{"$f":"'Final Recon - Details (SUD)'!$D31*'Final Recon - Details (SUD)'!$M31","v":0},null,{"$f":"'Final Recon - Details (SUD)'!$D31*'Final Recon - Details (SUD)'!$O31","v":0},null,{"$f":"'Final Recon - Details (SUD)'!$D31*'Final Recon - Details (SUD)'!$Q31","v":0},null,{"$f":"'[4]Final Recon - Summary'!G32","v":0},{"$f":"'Final Recon - Details (SUD)'!$G31+'Final Recon - Details (SUD)'!$I31+'Final Recon - Details (SUD)'!$K31+'Final Recon - Details (SUD)'!$M31+'Final Recon - Details (SUD)'!$O31+'Final Recon - Details (SUD)'!$Q31","v":0},0]
[0,"Group - Nurse Practitioner","Per Billable Minute",2.1399999999999997,{"$f":"'Final Recon - Details (SUD)'!$G32+'Final Recon - Details (SUD)'!$I32+'Final Recon - Details (SUD)'!$K32+'Final Recon - Details (SUD)'!$M32+'Final Recon - Details (SUD)'!$Q32+'Final Recon - Details (SUD)'!$O32","v":0},0,null,0,null,{"$f":"'Final Recon - Details (SUD)'!$I32*'Final Recon - Details (SUD)'!$D32","v":0},null,{"$f":"'Final Recon - Details (SUD)'!$D32*'Final Recon - Details (SUD)'!$K32","v":0},null,{"$f":"'Final Recon - Details (SUD)'!$D32*'Final Recon - Details (SUD)'!$M32","v":0},null,{"$f":"'Final Recon - Details (SUD)'!$D32*'Final Recon - Details (SUD)'!$O32","v":0},null,{"$f":"'Final Recon - Details (SUD)'!$D32*'Final Recon - Details (SUD)'!$Q32","v":0},null,{"$f":"'[4]Final Recon - Summary'!G33","v":0},{"$f":"'Final Recon - Details (SUD)'!$G32+'Final Recon - Details (SUD)'!$I32+'Final Recon - Details (SUD)'!$K32+'Final Recon - Details (SUD)'!$M32+'Final Recon - Details (SUD)'!$O32+'Final Recon - Details (SUD)'!$Q32","v":0},0]
[0,"Group - Occupational Therapist","Per Billable Minute",1.49,{"$f":"'Final Recon - Details (SUD)'!$G33+'Final Recon - Details (SUD)'!$I33+'Final Recon - Details (SUD)'!$K33+'Final Recon - Details (SUD)'!$M33+'Final Recon - Details (SUD)'!$Q33+'Final Recon - Details (SUD)'!$O33","v":0},0,null,0,null,{"$f":"'Final Recon - Details (SUD)'!$I33*'Final Recon - Details (SUD)'!$D33","v":0},null,{"$f":"'Final Recon - Details (SUD)'!$D33*'Final Recon - Details (SUD)'!$K33","v":0},null,{"$f":"'Final Recon - Details (SUD)'!$D33*'Final Recon - Details (SUD)'!$M33","v":0},null,{"$f":"'Final Recon - Details (SUD)'!$D33*'Final Recon - Details (SUD)'!$O33","v":0},null,{"$f":"'Final Recon - Details (SUD)'!$D33*'Final Recon - Details (SUD)'!$Q33","v":0},null,{"$f":"'[4]Final Recon - Summary'!G34","v":0},{"$f":"'Final Recon - Details (SUD)'!$G33+'Final Recon - Details (SUD)'!$I33+'Final Recon - Details (SUD)'!$K33+'Final Recon - Details (SUD)'!$M33+'Final Recon - Details (SUD)'!$O33+'Final Recon - Details (SUD)'!$Q33","v":0},0]
[0,"Group - Peer Support Specialist","Per Billable Minute",0.8899999999999999,{"$f":"'Final Recon - Details (SUD)'!$G34+'Final Recon - Details (SUD)'!$I34+'Final Recon - Details (SUD)'!$K34+'Final Recon - Details (SUD)'!$M34+'Final Recon - Details (SUD)'!$Q34+'Final Recon - Details (SUD)'!$O34","v":0},0,null,0,null,{"$f":"'Final Recon - Details (SUD)'!$I34*'Final Recon - Details (SUD)'!$D34","v":0},null,{"$f":"'Final Recon - Details (SUD)'!$D34*'Final Recon - Details (SUD)'!$K34","v":0},null,{"$f":"'Final Recon - Details (SUD)'!$D34*'Final Recon - Details (SUD)'!$M34","v":0},null,{"$f":"'Final Recon - Details (SUD)'!$D34*'Final Recon - Details (SUD)'!$O34","v":0},null,{"$f":"'Final Recon - Details (SUD)'!$D34*'Final Recon - Details (SUD)'!$Q34","v":0},null,{"$f":"'[4]Final Recon - Summary'!G35","v":0},{"$f":"'Final Recon - Details (SUD)'!$G34+'Final Recon - Details (SUD)'!$I34+'Final Recon - Details (SUD)'!$K34+'Final Recon - Details (SUD)'!$M34+'Final Recon - Details (SUD)'!$O34+'Final Recon - Details (SUD)'!$Q34","v":0},0]
[0,"Group - Physician Assistant","Per Billable Minute",1.9300000000000002,{"$f":"'Final Recon - Details (SUD)'!$G35+'Final Recon - Details (SUD)'!$I35+'Final Recon - Details (SUD)'!$K35+'Final Recon - Details (SUD)'!$M35+'Final Recon - Details (SUD)'!$Q35+'Final Recon - Details (SUD)'!$O35","v":0},0,null,0,null,{"$f":"'Final Recon - Details (SUD)'!$I35*'Final Recon - Details (SUD)'!$D35","v":0},null,{"$f":"'Final Recon - Details (SUD)'!$D35*'Final Recon - Details (SUD)'!$K35","v":0},null,{"$f":"'Final Recon - Details (SUD)'!$D35*'Final Recon - Details (SUD)'!$M35","v":0},null,{"$f":"'Final Recon - Details (SUD)'!$D35*'Final Recon - Details (SUD)'!$O35","v":0},null,{"$f":"'Final Recon - Details (SUD)'!$D35*'Final Recon - Details (SUD)'!$Q35","v":0},null,{"$f":"'[4]Final Recon - Summary'!G36","v":0},{"$f":"'Final Recon - Details (SUD)'!$G35+'Final Recon - Details (SUD)'!$I35+'Final Recon - Details (SUD)'!$K35+'Final Recon - Details (SUD)'!$M35+'Final Recon - Details (SUD)'!$O35+'Final Recon - Details (SUD)'!$Q35","v":0},0]
[0,"Group - Psychologist/Pre-licensed Psychologist","Per Billable Minute",1.7300000000000002,{"$f":"'Final Recon - Details (SUD)'!$G36+'Final Recon - Details (SUD)'!$I36+'Final Recon - Details (SUD)'!$K36+'Final Recon - Details (SUD)'!$M36+'Final Recon - Details (SUD)'!$Q36+'Final Recon - Details (SUD)'!$O36","v":0},0,null,0,null,{"$f":"'Final Recon - Details (SUD)'!$I36*'Final Recon - Details (SUD)'!$D36","v":0},null,{"$f":"'Final Recon - Details (SUD)'!$D36*'Final Recon - Details (SUD)'!$K36","v":0},null,{"$f":"'Final Recon - Details (SUD)'!$D36*'Final Recon - Details (SUD)'!$M36","v":0},null,{"$f":"'Final Recon - Details (SUD)'!$D36*'Final Recon - Details (SUD)'!$O36","v":0},null,{"$f":"'Final Recon - Details (SUD)'!$D36*'Final Recon - Details (SUD)'!$Q36","v":0},null,{"$f":"'[4]Final Recon - Summary'!G37","v":0},{"$f":"'Final Recon - Details (SUD)'!$G36+'Final Recon - Details (SUD)'!$I36+'Final Recon - Details (SUD)'!$K36+'Final Recon - Details (SUD)'!$M36+'Final Recon - Details (SUD)'!$O36+'Final Recon - Details (SUD)'!$Q36","v":0},0]
[0,"Group - Registered Nurse (RN)","Per Billable Minute",1.75,{"$f":"'Final Recon - Details (SUD)'!$G37+'Final Recon - Details (SUD)'!$I37+'Final Recon - Details (SUD)'!$K37+'Final Recon - Details (SUD)'!$M37+'Final Recon - Details (SUD)'!$Q37+'Final Recon - Details (SUD)'!$O37","v":0},0,null,0,null,{"$f":"'Final Recon - Details (SUD)'!$I37*'Final Recon - Details (SUD)'!$D37","v":0},null,{"$f":"'Final Recon - Details (SUD)'!$D37*'Final Recon - Details (SUD)'!$K37","v":0},null,{"$f":"'Final Recon - Details (SUD)'!$D37*'Final Recon - Details (SUD)'!$M37","v":0},null,{"$f":"'Final Recon - Details (SUD)'!$D37*'Final Recon - Details (SUD)'!$O37","v":0},null,{"$f":"'Final Recon - Details (SUD)'!$D37*'Final Recon - Details (SUD)'!$Q37","v":0},null,{"$f":"'[4]Final Recon - Summary'!G38","v":0},{"$f":"'Final Recon - Details (SUD)'!$G37+'Final Recon - Details (SUD)'!$I37+'Final Recon - Details (SUD)'!$K37+'Final Recon - Details (SUD)'!$M37+'Final Recon - Details (SUD)'!$O37+'Final Recon - Details (SUD)'!$Q37","v":0},0]
[0,"Group - Registered Pharmacist","Per Billable Minute",2.06,{"$f":"'Final Recon - Details (SUD)'!$G38+'Final Recon - Details (SUD)'!$I38+'Final Recon - Details (SUD)'!$K38+'Final Recon - Details (SUD)'!$M38+'Final Recon - Details (SUD)'!$Q38+'Final Recon - Details (SUD)'!$O38","v":0},0,null,0,null,{"$f":"'Final Recon - Details (SUD)'!$I38*'Final Recon - Details (SUD)'!$D38","v":0},null,{"$f":"'Final Recon - Details (SUD)'!$D38*'Final Recon - Details (SUD)'!$K38","v":0},null,{"$f":"'Final Recon - Details (SUD)'!$D38*'Final Recon - Details (SUD)'!$M38","v":0},null,{"$f":"'Final Recon - Details (SUD)'!$D38*'Final Recon - Details (SUD)'!$O38","v":0},null,{"$f":"'Final Recon - Details (SUD)'!$D38*'Final Recon - Details (SUD)'!$Q38","v":0},null,{"$f":"'[4]Final Recon - Summary'!G39","v":0},{"$f":"'Final Recon - Details (SUD)'!$G38+'Final Recon - Details (SUD)'!$I38+'Final Recon - Details (SUD)'!$K38+'Final Recon - Details (SUD)'!$M38+'Final Recon - Details (SUD)'!$O38+'Final Recon - Details (SUD)'!$Q38","v":0},0]
[0,"Group - Interpreter Services","Per Billable Minute",0.34,{"$f":"'Final Recon - Details (SUD)'!$G39+'Final Recon - Details (SUD)'!$I39+'Final Recon - Details (SUD)'!$K39+'Final Recon - Details (SUD)'!$M39+'Final Recon - Details (SUD)'!$Q39+'Final Recon - Details (SUD)'!$O39","v":0},0,null,0,null,{"$f":"'Final Recon - Details (SUD)'!$I39*'Final Recon - Details (SUD)'!$D39","v":0},null,{"$f":"'Final Recon - Details (SUD)'!$D39*'Final Recon - Details (SUD)'!$K39","v":0},null,{"$f":"'Final Recon - Details (SUD)'!$D39*'Final Recon - Details (SUD)'!$M39","v":0},null,{"$f":"'Final Recon - Details (SUD)'!$D39*'Final Recon - Details (SUD)'!$O39","v":0},null,{"$f":"'Final Recon - Details (SUD)'!$D39*'Final Recon - Details (SUD)'!$Q39","v":0},null,{"$f":"'[4]Final Recon - Summary'!G40","v":0},{"$f":"'Final Recon - Details (SUD)'!$G39+'Final Recon - Details (SUD)'!$I39+'Final Recon - Details (SUD)'!$K39+'Final Recon - Details (SUD)'!$M39+'Final Recon - Details (SUD)'!$O39+'Final Recon - Details (SUD)'!$Q39","v":0},0]
[0,null,null,null,{"$f":"'Final Recon - Details (SUD)'!$G40+'Final Recon - Details (SUD)'!$I40+'Final Recon - Details (SUD)'!$K40+'Final Recon - Details (SUD)'!$M40+'Final Recon - Details (SUD)'!$Q40+'Final Recon - Details (SUD)'!$O40","v":0},0,null,0,null,{"$f":"'Final Recon - Details (SUD)'!$I40*'Final Recon - Details (SUD)'!$D40","v":0},null,{"$f":"'Final Recon - Details (SUD)'!$D40*'Final Recon - Details (SUD)'!$K40","v":0},null,{"$f":"'Final Recon - Details (SUD)'!$D40*'Final Recon - Details (SUD)'!$M40","v":0},null,{"$f":"'Final Recon - Details (SUD)'!$D40*'Final Recon - Details (SUD)'!$O40","v":0},null,{"$f":"'Final Recon - Details (SUD)'!$D40*'Final Recon - Details (SUD)'!$Q40","v":0},null,{"$f":"'[4]Final Recon - Summary'!G41","v":0},{"$f":"'Final Recon - Details (SUD)'!$G40+'Final Recon - Details (SUD)'!$I40+'Final Recon - Details (SUD)'!$K40+'Final Recon - Details (SUD)'!$M40+'Final Recon - Details (SUD)'!$O40+'Final Recon - Details (SUD)'!$Q40","v":0},0]
[0,null,null,null,{"$f":"'Final Recon - Details (SUD)'!$G41+'Final Recon - Details (SUD)'!$I41+'Final Recon - Details (SUD)'!$K41+'Final Recon - Details (SUD)'!$M41+'Final Recon - Details (SUD)'!$Q41+'Final Recon - Details (SUD)'!$O41","v":0},0,null,0,null,{"$f":"'Final Recon - Details (SUD)'!$I41*'Final Recon - Details (SUD)'!$D41","v":0},null,{"$f":"'Final Recon - Details (SUD)'!$D41*'Final Recon - Details (SUD)'!$K41","v":0},null,{"$f":"'Final Recon - Details (SUD)'!$D41*'Final Recon - Details (SUD)'!$M41","v":0},null,{"$f":"'Final Recon - Details (SUD)'!$D41*'Final Recon - Details (SUD)'!$O41","v":0},null,{"$f":"'Final Recon - Details (SUD)'!$D41*'Final Recon - Details (SUD)'!$Q41","v":0},null,{"$f":"'[4]Final Recon - Summary'!G42","v":0},{"$f":"'Final Recon - Details (SUD)'!$G41+'Final Recon - Details (SUD)'!$I41+'Final Recon - Details (SUD)'!$K41+'Final Recon - Details (SUD)'!$M41+'Final Recon - Details (SUD)'!$O41+'Final Recon - Details (SUD)'!$Q41","v":0},0]
[0]
[0]
[0]
[0]
[0]
[0]
[0]
[0]
[0]
[0,{"$f":"'[4]Final Recon - Summary'!B61","v":"Total"},null,null,{"$f":"'Final Recon - Details (SUD)'!$G51+'Final Recon - Details (SUD)'!$I51+'Final Recon - Details (SUD)'!$K51+'Final Recon - Details (SUD)'!$M51+'Final Recon - Details (SUD)'!$Q51+'Final Recon - Details (SUD)'!$O51","v":0},{"$f":"SUM(F9:F50)","v":0},null,{"$f":"SUM(H9:H50)","v":0},null,{"$f":"SUM(J9:J50)","v":0},null,{"$f":"SUM(L9:L50)","v":0},null,{"$f":"SUM(N9:N50)","v":0},null,{"$f":"SUM(P9:P50)","v":0},null,{"$f":"SUM(R9:R50)","v":0}]
[]
["BEHAVIORAL HEALTH SERVICES"]
["Fical Year-End Units Details"]
[]
[null,"Contractor:",{"$f":"C4","v":0}]
[null,"Contract #:",{"$f":"C5","v":0}]
[null,"Program Name:",{"$f":"'[4]Final Recon - Summary'!C77","v":"Program 2"}]
[]
["Column1","Service Modalities","Unit","Rate","Final TUOS Units Reconciliation","Final Amount Reconciliation","ODS DMC General Units","ODS DMC General Amount","ODS General Units","ODS General Amount","ODS DMC AB109 Units","ODS DMC AB109 Amount","ODS AB109 Units","ODS AB109 Amount","SUD Non-Billable Units","SUD Non-Billable Amount","Room & Board Units","Room & Board Amount",null,"Total Units (Summary)","Total Units (Details)","Checkpoint"]
[{"$f":"$C$5","v":0},{"$f":"'[4]Final Recon - Summary'!B81","v":"Individual - Alcohol and Drug Counselor"},{"$f":"'[4]Final Recon - Summary'!C81","v":"Per Billable Minute"},{"$f":"'[4]Final Recon - Summary'!D81","v":4.8600000000000003},{"$f":"UnitsDetails43[[#This Row],[ODS DMC General Units]]+UnitsDetails43[[#This Row],[ODS General Units]]+UnitsDetails43[[#This Row],[ODS DMC AB109 Units]]+UnitsDetails43[[#This Row],[ODS AB109 Units]]+UnitsDetails43[[#This Row],[Room & Board Units]]+UnitsDetails43[[#This Row],[SUD Non-Billable Units]]","v":0},{"$f":"+D61*E61","v":0},null,{"$f":"+D61*G61","v":0},null,{"$f":"UnitsDetails43[[#This Row],[ODS General Units]]*UnitsDetails43[[#This Row],[Rate]]","v":0},null,{"$f":"UnitsDetails43[[#This Row],[Rate]]*UnitsDetails43[[#This Row],[ODS DMC AB109 Units]]","v":0},null,{"$f":"UnitsDetails43[[#This Row],[Rate]]*UnitsDetails43[[#This Row],[ODS AB109 Units]]","v":0},null,{"$f":"UnitsDetails43[[#This Row],[Rate]]*UnitsDetails43[[#This Row],[SUD Non-Billable Units]]","v":0},null,{"$f":"UnitsDetails43[[#This Row],[Rate]]*UnitsDetails43[[#This Row],[Room & Board Units]]","v":0},null,{"$f":"'[4]Final Recon - Summary'!G81","v":0},{"$f":"UnitsDetails43[[#This Row],[ODS DMC General Units]]+UnitsDetails43[[#This Row],[ODS General Units]]+UnitsDetails43[[#This Row],[ODS DMC AB109 Units]]+UnitsDetails43[[#This Row],[ODS AB109 Units]]+UnitsDetails43[[#This Row],[SUD Non-Billable Units]]+UnitsDetails43[[#This Row],[Room & Board Units]]","v":0},{"$f":"T61-U61","v":0}]
[0,{"$f":"'[4]Final Recon - Summary'!B82","v":"Individual - Clinical Nurse Specialist"},{"$f":"'[4]Final Recon - Summary'!C82","v":"Per Billable Minute"},{"$f":"'[4]Final Recon - Summary'!D82","v":11.18},{"$f":"UnitsDetails43[[#This Row],[ODS DMC General Units]]+UnitsDetails43[[#This Row],[ODS General Units]]+UnitsDetails43[[#This Row],[ODS DMC AB109 Units]]+UnitsDetails43[[#This Row],[ODS AB109 Units]]+UnitsDetails43[[#This Row],[Room & Board Units]]+UnitsDetails43[[#This Row],[SUD Non-Billable Units]]","v":0},0,null,0,null,{"$f":"UnitsDetails43[[#This Row],[ODS General Units]]*UnitsDetails43[[#This Row],[Rate]]","v":0},null,{"$f":"UnitsDetails43[[#This Row],[Rate]]*UnitsDetails43[[#This Row],[ODS DMC AB109 Units]]","v":0},null,{"$f":"UnitsDetails43[[#This Row],[Rate]]*UnitsDetails43[[#This Row],[ODS AB109 Units]]","v":0},null,{"$f":"UnitsDetails43[[#This Row],[Rate]]*UnitsDetails43[[#This Row],[SUD Non-Billable Units]]","v":0},null,{"$f":"UnitsDetails43[[#This Row],[Rate]]*UnitsDetails43[[#This Row],[Room & Board Units]]","v":0},null,{"$f":"'[4]Final Recon - Summary'!G82","v":0},{"$f":"UnitsDetails43[[#This Row],[ODS DMC General Units]]+UnitsDetails43[[#This Row],[ODS General Units]]+UnitsDetails43[[#This Row],[ODS DMC AB109 Units]]+UnitsDetails43[[#This Row],[ODS AB109 Units]]+UnitsDetails43[[#This Row],[SUD Non-Billable Units]]+UnitsDetails43[[#This Row],[Room & Board Units]]","v":0},0]
[0,{"$f":"'[4]Final Recon - Summary'!B83","v":"Individual - Community Health Worker"},{"$f":"'[4]Final Recon - Summary'!C83","v":"Per Billable Minute"},{"$f":"'[4]Final Recon - Summary'!D83","v":4.5199999999999996},{"$f":"UnitsDetails43[[#This Row],[ODS DMC General Units]]+UnitsDetails43[[#This Row],[ODS General Units]]+UnitsDetails43[[#This Row],[ODS DMC AB109 Units]]+UnitsDetails43[[#This Row],[ODS AB109 Units]]+UnitsDetails43[[#This Row],[Room & Board Units]]+UnitsDetails43[[#This Row],[SUD Non-Billable Units]]","v":0},0,null,0,null,{"$f":"UnitsDetails43[[#This Row],[ODS General Units]]*UnitsDetails43[[#This Row],[Rate]]","v":0},null,{"$f":"UnitsDetails43[[#This Row],[Rate]]*UnitsDetails43[[#This Row],[ODS DMC AB109 Units]]","v":0},null,{"$f":"UnitsDetails43[[#This Row],[Rate]]*UnitsDetails43[[#This Row],[ODS AB109 Units]]","v":0},null,{"$f":"UnitsDetails43[[#This Row],[Rate]]*UnitsDetails43[[#This Row],[SUD Non-Billable Units]]","v":0},null,{"$f":"UnitsDetails43[[#This Row],[Rate]]*UnitsDetails43[[#This Row],[Room & Board Units]]","v":0},null,{"$f":"'[4]Final Recon - Summary'!G83","v":0},{"$f":"UnitsDetails43[[#This Row],[ODS DMC General Units]]+UnitsDetails43[[#This Row],[ODS General Units]]+UnitsDetails43[[#This Row],[ODS DMC AB109 Units]]+UnitsDetails43[[#This Row],[ODS AB109 Units]]+UnitsDetails43[[#This Row],[SUD Non-Billable Units]]+UnitsDetails43[[#This Row],[Room & Board Units]]","v":0},0]
[0,{"$f":"'[4]Final Recon - Summary'!B84","v":"Individual - Licensed Psychiatric Technician"},{"$f":"'[4]Final Recon - Summary'!C84","v":"Per Billable Minute"},{"$f":"'[4]Final Recon - Summary'!D84","v":4.1099999999999994},{"$f":"UnitsDetails43[[#This Row],[ODS DMC General Units]]+UnitsDetails43[[#This Row],[ODS General Units]]+UnitsDetails43[[#This Row],[ODS DMC AB109 Units]]+UnitsDetails43[[#This Row],[ODS AB109 Units]]+UnitsDetails43[[#This Row],[Room & Board Units]]+UnitsDetails43[[#This Row],[SUD Non-Billable Units]]","v":0},0,null,0,null,{"$f":"UnitsDetails43[[#This Row],[ODS General Units]]*UnitsDetails43[[#This Row],[Rate]]","v":0},null,{"$f":"UnitsDetails43[[#This Row],[Rate]]*UnitsDetails43[[#This Row],[ODS DMC AB109 Units]]","v":0},null,{"$f":"UnitsDetails43[[#This Row],[Rate]]*UnitsDetails43[[#This Row],[ODS AB109 Units]]","v":0},null,{"$f":"UnitsDetails43[[#This Row],[Rate]]*UnitsDetails43[[#This Row],[SUD Non-Billable Units]]","v":0},null,{"$f":"UnitsDetails43[[#This Row],[Rate]]*UnitsDetails43[[#This Row],[Room & Board Units]]","v":0},null,{"$f":"'[4]Final Recon - Summary'!G84","v":0},{"$f":"UnitsDetails43[[#This Row],[ODS DMC General Units]]+UnitsDetails43[[#This Row],[ODS General Units]]+UnitsDetails43[[#This Row],[ODS DMC AB109 Units]]+UnitsDetails43[[#This Row],[ODS AB109 Units]]+UnitsDetails43[[#This Row],[SUD Non-Billable Units]]+UnitsDetails43[[#This Row],[Room & Board Units]]","v":0},0]
[0,{"$f":"'[4]Final Recon - Summary'!B85","v":"Individual - LPHA (MFT  LCSW  LPCC)/Intern or Waivered LPHA (MFT  LCSW  LPCC)"},{"$f":"'[4]Final Recon - Summary'!C85","v":"Per Billable Minute"},{"$f":"'[4]Final Recon - Summary'!D85","v":5.85},{"$f":"UnitsDetails43[[#This Row],[ODS DMC General Units]]+UnitsDetails43[[#This Row],[ODS General Units]]+UnitsDetails43[[#This Row],[ODS DMC AB109 Units]]+UnitsDetails43[[#This Row],[ODS AB109 Units]]+UnitsDetails43[[#This Row],[Room & Board Units]]+UnitsDetails43[[#This Row],[SUD Non-Billable Units]]","v":0},0,null,0,null,{"$f":"UnitsDetails43[[#This Row],[ODS General Units]]*UnitsDetails43[[#This Row],[Rate]]","v":0},null,{"$f":"UnitsDetails43[[#This Row],[Rate]]*UnitsDetails43[[#This Row],[ODS DMC AB109 Units]]","v":0},null,{"$f":"UnitsDetails43[[#This Row],[Rate]]*UnitsDetails43[[#This Row],[ODS AB109 Units]]","v":0},null,{"$f":"UnitsDetails43[[#This Row],[Rate]]*UnitsDetails43[[#This Row],[SUD Non-Billable Units]]","v":0},null,{"$f":"UnitsDetails43[[#This Row],[Rate]]*UnitsDetails43[[#This Row],[Room & Board Units]]","v":0},null,{"$f":"'[4]Final Recon - Summary'!G85","v":0},{"$f":"UnitsDetails43[[#This Row],[ODS DMC General Units]]+UnitsDetails43[[#This Row],[ODS General Units]]+UnitsDetails43[[#This Row],[ODS DMC AB109 Units]]+UnitsDetails43[[#This Row],[ODS AB109 Units]]+UnitsDetails43[[#This Row],[SUD Non-Billable Units]]+UnitsDetails43[[#This Row],[Room & Board Units]]","v":0},0]
[0,{"$f":"'[4]Final Recon - Summary'!B86","v":"Individual - Licensed Vocational Nurse (LVN)"},{"$f":"'[4]Final Recon - Summary'!C86","v":"Per Billable Minute"},{"$f":"'[4]Final Recon - Summary'!D86","v":4.8},{"$f":"UnitsDetails43[[#This Row],[ODS DMC General Units]]+UnitsDetails43[[#This Row],[ODS General Units]]+UnitsDetails43[[#This Row],[ODS DMC AB109 Units]]+UnitsDetails43[[#This Row],[ODS AB109 Units]]+UnitsDetails43[[#This Row],[Room & Board Units]]+UnitsDetails43[[#This Row],[SUD Non-Billable Units]]","v":0},0,null,0,null,{"$f":"UnitsDetails43[[#This Row],[ODS General Units]]*UnitsDetails43[[#This Row],[Rate]]","v":0},null,{"$f":"UnitsDetails43[[#This Row],[Rate]]*UnitsDetails43[[#This Row],[ODS DMC AB109 Units]]","v":0},null,{"$f":"UnitsDetails43[[#This Row],[Rate]]*UnitsDetails43[[#This Row],[ODS AB109 Units]]","v":0},null,{"$f":"UnitsDetails43[[#This Row],[Rate]]*UnitsDetails43[[#This Row],[SUD Non-Billable Units]]","v":0},null,{"$f":"UnitsDetails43[[#This Row],[Rate]]*UnitsDetails43[[#This Row],[Room & Board Units]]","v":0},null,{"$f":"'[4]Final Recon - Summary'!G86","v":0},{"$f":"UnitsDetails43[[#This Row],[ODS DMC General Units]]+UnitsDetails43[[#This Row],[ODS General Units]]+UnitsDetails43[[#This Row],[ODS DMC AB109 Units]]+UnitsDetails43[[#This Row],[ODS AB109 Units]]+UnitsDetails43[[#This Row],[SUD Non-Billable Units]]+UnitsDetails43[[#This Row],[Room & Board Units]]","v":0},0]
[0,{"$f":"'[4]Final Recon - Summary'!B87","v":"Individual - Medical Assistant"},{"$f":"'[4]Final Recon - Summary'!C87","v":"Per Billable Minute"},{"$f":"'[4]Final Recon - Summary'!D87","v":3.3000000000000003},{"$f":"UnitsDetails43[[#This Row],[ODS DMC General Units]]+UnitsDetails43[[#This Row],[ODS General Units]]+UnitsDetails43[[#This Row],[ODS DMC AB109 Units]]+UnitsDetails43[[#This Row],[ODS AB109 Units]]+UnitsDetails43[[#This Row],[Room & Board Units]]+UnitsDetails43[[#This Row],[SUD Non-Billable Units]]","v":0},0,null,0,null,{"$f":"UnitsDetails43[[#This Row],[ODS General Units]]*UnitsDetails43[[#This Row],[Rate]]","v":0},null,{"$f":"UnitsDetails43[[#This Row],[Rate]]*UnitsDetails43[[#This Row],[ODS DMC AB109 Units]]","v":0},null,{"$f":"UnitsDetails43[[#This Row],[Rate]]*UnitsDetails43[[#This Row],[ODS AB109 Units]]","v":0},null,{"$f":"UnitsDetails43[[#This Row],[Rate]]*UnitsDetails43[[#This Row],[SUD Non-Billable Units]]","v":0},null,{"$f":"UnitsDetails43[[#This Row],[Rate]]*UnitsDetails43[[#This Row],[Room & Board Units]]","v":0},null,{"$f":"'[4]Final Recon - Summary'!G87","v":0},{"$f":"UnitsDetails43[[#This Row],[ODS DMC General Units]]+UnitsDetails43[[#This Row],[ODS General Units]]+UnitsDetails43[[#This Row],[ODS DMC AB109 Units]]+UnitsDetails43[[#This Row],[ODS AB109 Units]]+UnitsDetails43[[#This Row],[SUD Non-Billable Units]]+UnitsDetails43[[#This Row],[Room & Board Units]]","v":0},0]
[0,{"$f":"'[4]Final Recon - Summary'!B88","v":"Individual - Mental Health Rehabilitation Specialist"},{"$f":"'[4]Final Recon - Summary'!C88","v":"Per Billable Minute"},{"$f":"'[4]Final Recon - Summary'!D88","v":4.4000000000000004},{"$f":"UnitsDetails43[[#This Row],[ODS DMC General Units]]+UnitsDetails43[[#This Row],[ODS General Units]]+UnitsDetails43[[#This Row],[ODS DMC AB109 Units]]+UnitsDetails43[[#This Row],[ODS AB109 Units]]+UnitsDetails43[[#This Row],[Room & Board Units]]+UnitsDetails43[[#This Row],[SUD Non-Billable Units]]","v":0},0,null,0,null,{"$f":"UnitsDetails43[[#This Row],[ODS General Units]]*UnitsDetails43[[#This Row],[Rate]]","v":0},null,{"$f":"UnitsDetails43[[#This Row],[Rate]]*UnitsDetails43[[#This Row],[ODS DMC AB109 Units]]","v":0},null,{"$f":"UnitsDetails43[[#This Row],[Rate]]*UnitsDetails43[[#This Row],[ODS AB109 Units]]","v":0},null,{"$f":"UnitsDetails43[[#This Row],[Rate]]*UnitsDetails43[[#This Row],[SUD Non-Billable Units]]","v":0},null,{"$f":"UnitsDetails43[[#This Row],[Rate]]*UnitsDetails43[[#This Row],[Room & Board Units]]","v":0},null,{"$f":"'[4]Final Recon - Summary'!G88","v":0},{"$f":"UnitsDetails43[[#This Row],[ODS DMC General Units]]+UnitsDetails43[[#This Row],[ODS General Units]]+UnitsDetails43[[#This Row],[ODS DMC AB109 Units]]+UnitsDetails43[[#This Row],[ODS AB109 Units]]+UnitsDetails43[[#This Row],[SUD Non-Billable Units]]+UnitsDetails43[[#This Row],[Room & Board Units]]","v":0},0]
[0,{"$f":"'[4]Final Recon - Summary'!B89","v":"Individual - Nurse Practitioner"},{"$f":"'[4]Final Recon - Summary'!C89","v":"Per Billable Minute"},{"$f":"'[4]Final Recon - Summary'!D89","v":11.18},{"$f":"UnitsDetails43[[#This Row],[ODS DMC General Units]]+UnitsDetails43[[#This Row],[ODS General Units]]+UnitsDetails43[[#This Row],[ODS DMC AB109 Units]]+UnitsDetails43[[#This Row],[ODS AB109 Units]]+UnitsDetails43[[#This Row],[Room & Board Units]]+UnitsDetails43[[#This Row],[SUD Non-Billable Units]]","v":0},0,null,0,null,{"$f":"UnitsDetails43[[#This Row],[ODS General Units]]*UnitsDetails43[[#This Row],[Rate]]","v":0},null,{"$f":"UnitsDetails43[[#This Row],[Rate]]*UnitsDetails43[[#This Row],[ODS DMC AB109 Units]]","v":0},null,{"$f":"UnitsDetails43[[#This Row],[Rate]]*UnitsDetails43[[#This Row],[ODS AB109 Units]]","v":0},null,{"$f":"UnitsDetails43[[#This Row],[Rate]]*UnitsDetails43[[#This Row],[SUD Non-Billable Units]]","v":0},null,{"$f":"UnitsDetails43[[#This Row],[Rate]]*UnitsDetails43[[#This Row],[Room & Board Units]]","v":0},null,{"$f":"'[4]Final Recon - Summary'!G89","v":0},{"$f":"UnitsDetails43[[#This Row],[ODS DMC General Units]]+UnitsDetails43[[#This Row],[ODS General Units]]+UnitsDetails43[[#This Row],[ODS DMC AB109 Units]]+UnitsDetails43[[#This Row],[ODS AB109 Units]]+UnitsDetails43[[#This Row],[SUD Non-Billable Units]]+UnitsDetails43[[#This Row],[Room & Board Units]]","v":0},0]
[0,{"$f":"'[4]Final Recon - Summary'!B90","v":"Individual - Occupational Therapist"},{"$f":"'[4]Final Recon - Summary'!C90","v":"Per Billable Minute"},{"$f":"'[4]Final Recon - Summary'!D90","v":7.8},{"$f":"UnitsDetails43[[#This Row],[ODS DMC General Units]]+UnitsDetails43[[#This Row],[ODS General Units]]+UnitsDetails43[[#This Row],[ODS DMC AB109 Units]]+UnitsDetails43[[#This Row],[ODS AB109 Units]]+UnitsDetails43[[#This Row],[Room & Board Units]]+UnitsDetails43[[#This Row],[SUD Non-Billable Units]]","v":0},0,null,0,null,{"$f":"UnitsDetails43[[#This Row],[ODS General Units]]*UnitsDetails43[[#This Row],[Rate]]","v":0},null,{"$f":"UnitsDetails43[[#This Row],[Rate]]*UnitsDetails43[[#This Row],[ODS DMC AB109 Units]]","v":0},null,{"$f":"UnitsDetails43[[#This Row],[Rate]]*UnitsDetails43[[#This Row],[ODS AB109 Units]]","v":0},null,{"$f":"UnitsDetails43[[#This Row],[Rate]]*UnitsDetails43[[#This Row],[SUD Non-Billable Units]]","v":0},null,{"$f":"UnitsDetails43[[#This Row],[Rate]]*UnitsDetails43[[#This Row],[Room & Board Units]]","v":0},null,{"$f":"'[4]Final Recon - Summary'!G90","v":0},{"$f":"UnitsDetails43[[#This Row],[ODS DMC General Units]]+UnitsDetails43[[#This Row],[ODS General Units]]+UnitsDetails43[[#This Row],[ODS DMC AB109 Units]]+UnitsDetails43[[#This Row],[ODS AB109 Units]]+UnitsDetails43[[#This Row],[SUD Non-Billable Units]]+UnitsDetails43[[#This Row],[Room & Board Units]]","v":0},0]
[0,{"$f":"'[4]Final Recon - Summary'!B91","v":"Individual - Other Qualified Providers - Other Designated MH staff that bill medical"},{"$f":"'[4]Final Recon - Summary'!C91","v":"Per Billable Minute"},{"$f":"'[4]Final Recon - Summary'!D91","v":4.4000000000000004},{"$f":"UnitsDetails43[[#This Row],[ODS DMC General Units]]+UnitsDetails43[[#This Row],[ODS General Units]]+UnitsDetails43[[#This Row],[ODS DMC AB109 Units]]+UnitsDetails43[[#This Row],[ODS AB109 Units]]+UnitsDetails43[[#This Row],[Room & Board Units]]+UnitsDetails43[[#This Row],[SUD Non-Billable Units]]","v":0},0,null,0,null,{"$f":"UnitsDetails43[[#This Row],[ODS General Units]]*UnitsDetails43[[#This Row],[Rate]]","v":0},null,{"$f":"UnitsDetails43[[#This Row],[Rate]]*UnitsDetails43[[#This Row],[ODS DMC AB109 Units]]","v":0},null,{"$f":"UnitsDetails43[[#This Row],[Rate]]*UnitsDetails43[[#This Row],[ODS AB109 Units]]","v":0},null,{"$f":"UnitsDetails43[[#This Row],[Rate]]*UnitsDetails43[[#This Row],[SUD Non-Billable Units]]","v":0},null,{"$f":"UnitsDetails43[[#This Row],[Rate]]*UnitsDetails43[[#This Row],[Room & Board Units]]","v":0},null,{"$f":"'[4]Final Recon - Summary'!G91","v":0},{"$f":"UnitsDetails43[[#This Row],[ODS DMC General Units]]+UnitsDetails43[[#This Row],[ODS General Units]]+UnitsDetails43[[#This Row],[ODS DMC AB109 Units]]+UnitsDetails43[[#This Row],[ODS AB109 Units]]+UnitsDetails43[[#This Row],[SUD Non-Billable Units]]+UnitsDetails43[[#This Row],[Room & Board Units]]","v":0},0]
[0,{"$f":"'[4]Final Recon - Summary'!B92","v":"Individual - Peer Support Specialist"},{"$f":"'[4]Final Recon - Summary'!C92","v":"Per Billable Minute"},{"$f":"'[4]Final Recon - Summary'!D92","v":4.62},{"$f":"UnitsDetails43[[#This Row],[ODS DMC General Units]]+UnitsDetails43[[#This Row],[ODS General Units]]+UnitsDetails43[[#This Row],[ODS DMC AB109 Units]]+UnitsDetails43[[#This Row],[ODS AB109 Units]]+UnitsDetails43[[#This Row],[Room & Board Units]]+UnitsDetails43[[#This Row],[SUD Non-Billable Units]]","v":0},0,null,0,null,{"$f":"UnitsDetails43[[#This Row],[ODS General Units]]*UnitsDetails43[[#This Row],[Rate]]","v":0},null,{"$f":"UnitsDetails43[[#This Row],[Rate]]*UnitsDetails43[[#This Row],[ODS DMC AB109 Units]]","v":0},null,{"$f":"UnitsDetails43[[#This Row],[Rate]]*UnitsDetails43[[#This Row],[ODS AB109 Units]]","v":0},null,{"$f":"UnitsDetails43[[#This Row],[Rate]]*UnitsDetails43[[#This Row],[SUD Non-Billable Units]]","v":0},null,{"$f":"UnitsDetails43[[#This Row],[Rate]]*UnitsDetails43[[#This Row],[Room & Board Units]]","v":0},null,{"$f":"'[4]Final Recon - Summary'!G92","v":0},{"$f":"UnitsDetails43[[#This Row],[ODS DMC General Units]]+UnitsDetails43[[#This Row],[ODS General Units]]+UnitsDetails43[[#This Row],[ODS DMC AB109 Units]]+UnitsDetails43[[#This Row],[ODS AB109 Units]]+UnitsDetails43[[#This Row],[SUD Non-Billable Units]]+UnitsDetails43[[#This Row],[Room & Board Units]]","v":0},0]
[0,{"$f":"'[4]Final Recon - Summary'!B93","v":"Individual - Physician Assistant"},{"$f":"'[4]Final Recon - Summary'!C93","v":"Per Billable Minute"},{"$f":"'[4]Final Recon - Summary'!D93","v":10.09},{"$f":"UnitsDetails43[[#This Row],[ODS DMC General Units]]+UnitsDetails43[[#This Row],[ODS General Units]]+UnitsDetails43[[#This Row],[ODS DMC AB109 Units]]+UnitsDetails43[[#This Row],[ODS AB109 Units]]+UnitsDetails43[[#This Row],[Room & Board Units]]+UnitsDetails43[[#This Row],[SUD Non-Billable Units]]","v":0},0,null,0,null,{"$f":"UnitsDetails43[[#This Row],[ODS General Units]]*UnitsDetails43[[#This Row],[Rate]]","v":0},null,{"$f":"UnitsDetails43[[#This Row],[Rate]]*UnitsDetails43[[#This Row],[ODS DMC AB109 Units]]","v":0},null,{"$f":"UnitsDetails43[[#This Row],[Rate]]*UnitsDetails43[[#This Row],[ODS AB109 Units]]","v":0},null,{"$f":"UnitsDetails43[[#This Row],[Rate]]*UnitsDetails43[[#This Row],[SUD Non-Billable Units]]","v":0},null,{"$f":"UnitsDetails43[[#This Row],[Rate]]*UnitsDetails43[[#This Row],[Room & Board Units]]","v":0},null,{"$f":"'[4]Final Recon - Summary'!G93","v":0},{"$f":"UnitsDetails43[[#This Row],[ODS DMC General Units]]+UnitsDetails43[[#This Row],[ODS General Units]]+UnitsDetails43[[#This Row],[ODS DMC AB109 Units]]+UnitsDetails43[[#This Row],[ODS AB109 Units]]+UnitsDetails43[[#This Row],[SUD Non-Billable Units]]+UnitsDetails43[[#This Row],[Room & Board Units]]","v":0},0]
[0,{"$f":"'[4]Final Recon - Summary'!B94","v":"Individual - Psychologist/Pre-licensed Psychologist"},{"$f":"'[4]Final Recon - Summary'!C94","v":"Per Billable Minute"},{"$f":"'[4]Final Recon - Summary'!D94","v":9.0500000000000007},{"$f":"UnitsDetails43[[#This Row],[ODS DMC General Units]]+UnitsDetails43[[#This Row],[ODS General Units]]+UnitsDetails43[[#This Row],[ODS DMC AB109 Units]]+UnitsDetails43[[#This Row],[ODS AB109 Units]]+UnitsDetails43[[#This Row],[Room & Board Units]]+UnitsDetails43[[#This Row],[SUD Non-Billable Units]]","v":0},0,null,0,null,{"$f":"UnitsDetails43[[#This Row],[ODS General Units]]*UnitsDetails43[[#This Row],[Rate]]","v":0},null,{"$f":"UnitsDetails43[[#This Row],[Rate]]*UnitsDetails43[[#This Row],[ODS DMC AB109 Units]]","v":0},null,{"$f":"UnitsDetails43[[#This Row],[Rate]]*UnitsDetails43[[#This Row],[ODS AB109 Units]]","v":0},null,{"$f":"UnitsDetails43[[#This Row],[Rate]]*UnitsDetails43[[#This Row],[SUD Non-Billable Units]]","v":0},null,{"$f":"UnitsDetails43[[#This Row],[Rate]]*UnitsDetails43[[#This Row],[Room & Board Units]]","v":0},null,{"$f":"'[4]Final Recon - Summary'!G94","v":0},{"$f":"UnitsDetails43[[#This Row],[ODS DMC General Units]]+UnitsDetails43[[#This Row],[ODS General Units]]+UnitsDetails43[[#This Row],[ODS DMC AB109 Units]]+UnitsDetails43[[#This Row],[ODS AB109 Units]]+UnitsDetails43[[#This Row],[SUD Non-Billable Units]]+UnitsDetails43[[#This Row],[Room & Board Units]]","v":0},0]
[0,{"$f":"'[4]Final Recon - Summary'!B95","v":"Individual - Psychiatrist/ Contracted Psychiatrist/Licensed Physician (MD)"},{"$f":"'[4]Final Recon - Summary'!C95","v":"Per Billable Minute"},{"$f":"'[4]Final Recon - Summary'!D95","v":11.57},{"$f":"UnitsDetails43[[#This Row],[ODS DMC General Units]]+UnitsDetails43[[#This Row],[ODS General Units]]+UnitsDetails43[[#This Row],[ODS DMC AB109 Units]]+UnitsDetails43[[#This Row],[ODS AB109 Units]]+UnitsDetails43[[#This Row],[Room & Board Units]]+UnitsDetails43[[#This Row],[SUD Non-Billable Units]]","v":0},0,null,0,null,{"$f":"UnitsDetails43[[#This Row],[ODS General Units]]*UnitsDetails43[[#This Row],[Rate]]","v":0},null,{"$f":"UnitsDetails43[[#This Row],[Rate]]*UnitsDetails43[[#This Row],[ODS DMC AB109 Units]]","v":0},null,{"$f":"UnitsDetails43[[#This Row],[Rate]]*UnitsDetails43[[#This Row],[ODS AB109 Units]]","v":0},null,{"$f":"UnitsDetails43[[#This Row],[Rate]]*UnitsDetails43[[#This Row],[SUD Non-Billable Units]]","v":0},null,{"$f":"UnitsDetails43[[#This Row],[Rate]]*UnitsDetails43[[#This Row],[Room & Board Units]]","v":0},null,{"$f":"'[4]Final Recon - Summary'!G95","v":0},{"$f":"UnitsDetails43[[#This Row],[ODS DMC General Units]]+UnitsDetails43[[#This Row],[ODS General Units]]+UnitsDetails43[[#This Row],[ODS DMC AB109 Units]]+UnitsDetails43[[#This Row],[ODS AB109 Units]]+UnitsDetails43[[#This Row],[SUD Non-Billable Units]]+UnitsDetails43[[#This Row],[Room & Board Units]]","v":0},0]
[0,{"$f":"'[4]Final Recon - Summary'!B96","v":"Individual - Registered Nurse (RN)"},{"$f":"'[4]Final Recon - Summary'!C96","v":"Per Billable Minute"},{"$f":"'[4]Final Recon - Summary'!D96","v":9.14},{"$f":"UnitsDetails43[[#This Row],[ODS DMC General Units]]+UnitsDetails43[[#This Row],[ODS General Units]]+UnitsDetails43[[#This Row],[ODS DMC AB109 Units]]+UnitsDetails43[[#This Row],[ODS AB109 Units]]+UnitsDetails43[[#This Row],[Room & Board Units]]+UnitsDetails43[[#This Row],[SUD Non-Billable Units]]","v":0},0,null,0,null,{"$f":"UnitsDetails43[[#This Row],[ODS General Units]]*UnitsDetails43[[#This Row],[Rate]]","v":0},null,{"$f":"UnitsDetails43[[#This Row],[Rate]]*UnitsDetails43[[#This Row],[ODS DMC AB109 Units]]","v":0},null,{"$f":"UnitsDetails43[[#This Row],[Rate]]*UnitsDetails43[[#This Row],[ODS AB109 Units]]","v":0},null,{"$f":"UnitsDetails43[[#This Row],[Rate]]*UnitsDetails43[[#This Row],[SUD Non-Billable Units]]","v":0},null,{"$f":"UnitsDetails43[[#This Row],[Rate]]*UnitsDetails43[[#This Row],[Room & Board Units]]","v":0},null,{"$f":"'[4]Final Recon - Summary'!G96","v":0},{"$f":"UnitsDetails43[[#This Row],[ODS DMC General Units]]+UnitsDetails43[[#This Row],[ODS General Units]]+UnitsDetails43[[#This Row],[ODS DMC AB109 Units]]+UnitsDetails43[[#This Row],[ODS AB109 Units]]+UnitsDetails43[[#This Row],[SUD Non-Billable Units]]+UnitsDetails43[[#This Row],[Room & Board Units]]","v":0},0]
[0,{"$f":"'[4]Final Recon - Summary'!B97","v":"Individual - Registered Pharmacist"},{"$f":"'[4]Final Recon - Summary'!C97","v":"Per Billable Minute"},{"$f":"'[4]Final Recon - Summary'!D97","v":10.76},{"$f":"UnitsDetails43[[#This Row],[ODS DMC General Units]]+UnitsDetails43[[#This Row],[ODS General Units]]+UnitsDetails43[[#This Row],[ODS DMC AB109 Units]]+UnitsDetails43[[#This Row],[ODS AB109 Units]]+UnitsDetails43[[#This Row],[Room & Board Units]]+UnitsDetails43[[#This Row],[SUD Non-Billable Units]]","v":0},0,null,0,null,{"$f":"UnitsDetails43[[#This Row],[ODS General Units]]*UnitsDetails43[[#This Row],[Rate]]","v":0},null,{"$f":"UnitsDetails43[[#This Row],[Rate]]*UnitsDetails43[[#This Row],[ODS DMC AB109 Units]]","v":0},null,{"$f":"UnitsDetails43[[#This Row],[Rate]]*UnitsDetails43[[#This Row],[ODS AB109 Units]]","v":0},null,{"$f":"UnitsDetails43[[#This Row],[Rate]]*UnitsDetails43[[#This Row],[SUD Non-Billable Units]]","v":0},null,{"$f":"UnitsDetails43[[#This Row],[Rate]]*UnitsDetails43[[#This Row],[Room & Board Units]]","v":0},null,{"$f":"'[4]Final Recon - Summary'!G97","v":0},{"$f":"UnitsDetails43[[#This Row],[ODS DMC General Units]]+UnitsDetails43[[#This Row],[ODS General Units]]+UnitsDetails43[[#This Row],[ODS DMC AB109 Units]]+UnitsDetails43[[#This Row],[ODS AB109 Units]]+UnitsDetails43[[#This Row],[SUD Non-Billable Units]]+UnitsDetails43[[#This Row],[Room & Board Units]]","v":0},0]
[0,{"$f":"'[4]Final Recon - Summary'!B98","v":"Individual - Interpreter Services"},{"$f":"'[4]Final Recon - Summary'!C98","v":"Per Billable Minute"},{"$f":"'[4]Final Recon - Summary'!D98","v":2.19},{"$f":"UnitsDetails43[[#This Row],[ODS DMC General Units]]+UnitsDetails43[[#This Row],[ODS General Units]]+UnitsDetails43[[#This Row],[ODS DMC AB109 Units]]+UnitsDetails43[[#This Row],[ODS AB109 Units]]+UnitsDetails43[[#This Row],[Room & Board Units]]+UnitsDetails43[[#This Row],[SUD Non-Billable Units]]","v":0},0,null,0,null,{"$f":"UnitsDetails43[[#This Row],[ODS General Units]]*UnitsDetails43[[#This Row],[Rate]]","v":0},null,{"$f":"UnitsDetails43[[#This Row],[Rate]]*UnitsDetails43[[#This Row],[ODS DMC AB109 Units]]","v":0},null,{"$f":"UnitsDetails43[[#This Row],[Rate]]*UnitsDetails43[[#This Row],[ODS AB109 Units]]","v":0},null,{"$f":"UnitsDetails43[[#This Row],[Rate]]*UnitsDetails43[[#This Row],[SUD Non-Billable Units]]","v":0},null,{"$f":"UnitsDetails43[[#This Row],[Rate]]*UnitsDetails43[[#This Row],[Room & Board Units]]","v":0},null,{"$f":"'[4]Final Recon - Summary'!G98","v":0},{"$f":"UnitsDetails43[[#This Row],[ODS DMC General Units]]+UnitsDetails43[[#This Row],[ODS General Units]]+UnitsDetails43[[#This Row],[ODS DMC AB109 Units]]+UnitsDetails43[[#This Row],[ODS AB109 Units]]+UnitsDetails43[[#This Row],[SUD Non-Billable Units]]+UnitsDetails43[[#This Row],[Room & Board Units]]","v":0},0]
[0,{"$f":"'[4]Final Recon - Summary'!B99","v":"Interactive Complexity"},{"$f":"'[4]Final Recon - Summary'!C99","v":"Per Occurrence"},{"$f":"'[4]Final Recon - Summary'!D99","v":14.61},{"$f":"UnitsDetails43[[#This Row],[ODS DMC General Units]]+UnitsDetails43[[#This Row],[ODS General Units]]+UnitsDetails43[[#This Row],[ODS DMC AB109 Units]]+UnitsDetails43[[#This Row],[ODS AB109 Units]]+UnitsDetails43[[#This Row],[Room & Board Units]]+UnitsDetails43[[#This Row],[SUD Non-Billable Units]]","v":0},0,null,0,null,{"$f":"UnitsDetails43[[#This Row],[ODS General Units]]*UnitsDetails43[[#This Row],[Rate]]","v":0},null,{"$f":"UnitsDetails43[[#This Row],[Rate]]*UnitsDetails43[[#This Row],[ODS DMC AB109 Units]]","v":0},null,{"$f":"UnitsDetails43[[#This Row],[Rate]]*UnitsDetails43[[#This Row],[ODS AB109 Units]]","v":0},null,{"$f":"UnitsDetails43[[#This Row],[Rate]]*UnitsDetails43[[#This Row],[SUD Non-Billable Units]]","v":0},null,{"$f":"UnitsDetails43[[#This Row],[Rate]]*UnitsDetails43[[#This Row],[Room & Board Units]]","v":0},null,{"$f":"'[4]Final Recon - Summary'!G99","v":0},{"$f":"UnitsDetails43[[#This Row],[ODS DMC General Units]]+UnitsDetails43[[#This Row],[ODS General Units]]+UnitsDetails43[[#This Row],[ODS DMC AB109 Units]]+UnitsDetails43[[#This Row],[ODS AB109 Units]]+UnitsDetails43[[#This Row],[SUD Non-Billable Units]]+UnitsDetails43[[#This Row],[Room & Board Units]]","v":0},0]
[0,{"$f":"'[4]Final Recon - Summary'!B100","v":"Parent-Child Interaction Therapy (PCIT Modifier 22)"},{"$f":"'[4]Final Recon - Summary'!C100","v":"Per Occurrence"},{"$f":"'[4]Final Recon - Summary'!D100","v":2.8},{"$f":"UnitsDetails43[[#This Row],[ODS DMC General Units]]+UnitsDetails43[[#This Row],[ODS General Units]]+UnitsDetails43[[#This Row],[ODS DMC AB109 Units]]+UnitsDetails43[[#This Row],[ODS AB109 Units]]+UnitsDetails43[[#This Row],[Room & Board Units]]+UnitsDetails43[[#This Row],[SUD Non-Billable Units]]","v":0},0,null,0,null,{"$f":"UnitsDetails43[[#This Row],[ODS General Units]]*UnitsDetails43[[#This Row],[Rate]]","v":0},null,{"$f":"UnitsDetails43[[#This Row],[Rate]]*UnitsDetails43[[#This Row],[ODS DMC AB109 Units]]","v":0},null,{"$f":"UnitsDetails43[[#This Row],[Rate]]*UnitsDetails43[[#This Row],[ODS AB109 Units]]","v":0},null,{"$f":"UnitsDetails43[[#This Row],[Rate]]*UnitsDetails43[[#This Row],[SUD Non-Billable Units]]","v":0},null,{"$f":"UnitsDetails43[[#This Row],[Rate]]*UnitsDetails43[[#This Row],[Room & Board Units]]","v":0},null,{"$f":"'[4]Final Recon - Summary'!G100","v":0},{"$f":"UnitsDetails43[[#This Row],[ODS DMC General Units]]+UnitsDetails43[[#This Row],[ODS General Units]]+UnitsDetails43[[#This Row],[ODS DMC AB109 Units]]+UnitsDetails43[[#This Row],[ODS AB109 Units]]+UnitsDetails43[[#This Row],[SUD Non-Billable Units]]+UnitsDetails43[[#This Row],[Room & Board Units]]","v":0},0]
[0,{"$f":"'[4]Final Recon - Summary'!B101","v":"Group - Alcohol and Drug Counselor"},{"$f":"'[4]Final Recon - Summary'!C101","v":"Per Billable Minute"},{"$f":"'[4]Final Recon - Summary'!D101","v":1.08},{"$f":"UnitsDetails43[[#This Row],[ODS DMC General Units]]+UnitsDetails43[[#This Row],[ODS General Units]]+UnitsDetails43[[#This Row],[ODS DMC AB109 Units]]+UnitsDetails43[[#This Row],[ODS AB109 Units]]+UnitsDetails43[[#This Row],[Room & Board Units]]+UnitsDetails43[[#This Row],[SUD Non-Billable Units]]","v":0},0,null,0,null,{"$f":"UnitsDetails43[[#This Row],[ODS General Units]]*UnitsDetails43[[#This Row],[Rate]]","v":0},null,{"$f":"UnitsDetails43[[#This Row],[Rate]]*UnitsDetails43[[#This Row],[ODS DMC AB109 Units]]","v":0},null,{"$f":"UnitsDetails43[[#This Row],[Rate]]*UnitsDetails43[[#This Row],[ODS AB109 Units]]","v":0},null,{"$f":"UnitsDetails43[[#This Row],[Rate]]*UnitsDetails43[[#This Row],[SUD Non-Billable Units]]","v":0},null,{"$f":"UnitsDetails43[[#This Row],[Rate]]*UnitsDetails43[[#This Row],[Room & Board Units]]","v":0},null,{"$f":"'[4]Final Recon - Summary'!G101","v":0},{"$f":"UnitsDetails43[[#This Row],[ODS DMC General Units]]+UnitsDetails43[[#This Row],[ODS General Units]]+UnitsDetails43[[#This Row],[ODS DMC AB109 Units]]+UnitsDetails43[[#This Row],[ODS AB109 Units]]+UnitsDetails43[[#This Row],[SUD Non-Billable Units]]+UnitsDetails43[[#This Row],[Room & Board Units]]","v":0},0]
[0,{"$f":"'[4]Final Recon - Summary'!B102","v":"Group - Clinical Nurse Specialist"},{"$f":"'[4]Final Recon - Summary'!C102","v":"Per Billable Minute"},{"$f":"'[4]Final Recon - Summary'!D102","v":2.4899999999999998},{"$f":"UnitsDetails43[[#This Row],[ODS DMC General Units]]+UnitsDetails43[[#This Row],[ODS General Units]]+UnitsDetails43[[#This Row],[ODS DMC AB109 Units]]+UnitsDetails43[[#This Row],[ODS AB109 Units]]+UnitsDetails43[[#This Row],[Room & Board Units]]+UnitsDetails43[[#This Row],[SUD Non-Billable Units]]","v":0},0,null,0,null,{"$f":"UnitsDetails43[[#This Row],[ODS General Units]]*UnitsDetails43[[#This Row],[Rate]]","v":0},null,{"$f":"UnitsDetails43[[#This Row],[Rate]]*UnitsDetails43[[#This Row],[ODS DMC AB109 Units]]","v":0},null,{"$f":"UnitsDetails43[[#This Row],[Rate]]*UnitsDetails43[[#This Row],[ODS AB109 Units]]","v":0},null,{"$f":"UnitsDetails43[[#This Row],[Rate]]*UnitsDetails43[[#This Row],[SUD Non-Billable Units]]","v":0},null,{"$f":"UnitsDetails43[[#This Row],[Rate]]*UnitsDetails43[[#This Row],[Room & Board Units]]","v":0},null,{"$f":"'[4]Final Recon - Summary'!G102","v":0},{"$f":"UnitsDetails43[[#This Row],[ODS DMC General Units]]+UnitsDetails43[[#This Row],[ODS General Units]]+UnitsDetails43[[#This Row],[ODS DMC AB109 Units]]+UnitsDetails43[[#This Row],[ODS AB109 Units]]+UnitsDetails43[[#This Row],[SUD Non-Billable Units]]+UnitsDetails43[[#This Row],[Room & Board Units]]","v":0},0]
[0,{"$f":"'[4]Final Recon - Summary'!B103","v":"Group - Community Health Worker (CPT 98961)"},{"$f":"'[4]Final Recon - Summary'!C103","v":"Per Billable Minute"},{"$f":"'[4]Final Recon - Summary'!D103","v":1.51},{"$f":"UnitsDetails43[[#This Row],[ODS DMC General Units]]+UnitsDetails43[[#This Row],[ODS General Units]]+UnitsDetails43[[#This Row],[ODS DMC AB109 Units]]+UnitsDetails43[[#This Row],[ODS AB109 Units]]+UnitsDetails43[[#This Row],[Room & Board Units]]+UnitsDetails43[[#This Row],[SUD Non-Billable Units]]","v":0},0,null,0,null,{"$f":"UnitsDetails43[[#This Row],[ODS General Units]]*UnitsDetails43[[#This Row],[Rate]]","v":0},null,{"$f":"UnitsDetails43[[#This Row],[Rate]]*UnitsDetails43[[#This Row],[ODS DMC AB109 Units]]","v":0},null,{"$f":"UnitsDetails43[[#This Row],[Rate]]*UnitsDetails43[[#This Row],[ODS AB109 Units]]","v":0},null,{"$f":"UnitsDetails43[[#This Row],[Rate]]*UnitsDetails43[[#This Row],[SUD Non-Billable Units]]","v":0},null,{"$f":"UnitsDetails43[[#This Row],[Rate]]*UnitsDetails43[[#This Row],[Room & Board Units]]","v":0},null,{"$f":"'[4]Final Recon - Summary'!G103","v":0},{"$f":"UnitsDetails43[[#This Row],[ODS DMC General Units]]+UnitsDetails43[[#This Row],[ODS General Units]]+UnitsDetails43[[#This Row],[ODS DMC AB109 Units]]+UnitsDetails43[[#This Row],[ODS AB109 Units]]+UnitsDetails43[[#This Row],[SUD Non-Billable Units]]+UnitsDetails43[[#This Row],[Room & Board Units]]","v":0},0]
[0,{"$f":"'[4]Final Recon - Summary'!B104","v":"Group - Community Health Worker (CPT 98962)"},{"$f":"'[4]Final Recon - Summary'!C104","v":"Per Billable Minute"},{"$f":"'[4]Final Recon - Summary'!D104","v":0.69},{"$f":"UnitsDetails43[[#This Row],[ODS DMC General Units]]+UnitsDetails43[[#This Row],[ODS General Units]]+UnitsDetails43[[#This Row],[ODS DMC AB109 Units]]+UnitsDetails43[[#This Row],[ODS AB109 Units]]+UnitsDetails43[[#This Row],[Room & Board Units]]+UnitsDetails43[[#This Row],[SUD Non-Billable Units]]","v":0},0,null,0,null,{"$f":"UnitsDetails43[[#This Row],[ODS General Units]]*UnitsDetails43[[#This Row],[Rate]]","v":0},null,{"$f":"UnitsDetails43[[#This Row],[Rate]]*UnitsDetails43[[#This Row],[ODS DMC AB109 Units]]","v":0},null,{"$f":"UnitsDetails43[[#This Row],[Rate]]*UnitsDetails43[[#This Row],[ODS AB109 Units]]","v":0},null,{"$f":"UnitsDetails43[[#This Row],[Rate]]*UnitsDetails43[[#This Row],[SUD Non-Billable Units]]","v":0},null,{"$f":"UnitsDetails43[[#This Row],[Rate]]*UnitsDetails43[[#This Row],[Room & Board Units]]","v":0},null,{"$f":"'[4]Final Recon - Summary'!G104","v":0},{"$f":"UnitsDetails43[[#This Row],[ODS DMC General Units]]+UnitsDetails43[[#This Row],[ODS General Units]]+UnitsDetails43[[#This Row],[ODS DMC AB109 Units]]+UnitsDetails43[[#This Row],[ODS AB109 Units]]+UnitsDetails43[[#This Row],[SUD Non-Billable Units]]+UnitsDetails43[[#This Row],[Room & Board Units]]","v":0},0]
[0,{"$f":"'[4]Final Recon - Summary'!B105","v":"Group - Licensed Psychiatric Technician"},{"$f":"'[4]Final Recon - Summary'!C105","v":"Per Billable Minute"},{"$f":"'[4]Final Recon - Summary'!D105","v":0.91},{"$f":"UnitsDetails43[[#This Row],[ODS DMC General Units]]+UnitsDetails43[[#This Row],[ODS General Units]]+UnitsDetails43[[#This Row],[ODS DMC AB109 Units]]+UnitsDetails43[[#This Row],[ODS AB109 Units]]+UnitsDetails43[[#This Row],[Room & Board Units]]+UnitsDetails43[[#This Row],[SUD Non-Billable Units]]","v":0},0,null,0,null,{"$f":"UnitsDetails43[[#This Row],[ODS General Units]]*UnitsDetails43[[#This Row],[Rate]]","v":0},null,{"$f":"UnitsDetails43[[#This Row],[Rate]]*UnitsDetails43[[#This Row],[ODS DMC AB109 Units]]","v":0},null,{"$f":"UnitsDetails43[[#This Row],[Rate]]*UnitsDetails43[[#This Row],[ODS AB109 Units]]","v":0},null,{"$f":"UnitsDetails43[[#This Row],[Rate]]*UnitsDetails43[[#This Row],[SUD Non-Billable Units]]","v":0},null,{"$f":"UnitsDetails43[[#This Row],[Rate]]*UnitsDetails43[[#This Row],[Room & Board Units]]","v":0},null,{"$f":"'[4]Final Recon - Summary'!G105","v":0},{"$f":"UnitsDetails43[[#This Row],[ODS DMC General Units]]+UnitsDetails43[[#This Row],[ODS General Units]]+UnitsDetails43[[#This Row],[ODS DMC AB109 Units]]+UnitsDetails43[[#This Row],[ODS AB109 Units]]+UnitsDetails43[[#This Row],[SUD Non-Billable Units]]+UnitsDetails43[[#This Row],[Room & Board Units]]","v":0},0]
[0,{"$f":"'[4]Final Recon - Summary'!B106","v":"Group - LPHA (MFT  LCSW  LPCC)/Intern or Waivered LPHA (MFT  LCSW  LPCC)"},{"$f":"'[4]Final Recon - Summary'!C106","v":"Per Billable Minute"},{"$f":"'[4]Final Recon - Summary'!D106","v":1.3},{"$f":"UnitsDetails43[[#This Row],[ODS DMC General Units]]+UnitsDetails43[[#This Row],[ODS General Units]]+UnitsDetails43[[#This Row],[ODS DMC AB109 Units]]+UnitsDetails43[[#This Row],[ODS AB109 Units]]+UnitsDetails43[[#This Row],[Room & Board Units]]+UnitsDetails43[[#This Row],[SUD Non-Billable Units]]","v":0},0,null,0,null,{"$f":"UnitsDetails43[[#This Row],[ODS General Units]]*UnitsDetails43[[#This Row],[Rate]]","v":0},null,{"$f":"UnitsDetails43[[#This Row],[Rate]]*UnitsDetails43[[#This Row],[ODS DMC AB109 Units]]","v":0},null,{"$f":"UnitsDetails43[[#This Row],[Rate]]*UnitsDetails43[[#This Row],[ODS AB109 Units]]","v":0},null,{"$f":"UnitsDetails43[[#This Row],[Rate]]*UnitsDetails43[[#This Row],[SUD Non-Billable Units]]","v":0},null,{"$f":"UnitsDetails43[[#This Row],[Rate]]*UnitsDetails43[[#This Row],[Room & Board Units]]","v":0},null,{"$f":"'[4]Final Recon - Summary'!G106","v":0},{"$f":"UnitsDetails43[[#This Row],[ODS DMC General Units]]+UnitsDetails43[[#This Row],[ODS General Units]]+UnitsDetails43[[#This Row],[ODS DMC AB109 Units]]+UnitsDetails43[[#This Row],[ODS AB109 Units]]+UnitsDetails43[[#This Row],[SUD Non-Billable Units]]+UnitsDetails43[[#This Row],[Room & Board Units]]","v":0},0]
[0,{"$f":"'[4]Final Recon - Summary'!B107","v":"Group - Licensed Vocational Nurse (LVN)"},{"$f":"'[4]Final Recon - Summary'!C107","v":"Per Billable Minute"},{"$f":"'[4]Final Recon - Summary'!D107","v":1.07},{"$f":"UnitsDetails43[[#This Row],[ODS DMC General Units]]+UnitsDetails43[[#This Row],[ODS General Units]]+UnitsDetails43[[#This Row],[ODS DMC AB109 Units]]+UnitsDetails43[[#This Row],[ODS AB109 Units]]+UnitsDetails43[[#This Row],[Room & Board Units]]+UnitsDetails43[[#This Row],[SUD Non-Billable Units]]","v":0},0,null,0,null,{"$f":"UnitsDetails43[[#This Row],[ODS General Units]]*UnitsDetails43[[#This Row],[Rate]]","v":0},null,{"$f":"UnitsDetails43[[#This Row],[Rate]]*UnitsDetails43[[#This Row],[ODS DMC AB109 Units]]","v":0},null,{"$f":"UnitsDetails43[[#This Row],[Rate]]*UnitsDetails43[[#This Row],[ODS AB109 Units]]","v":0},null,{"$f":"UnitsDetails43[[#This Row],[Rate]]*UnitsDetails43[[#This Row],[SUD Non-Billable Units]]","v":0},null,{"$f":"UnitsDetails43[[#This Row],[Rate]]*UnitsDetails43[[#This Row],[Room & Board Units]]","v":0},null,{"$f":"'[4]Final Recon - Summary'!G107","v":0},{"$f":"UnitsDetails43[[#This Row],[ODS DMC General Units]]+UnitsDetails43[[#This Row],[ODS General Units]]+UnitsDetails43[[#This Row],[ODS DMC AB109 Units]]+UnitsDetails43[[#This Row],[ODS AB109 Units]]+UnitsDetails43[[#This Row],[SUD Non-Billable Units]]+UnitsDetails43[[#This Row],[Room & Board Units]]","v":0},0]
[0,{"$f":"'[4]Final Recon - Summary'!B108","v":"Group - Medical Assistant"},{"$f":"'[4]Final Recon - Summary'!C108","v":"Per Billable Minute"},{"$f":"'[4]Final Recon - Summary'!D108","v":0.74},{"$f":"UnitsDetails43[[#This Row],[ODS DMC General Units]]+UnitsDetails43[[#This Row],[ODS General Units]]+UnitsDetails43[[#This Row],[ODS DMC AB109 Units]]+UnitsDetails43[[#This Row],[ODS AB109 Units]]+UnitsDetails43[[#This Row],[Room & Board Units]]+UnitsDetails43[[#This Row],[SUD Non-Billable Units]]","v":0},0,null,0,null,{"$f":"UnitsDetails43[[#This Row],[ODS General Units]]*UnitsDetails43[[#This Row],[Rate]]","v":0},null,{"$f":"UnitsDetails43[[#This Row],[Rate]]*UnitsDetails43[[#This Row],[ODS DMC AB109 Units]]","v":0},null,{"$f":"UnitsDetails43[[#This Row],[Rate]]*UnitsDetails43[[#This Row],[ODS AB109 Units]]","v":0},null,{"$f":"UnitsDetails43[[#This Row],[Rate]]*UnitsDetails43[[#This Row],[SUD Non-Billable Units]]","v":0},null,{"$f":"UnitsDetails43[[#This Row],[Rate]]*UnitsDetails43[[#This Row],[Room & Board Units]]","v":0},null,{"$f":"'[4]Final Recon - Summary'!G108","v":0},{"$f":"UnitsDetails43[[#This Row],[ODS DMC General Units]]+UnitsDetails43[[#This Row],[ODS General Units]]+UnitsDetails43[[#This Row],[ODS DMC AB109 Units]]+UnitsDetails43[[#This Row],[ODS AB109 Units]]+UnitsDetails43[[#This Row],[SUD Non-Billable Units]]+UnitsDetails43[[#This Row],[Room & Board Units]]","v":0},0]
[0,{"$f":"'[4]Final Recon - Summary'!B109","v":"Group - Mental Health Rehabilitation Specialist"},{"$f":"'[4]Final Recon - Summary'!C109","v":"Per Billable Minute"},{"$f":"'[4]Final Recon - Summary'!D109","v":0.98},{"$f":"UnitsDetails43[[#This Row],[ODS DMC General Units]]+UnitsDetails43[[#This Row],[ODS General Units]]+UnitsDetails43[[#This Row],[ODS DMC AB109 Units]]+UnitsDetails43[[#This Row],[ODS AB109 Units]]+UnitsDetails43[[#This Row],[Room & Board Units]]+UnitsDetails43[[#This Row],[SUD Non-Billable Units]]","v":0},0,null,0,null,{"$f":"UnitsDetails43[[#This Row],[ODS General Units]]*UnitsDetails43[[#This Row],[Rate]]","v":0},null,{"$f":"UnitsDetails43[[#This Row],[Rate]]*UnitsDetails43[[#This Row],[ODS DMC AB109 Units]]","v":0},null,{"$f":"UnitsDetails43[[#This Row],[Rate]]*UnitsDetails43[[#This Row],[ODS AB109 Units]]","v":0},null,{"$f":"UnitsDetails43[[#This Row],[Rate]]*UnitsDetails43[[#This Row],[SUD Non-Billable Units]]","v":0},null,{"$f":"UnitsDetails43[[#This Row],[Rate]]*UnitsDetails43[[#This Row],[Room & Board Units]]","v":0},null,{"$f":"'[4]Final Recon - Summary'!G109","v":0},{"$f":"UnitsDetails43[[#This Row],[ODS DMC General Units]]+UnitsDetails43[[#This Row],[ODS General Units]]+UnitsDetails43[[#This Row],[ODS DMC AB109 Units]]+UnitsDetails43[[#This Row],[ODS AB109 Units]]+UnitsDetails43[[#This Row],[SUD Non-Billable Units]]+UnitsDetails43[[#This Row],[Room & Board Units]]","v":0},0]
[0,{"$f":"'[4]Final Recon - Summary'!B110","v":"Group - Nurse Practitioner"},{"$f":"'[4]Final Recon - Summary'!C110","v":"Per Billable Minute"},{"$f":"'[4]Final Recon - Summary'!D110","v":2.4899999999999998},{"$f":"UnitsDetails43[[#This Row],[ODS DMC General Units]]+UnitsDetails43[[#This Row],[ODS General Units]]+UnitsDetails43[[#This Row],[ODS DMC AB109 Units]]+UnitsDetails43[[#This Row],[ODS AB109 Units]]+UnitsDetails43[[#This Row],[Room & Board Units]]+UnitsDetails43[[#This Row],[SUD Non-Billable Units]]","v":0},0,null,0,null,{"$f":"UnitsDetails43[[#This Row],[ODS General Units]]*UnitsDetails43[[#This Row],[Rate]]","v":0},null,{"$f":"UnitsDetails43[[#This Row],[Rate]]*UnitsDetails43[[#This Row],[ODS DMC AB109 Units]]","v":0},null,{"$f":"UnitsDetails43[[#This Row],[Rate]]*UnitsDetails43[[#This Row],[ODS AB109 Units]]","v":0},null,{"$f":"UnitsDetails43[[#This Row],[Rate]]*UnitsDetails43[[#This Row],[SUD Non-Billable Units]]","v":0},null,{"$f":"UnitsDetails43[[#This Row],[Rate]]*UnitsDetails43[[#This Row],[Room & Board Units]]","v":0},null,{"$f":"'[4]Final Recon - Summary'!G110","v":0},{"$f":"UnitsDetails43[[#This Row],[ODS DMC General Units]]+UnitsDetails43[[#This Row],[ODS General Units]]+UnitsDetails43[[#This Row],[ODS DMC AB109 Units]]+UnitsDetails43[[#This Row],[ODS AB109 Units]]+UnitsDetails43[[#This Row],[SUD Non-Billable Units]]+UnitsDetails43[[#This Row],[Room & Board Units]]","v":0},0]
[0,{"$f":"'[4]Final Recon - Summary'!B111","v":"Group - Occupational Therapist"},{"$f":"'[4]Final Recon - Summary'!C111","v":"Per Billable Minute"},{"$f":"'[4]Final Recon - Summary'!D111","v":1.73},{"$f":"UnitsDetails43[[#This Row],[ODS DMC General Units]]+UnitsDetails43[[#This Row],[ODS General Units]]+UnitsDetails43[[#This Row],[ODS DMC AB109 Units]]+UnitsDetails43[[#This Row],[ODS AB109 Units]]+UnitsDetails43[[#This Row],[Room & Board Units]]+UnitsDetails43[[#This Row],[SUD Non-Billable Units]]","v":0},0,null,0,null,{"$f":"UnitsDetails43[[#This Row],[ODS General Units]]*UnitsDetails43[[#This Row],[Rate]]","v":0},null,{"$f":"UnitsDetails43[[#This Row],[Rate]]*UnitsDetails43[[#This Row],[ODS DMC AB109 Units]]","v":0},null,{"$f":"UnitsDetails43[[#This Row],[Rate]]*UnitsDetails43[[#This Row],[ODS AB109 Units]]","v":0},null,{"$f":"UnitsDetails43[[#This Row],[Rate]]*UnitsDetails43[[#This Row],[SUD Non-Billable Units]]","v":0},null,{"$f":"UnitsDetails43[[#This Row],[Rate]]*UnitsDetails43[[#This Row],[Room & Board Units]]","v":0},null,{"$f":"'[4]Final Recon - Summary'!G111","v":0},{"$f":"UnitsDetails43[[#This Row],[ODS DMC General Units]]+UnitsDetails43[[#This Row],[ODS General Units]]+UnitsDetails43[[#This Row],[ODS DMC AB109 Units]]+UnitsDetails43[[#This Row],[ODS AB109 Units]]+UnitsDetails43[[#This Row],[SUD Non-Billable Units]]+UnitsDetails43[[#This Row],[Room & Board Units]]","v":0},0]
[0,{"$f":"'[4]Final Recon - Summary'!B112","v":"Group - Other Qualified Providers - Other Designated MH staff that bill medical"},{"$f":"'[4]Final Recon - Summary'!C112","v":"Per Billable Minute"},{"$f":"'[4]Final Recon - Summary'!D112","v":0.98},{"$f":"UnitsDetails43[[#This Row],[ODS DMC General Units]]+UnitsDetails43[[#This Row],[ODS General Units]]+UnitsDetails43[[#This Row],[ODS DMC AB109 Units]]+UnitsDetails43[[#This Row],[ODS AB109 Units]]+UnitsDetails43[[#This Row],[Room & Board Units]]+UnitsDetails43[[#This Row],[SUD Non-Billable Units]]","v":0},0,null,0,null,{"$f":"UnitsDetails43[[#This Row],[ODS General Units]]*UnitsDetails43[[#This Row],[Rate]]","v":0},null,{"$f":"UnitsDetails43[[#This Row],[Rate]]*UnitsDetails43[[#This Row],[ODS DMC AB109 Units]]","v":0},null,{"$f":"UnitsDetails43[[#This Row],[Rate]]*UnitsDetails43[[#This Row],[ODS AB109 Units]]","v":0},null,{"$f":"UnitsDetails43[[#This Row],[Rate]]*UnitsDetails43[[#This Row],[SUD Non-Billable Units]]","v":0},null,{"$f":"UnitsDetails43[[#This Row],[Rate]]*UnitsDetails43[[#This Row],[Room & Board Units]]","v":0},null,{"$f":"'[4]Final Recon - Summary'!G112","v":0},{"$f":"UnitsDetails43[[#This Row],[ODS DMC General Units]]+UnitsDetails43[[#This Row],[ODS General Units]]+UnitsDetails43[[#This Row],[ODS DMC AB109 Units]]+UnitsDetails43[[#This Row],[ODS AB109 Units]]+UnitsDetails43[[#This Row],[SUD Non-Billable Units]]+UnitsDetails43[[#This Row],[Room & Board Units]]","v":0},0]
[{"$f":"$C$5","v":0},{"$f":"'[4]Final Recon - Summary'!B113","v":"Group - Peer Support Specialist"},{"$f":"'[4]Final Recon - Summary'!C113","v":"Per Billable Minute"},{"$f":"'[4]Final Recon - Summary'!D113","v":1.02},{"$f":"UnitsDetails43[[#This Row],[ODS DMC General Units]]+UnitsDetails43[[#This Row],[ODS General Units]]+UnitsDetails43[[#This Row],[ODS DMC AB109 Units]]+UnitsDetails43[[#This Row],[ODS AB109 Units]]+UnitsDetails43[[#This Row],[Room & Board Units]]+UnitsDetails43[[#This Row],[SUD Non-Billable Units]]","v":0},0,null,0,null,{"$f":"UnitsDetails43[[#This Row],[ODS General Units]]*UnitsDetails43[[#This Row],[Rate]]","v":0},null,{"$f":"UnitsDetails43[[#This Row],[Rate]]*UnitsDetails43[[#This Row],[ODS DMC AB109 Units]]","v":0},null,{"$f":"UnitsDetails43[[#This Row],[Rate]]*UnitsDetails43[[#This Row],[ODS AB109 Units]]","v":0},null,{"$f":"UnitsDetails43[[#This Row],[Rate]]*UnitsDetails43[[#This Row],[SUD Non-Billable Units]]","v":0},null,{"$f":"UnitsDetails43[[#This Row],[Rate]]*UnitsDetails43[[#This Row],[Room & Board Units]]","v":0},null,{"$f":"'[4]Final Recon - Summary'!G113","v":0},{"$f":"UnitsDetails43[[#This Row],[ODS DMC General Units]]+UnitsDetails43[[#This Row],[ODS General Units]]+UnitsDetails43[[#This Row],[ODS DMC AB109 Units]]+UnitsDetails43[[#This Row],[ODS AB109 Units]]+UnitsDetails43[[#This Row],[SUD Non-Billable Units]]+UnitsDetails43[[#This Row],[Room & Board Units]]","v":0},0]
[0,{"$f":"'[4]Final Recon - Summary'!B114","v":"Group - Physician Assistant"},{"$f":"'[4]Final Recon - Summary'!C114","v":"Per Billable Minute"},{"$f":"'[4]Final Recon - Summary'!D114","v":2.2400000000000002},{"$f":"UnitsDetails43[[#This Row],[ODS DMC General Units]]+UnitsDetails43[[#This Row],[ODS General Units]]+UnitsDetails43[[#This Row],[ODS DMC AB109 Units]]+UnitsDetails43[[#This Row],[ODS AB109 Units]]+UnitsDetails43[[#This Row],[Room & Board Units]]+UnitsDetails43[[#This Row],[SUD Non-Billable Units]]","v":0},0,null,0,null,{"$f":"UnitsDetails43[[#This Row],[ODS General Units]]*UnitsDetails43[[#This Row],[Rate]]","v":0},null,{"$f":"UnitsDetails43[[#This Row],[Rate]]*UnitsDetails43[[#This Row],[ODS DMC AB109 Units]]","v":0},null,{"$f":"UnitsDetails43[[#This Row],[Rate]]*UnitsDetails43[[#This Row],[ODS AB109 Units]]","v":0},null,{"$f":"UnitsDetails43[[#This Row],[Rate]]*UnitsDetails43[[#This Row],[SUD Non-Billable Units]]","v":0},null,{"$f":"UnitsDetails43[[#This Row],[Rate]]*UnitsDetails43[[#This Row],[Room & Board Units]]","v":0},null,{"$f":"'[4]Final Recon - Summary'!G114","v":0},{"$f":"UnitsDetails43[[#This Row],[ODS DMC General Units]]+UnitsDetails43[[#This Row],[ODS General Units]]+UnitsDetails43[[#This Row],[ODS DMC AB109 Units]]+UnitsDetails43[[#This Row],[ODS AB109 Units]]+UnitsDetails43[[#This Row],[SUD Non-Billable Units]]+UnitsDetails43[[#This Row],[Room & Board Units]]","v":0},0]
[0,{"$f":"'[4]Final Recon - Summary'!B115","v":"Group - Psychologist/Pre-licensed Psychologist"},{"$f":"'[4]Final Recon - Summary'!C115","v":"Per Billable Minute"},{"$f":"'[4]Final Recon - Summary'!D115","v":2.0099999999999998},{"$f":"UnitsDetails43[[#This Row],[ODS DMC General Units]]+UnitsDetails43[[#This Row],[ODS General Units]]+UnitsDetails43[[#This Row],[ODS DMC AB109 Units]]+UnitsDetails43[[#This Row],[ODS AB109 Units]]+UnitsDetails43[[#This Row],[Room & Board Units]]+UnitsDetails43[[#This Row],[SUD Non-Billable Units]]","v":0},0,null,0,null,{"$f":"UnitsDetails43[[#This Row],[ODS General Units]]*UnitsDetails43[[#This Row],[Rate]]","v":0},null,{"$f":"UnitsDetails43[[#This Row],[Rate]]*UnitsDetails43[[#This Row],[ODS DMC AB109 Units]]","v":0},null,{"$f":"UnitsDetails43[[#This Row],[Rate]]*UnitsDetails43[[#This Row],[ODS AB109 Units]]","v":0},null,{"$f":"UnitsDetails43[[#This Row],[Rate]]*UnitsDetails43[[#This Row],[SUD Non-Billable Units]]","v":0},null,{"$f":"UnitsDetails43[[#This Row],[Rate]]*UnitsDetails43[[#This Row],[Room & Board Units]]","v":0},null,{"$f":"'[4]Final Recon - Summary'!G115","v":0},{"$f":"UnitsDetails43[[#This Row],[ODS DMC General Units]]+UnitsDetails43[[#This Row],[ODS General Units]]+UnitsDetails43[[#This Row],[ODS DMC AB109 Units]]+UnitsDetails43[[#This Row],[ODS AB109 Units]]+UnitsDetails43[[#This Row],[SUD Non-Billable Units]]+UnitsDetails43[[#This Row],[Room & Board Units]]","v":0},0]
[0,{"$f":"'[4]Final Recon - Summary'!B116","v":"Group - Psychiatrist/ Contracted Psychiatrist/Licensed Physician (MD)"},{"$f":"'[4]Final Recon - Summary'!C116","v":"Per Billable Minute"},{"$f":"'[4]Final Recon - Summary'!D116","v":2.57},{"$f":"UnitsDetails43[[#This Row],[ODS DMC General Units]]+UnitsDetails43[[#This Row],[ODS General Units]]+UnitsDetails43[[#This Row],[ODS DMC AB109 Units]]+UnitsDetails43[[#This Row],[ODS AB109 Units]]+UnitsDetails43[[#This Row],[Room & Board Units]]+UnitsDetails43[[#This Row],[SUD Non-Billable Units]]","v":0},0,null,0,null,{"$f":"UnitsDetails43[[#This Row],[ODS General Units]]*UnitsDetails43[[#This Row],[Rate]]","v":0},null,{"$f":"UnitsDetails43[[#This Row],[Rate]]*UnitsDetails43[[#This Row],[ODS DMC AB109 Units]]","v":0},null,{"$f":"UnitsDetails43[[#This Row],[Rate]]*UnitsDetails43[[#This Row],[ODS AB109 Units]]","v":0},null,{"$f":"UnitsDetails43[[#This Row],[Rate]]*UnitsDetails43[[#This Row],[SUD Non-Billable Units]]","v":0},null,{"$f":"UnitsDetails43[[#This Row],[Rate]]*UnitsDetails43[[#This Row],[Room & Board Units]]","v":0},null,{"$f":"'[4]Final Recon - Summary'!G116","v":0},{"$f":"UnitsDetails43[[#This Row],[ODS DMC General Units]]+UnitsDetails43[[#This Row],[ODS General Units]]+UnitsDetails43[[#This Row],[ODS DMC AB109 Units]]+UnitsDetails43[[#This Row],[ODS AB109 Units]]+UnitsDetails43[[#This Row],[SUD Non-Billable Units]]+UnitsDetails43[[#This Row],[Room & Board Units]]","v":0},0]
[0,{"$f":"'[4]Final Recon - Summary'!B117","v":"Group - Registered Nurse (RN)"},{"$f":"'[4]Final Recon - Summary'!C117","v":"Per Billable Minute"},{"$f":"'[4]Final Recon - Summary'!D117","v":2.0300000000000002},{"$f":"UnitsDetails43[[#This Row],[ODS DMC General Units]]+UnitsDetails43[[#This Row],[ODS General Units]]+UnitsDetails43[[#This Row],[ODS DMC AB109 Units]]+UnitsDetails43[[#This Row],[ODS AB109 Units]]+UnitsDetails43[[#This Row],[Room & Board Units]]+UnitsDetails43[[#This Row],[SUD Non-Billable Units]]","v":0},0,null,0,null,{"$f":"UnitsDetails43[[#This Row],[ODS General Units]]*UnitsDetails43[[#This Row],[Rate]]","v":0},null,{"$f":"UnitsDetails43[[#This Row],[Rate]]*UnitsDetails43[[#This Row],[ODS DMC AB109 Units]]","v":0},null,{"$f":"UnitsDetails43[[#This Row],[Rate]]*UnitsDetails43[[#This Row],[ODS AB109 Units]]","v":0},null,{"$f":"UnitsDetails43[[#This Row],[Rate]]*UnitsDetails43[[#This Row],[SUD Non-Billable Units]]","v":0},null,{"$f":"UnitsDetails43[[#This Row],[Rate]]*UnitsDetails43[[#This Row],[Room & Board Units]]","v":0},null,{"$f":"'[4]Final Recon - Summary'!G117","v":0},{"$f":"UnitsDetails43[[#This Row],[ODS DMC General Units]]+UnitsDetails43[[#This Row],[ODS General Units]]+UnitsDetails43[[#This Row],[ODS DMC AB109 Units]]+UnitsDetails43[[#This Row],[ODS AB109 Units]]+UnitsDetails43[[#This Row],[SUD Non-Billable Units]]+UnitsDetails43[[#This Row],[Room & Board Units]]","v":0},0]
[0,{"$f":"'[4]Final Recon - Summary'!B118","v":"Group - Registered Pharmacist"},{"$f":"'[4]Final Recon - Summary'!C118","v":"Per Billable Minute"},{"$f":"'[4]Final Recon - Summary'!D118","v":2.3899999999999997},{"$f":"UnitsDetails43[[#This Row],[ODS DMC General Units]]+UnitsDetails43[[#This Row],[ODS General Units]]+UnitsDetails43[[#This Row],[ODS DMC AB109 Units]]+UnitsDetails43[[#This Row],[ODS AB109 Units]]+UnitsDetails43[[#This Row],[Room & Board Units]]+UnitsDetails43[[#This Row],[SUD Non-Billable Units]]","v":0},0,null,0,null,{"$f":"UnitsDetails43[[#This Row],[ODS General Units]]*UnitsDetails43[[#This Row],[Rate]]","v":0},null,{"$f":"UnitsDetails43[[#This Row],[Rate]]*UnitsDetails43[[#This Row],[ODS DMC AB109 Units]]","v":0},null,{"$f":"UnitsDetails43[[#This Row],[Rate]]*UnitsDetails43[[#This Row],[ODS AB109 Units]]","v":0},null,{"$f":"UnitsDetails43[[#This Row],[Rate]]*UnitsDetails43[[#This Row],[SUD Non-Billable Units]]","v":0},null,{"$f":"UnitsDetails43[[#This Row],[Rate]]*UnitsDetails43[[#This Row],[Room & Board Units]]","v":0},null,{"$f":"'[4]Final Recon - Summary'!G118","v":0},{"$f":"UnitsDetails43[[#This Row],[ODS DMC General Units]]+UnitsDetails43[[#This Row],[ODS General Units]]+UnitsDetails43[[#This Row],[ODS DMC AB109 Units]]+UnitsDetails43[[#This Row],[ODS AB109 Units]]+UnitsDetails43[[#This Row],[SUD Non-Billable Units]]+UnitsDetails43[[#This Row],[Room & Board Units]]","v":0},0]
[0,{"$f":"'[4]Final Recon - Summary'!B119","v":"Group - Interpreter Services"},{"$f":"'[4]Final Recon - Summary'!C119","v":"Per Billable Minute"},{"$f":"'[4]Final Recon - Summary'!D119","v":0.49},{"$f":"UnitsDetails43[[#This Row],[ODS DMC General Units]]+UnitsDetails43[[#This Row],[ODS General Units]]+UnitsDetails43[[#This Row],[ODS DMC AB109 Units]]+UnitsDetails43[[#This Row],[ODS AB109 Units]]+UnitsDetails43[[#This Row],[Room & Board Units]]+UnitsDetails43[[#This Row],[SUD Non-Billable Units]]","v":0},0,null,0,null,{"$f":"UnitsDetails43[[#This Row],[ODS General Units]]*UnitsDetails43[[#This Row],[Rate]]","v":0},null,{"$f":"UnitsDetails43[[#This Row],[Rate]]*UnitsDetails43[[#This Row],[ODS DMC AB109 Units]]","v":0},null,{"$f":"UnitsDetails43[[#This Row],[Rate]]*UnitsDetails43[[#This Row],[ODS AB109 Units]]","v":0},null,{"$f":"UnitsDetails43[[#This Row],[Rate]]*UnitsDetails43[[#This Row],[SUD Non-Billable Units]]","v":0},null,{"$f":"UnitsDetails43[[#This Row],[Rate]]*UnitsDetails43[[#This Row],[Room & Board Units]]","v":0},null,{"$f":"'[4]Final Recon - Summary'!G119","v":0},{"$f":"UnitsDetails43[[#This Row],[ODS DMC General Units]]+UnitsDetails43[[#This Row],[ODS General Units]]+UnitsDetails43[[#This Row],[ODS DMC AB109 Units]]+UnitsDetails43[[#This Row],[ODS AB109 Units]]+UnitsDetails43[[#This Row],[SUD Non-Billable Units]]+UnitsDetails43[[#This Row],[Room & Board Units]]","v":0},0]
[0,{"$f":"'[4]Final Recon - Summary'!B120","v":"Bundled Rates"}]
[0,{"$f":"'[4]Final Recon - Summary'!B121","v":"350 ACT/FSP Caseload"},{"$f":"'[4]Final Recon - Summary'!C121","v":"Bundled Full Month"},{"$f":"'[4]Final Recon - Summary'!D121","v":0},{"$f":"UnitsDetails43[[#This Row],[ODS DMC General Units]]+UnitsDetails43[[#This Row],[ODS General Units]]+UnitsDetails43[[#This Row],[ODS DMC AB109 Units]]+UnitsDetails43[[#This Row],[ODS AB109 Units]]+UnitsDetails43[[#This Row],[Room & Board Units]]+UnitsDetails43[[#This Row],[SUD Non-Billable Units]]","v":0},{"$f":"+D101*E101","v":0},null,{"$f":"+D101*G101","v":0},null,{"$f":"UnitsDetails43[[#This Row],[ODS General Units]]*UnitsDetails43[[#This Row],[Rate]]","v":0},null,{"$f":"UnitsDetails43[[#This Row],[Rate]]*UnitsDetails43[[#This Row],[ODS DMC AB109 Units]]","v":0},null,{"$f":"UnitsDetails43[[#This Row],[Rate]]*UnitsDetails43[[#This Row],[ODS AB109 Units]]","v":0},null,{"$f":"UnitsDetails43[[#This Row],[Rate]]*UnitsDetails43[[#This Row],[SUD Non-Billable Units]]","v":0},null,{"$f":"UnitsDetails43[[#This Row],[Rate]]*UnitsDetails43[[#This Row],[Room & Board Units]]","v":0},null,{"$f":"'[4]Final Recon - Summary'!G121","v":0},{"$f":"UnitsDetails43[[#This Row],[ODS DMC General Units]]+UnitsDetails43[[#This Row],[ODS General Units]]+UnitsDetails43[[#This Row],[ODS DMC AB109 Units]]+UnitsDetails43[[#This Row],[ODS AB109 Units]]+UnitsDetails43[[#This Row],[SUD Non-Billable Units]]+UnitsDetails43[[#This Row],[Room & Board Units]]","v":0},{"$f":"T101-U101","v":0}]
[0,{"$f":"'[4]Final Recon - Summary'!B122","v":"350 ACT/FSP Caseload"},{"$f":"'[4]Final Recon - Summary'!C122","v":"Bundled Partial Month"},{"$f":"'[4]Final Recon - Summary'!D122","v":0},{"$f":"UnitsDetails43[[#This Row],[ODS DMC General Units]]+UnitsDetails43[[#This Row],[ODS General Units]]+UnitsDetails43[[#This Row],[ODS DMC AB109 Units]]+UnitsDetails43[[#This Row],[ODS AB109 Units]]+UnitsDetails43[[#This Row],[Room & Board Units]]+UnitsDetails43[[#This Row],[SUD Non-Billable Units]]","v":0},{"$f":"+D102*E102","v":0},null,{"$f":"+D102*G102","v":0},null,{"$f":"UnitsDetails43[[#This Row],[ODS General Units]]*UnitsDetails43[[#This Row],[Rate]]","v":0},null,{"$f":"UnitsDetails43[[#This Row],[Rate]]*UnitsDetails43[[#This Row],[ODS DMC AB109 Units]]","v":0},null,{"$f":"UnitsDetails43[[#This Row],[Rate]]*UnitsDetails43[[#This Row],[ODS AB109 Units]]","v":0},null,{"$f":"UnitsDetails43[[#This Row],[Rate]]*UnitsDetails43[[#This Row],[SUD Non-Billable Units]]","v":0},null,{"$f":"UnitsDetails43[[#This Row],[Rate]]*UnitsDetails43[[#This Row],[Room & Board Units]]","v":0},null,{"$f":"'[4]Final Recon - Summary'!G122","v":0},{"$f":"UnitsDetails43[[#This Row],[ODS DMC General Units]]+UnitsDetails43[[#This Row],[ODS General Units]]+UnitsDetails43[[#This Row],[ODS DMC AB109 Units]]+UnitsDetails43[[#This Row],[ODS AB109 Units]]+UnitsDetails43[[#This Row],[SUD Non-Billable Units]]+UnitsDetails43[[#This Row],[Room & Board Units]]","v":0},{"$f":"T102-U102","v":0}]
[0]
[0]
[0]
[0]
[0]
[0]
[0]
[0]
[0]
[0,{"$f":"'[4]Final Recon - Summary'!B132","v":"Total"},null,null,{"$f":"UnitsDetails43[[#This Row],[ODS DMC General Units]]+UnitsDetails43[[#This Row],[ODS General Units]]+UnitsDetails43[[#This Row],[ODS DMC AB109 Units]]+UnitsDetails43[[#This Row],[ODS AB109 Units]]+UnitsDetails43[[#This Row],[Room & Board Units]]+UnitsDetails43[[#This Row],[SUD Non-Billable Units]]","v":0},{"$f":"SUM(F61:F111)","v":0},null,{"$f":"SUM(H61:H111)","v":0},null,{"$f":"SUM(J61:J111)","v":0},null,{"$f":"SUM(L61:L111)","v":0},null,{"$f":"SUM(N61:N111)","v":0},null,{"$f":"SUM(P61:P111)","v":0},null,{"$f":"SUM(R61:R111)","v":0}]
[]
["BEHAVIORAL HEALTH SERVICES"]
["Fical Year-End Units Details"]
[]
[null,"Contractor:",{"$f":"C56","v":0}]
[null,"Contract #:",{"$f":"C57","v":0}]
[null,"Program Name:",{"$f":"'[4]MH & SUD INVOICE (Sch I)'!C229","v":"Program 3"}]
[]
["Column1","Service Modalities","Unit","Rate","Final TUOS Units Reconciliation","Final Amount Reconciliation","ODS DMC General Units","ODS DMC General Amount","ODS General Units","ODS General Amount","ODS DMC AB109 Units","ODS DMC AB109 Amount","ODS AB109 Units","ODS AB109 Amount","SUD Non-Billable Units","SUD Non-Billable Amount","Room & Board Units","Room & Board Amount",null,"Total Units (Summary)","Total Units (Details)","Checkpoint"]
[{"$f":"$C$5","v":0},{"$f":"'[4]MH & SUD INVOICE (Sch I)'!B234","v":"Individual - Alcohol and Drug Counselor"},{"$f":"'[4]MH & SUD INVOICE (Sch I)'!D234","v":"Per Billable Minute"},{"$f":"'[4]MH & SUD INVOICE (Sch I)'!E234","v":4.4400000000000004},{"$f":"UnitsDetails44[[#This Row],[ODS DMC General Units]]+UnitsDetails44[[#This Row],[ODS General Units]]+UnitsDetails44[[#This Row],[ODS DMC AB109 Units]]+UnitsDetails44[[#This Row],[ODS AB109 Units]]+UnitsDetails44[[#This Row],[Room & Board Units]]+UnitsDetails44[[#This Row],[SUD Non-Billable Units]]","v":0},{"$f":"+D122*E122","v":0},null,{"$f":"+D122*G122","v":0},null,{"$f":"UnitsDetails44[[#This Row],[ODS General Units]]*UnitsDetails44[[#This Row],[Rate]]","v":0},null,{"$f":"UnitsDetails44[[#This Row],[Rate]]*UnitsDetails44[[#This Row],[ODS DMC AB109 Units]]","v":0},null,{"$f":"UnitsDetails44[[#This Row],[Rate]]*UnitsDetails44[[#This Row],[ODS AB109 Units]]","v":0},null,{"$f":"UnitsDetails44[[#This Row],[Rate]]*UnitsDetails44[[#This Row],[SUD Non-Billable Units]]","v":0},null,{"$f":"UnitsDetails44[[#This Row],[Rate]]*UnitsDetails44[[#This Row],[Room & Board Units]]","v":0},null,{"$f":"'[4]Final Recon - Summary'!G152","v":0},{"$f":"UnitsDetails44[[#This Row],[ODS DMC General Units]]+UnitsDetails44[[#This Row],[ODS General Units]]+UnitsDetails44[[#This Row],[ODS DMC AB109 Units]]+UnitsDetails44[[#This Row],[ODS AB109 Units]]+UnitsDetails44[[#This Row],[SUD Non-Billable Units]]+UnitsDetails44[[#This Row],[Room & Board Units]]","v":0},{"$f":"T122-U122","v":0}]
[0,{"$f":"'[4]MH & SUD INVOICE (Sch I)'!B235","v":"Individual - Clinical Nurse Specialist"},{"$f":"'[4]MH & SUD INVOICE (Sch I)'!D235","v":"Per Billable Minute"},{"$f":"'[4]MH & SUD INVOICE (Sch I)'!E235","v":10.23},{"$f":"UnitsDetails44[[#This Row],[ODS DMC General Units]]+UnitsDetails44[[#This Row],[ODS General Units]]+UnitsDetails44[[#This Row],[ODS DMC AB109 Units]]+UnitsDetails44[[#This Row],[ODS AB109 Units]]+UnitsDetails44[[#This Row],[Room & Board Units]]+UnitsDetails44[[#This Row],[SUD Non-Billable Units]]","v":0},0,null,0,null,{"$f":"UnitsDetails44[[#This Row],[ODS General Units]]*UnitsDetails44[[#This Row],[Rate]]","v":0},null,{"$f":"UnitsDetails44[[#This Row],[Rate]]*UnitsDetails44[[#This Row],[ODS DMC AB109 Units]]","v":0},null,{"$f":"UnitsDetails44[[#This Row],[Rate]]*UnitsDetails44[[#This Row],[ODS AB109 Units]]","v":0},null,{"$f":"UnitsDetails44[[#This Row],[Rate]]*UnitsDetails44[[#This Row],[SUD Non-Billable Units]]","v":0},null,{"$f":"UnitsDetails44[[#This Row],[Rate]]*UnitsDetails44[[#This Row],[Room & Board Units]]","v":0},null,{"$f":"'[4]Final Recon - Summary'!G153","v":0},{"$f":"UnitsDetails44[[#This Row],[ODS DMC General Units]]+UnitsDetails44[[#This Row],[ODS General Units]]+UnitsDetails44[[#This Row],[ODS DMC AB109 Units]]+UnitsDetails44[[#This Row],[ODS AB109 Units]]+UnitsDetails44[[#This Row],[SUD Non-Billable Units]]+UnitsDetails44[[#This Row],[Room & Board Units]]","v":0},0]
[0,{"$f":"'[4]MH & SUD INVOICE (Sch I)'!B236","v":"Individual - Community Health Worker"},{"$f":"'[4]MH & SUD INVOICE (Sch I)'!D236","v":"Per Billable Minute"},{"$f":"'[4]MH & SUD INVOICE (Sch I)'!E236","v":4.12},{"$f":"UnitsDetails44[[#This Row],[ODS DMC General Units]]+UnitsDetails44[[#This Row],[ODS General Units]]+UnitsDetails44[[#This Row],[ODS DMC AB109 Units]]+UnitsDetails44[[#This Row],[ODS AB109 Units]]+UnitsDetails44[[#This Row],[Room & Board Units]]+UnitsDetails44[[#This Row],[SUD Non-Billable Units]]","v":0},0,null,0,null,{"$f":"UnitsDetails44[[#This Row],[ODS General Units]]*UnitsDetails44[[#This Row],[Rate]]","v":0},null,{"$f":"UnitsDetails44[[#This Row],[Rate]]*UnitsDetails44[[#This Row],[ODS DMC AB109 Units]]","v":0},null,{"$f":"UnitsDetails44[[#This Row],[Rate]]*UnitsDetails44[[#This Row],[ODS AB109 Units]]","v":0},null,{"$f":"UnitsDetails44[[#This Row],[Rate]]*UnitsDetails44[[#This Row],[SUD Non-Billable Units]]","v":0},null,{"$f":"UnitsDetails44[[#This Row],[Rate]]*UnitsDetails44[[#This Row],[Room & Board Units]]","v":0},null,{"$f":"'[4]Final Recon - Summary'!G154","v":0},{"$f":"UnitsDetails44[[#This Row],[ODS DMC General Units]]+UnitsDetails44[[#This Row],[ODS General Units]]+UnitsDetails44[[#This Row],[ODS DMC AB109 Units]]+UnitsDetails44[[#This Row],[ODS AB109 Units]]+UnitsDetails44[[#This Row],[SUD Non-Billable Units]]+UnitsDetails44[[#This Row],[Room & Board Units]]","v":0},0]
[0,{"$f":"'[4]MH & SUD INVOICE (Sch I)'!B237","v":"Individual - Licensed Psychiatric Technician"},{"$f":"'[4]MH & SUD INVOICE (Sch I)'!D237","v":"Per Billable Minute"},{"$f":"'[4]MH & SUD INVOICE (Sch I)'!E237","v":3.76},{"$f":"UnitsDetails44[[#This Row],[ODS DMC General Units]]+UnitsDetails44[[#This Row],[ODS General Units]]+UnitsDetails44[[#This Row],[ODS DMC AB109 Units]]+UnitsDetails44[[#This Row],[ODS AB109 Units]]+UnitsDetails44[[#This Row],[Room & Board Units]]+UnitsDetails44[[#This Row],[SUD Non-Billable Units]]","v":0},0,null,0,null,{"$f":"UnitsDetails44[[#This Row],[ODS General Units]]*UnitsDetails44[[#This Row],[Rate]]","v":0},null,{"$f":"UnitsDetails44[[#This Row],[Rate]]*UnitsDetails44[[#This Row],[ODS DMC AB109 Units]]","v":0},null,{"$f":"UnitsDetails44[[#This Row],[Rate]]*UnitsDetails44[[#This Row],[ODS AB109 Units]]","v":0},null,{"$f":"UnitsDetails44[[#This Row],[Rate]]*UnitsDetails44[[#This Row],[SUD Non-Billable Units]]","v":0},null,{"$f":"UnitsDetails44[[#This Row],[Rate]]*UnitsDetails44[[#This Row],[Room & Board Units]]","v":0},null,{"$f":"'[4]Final Recon - Summary'!G155","v":0},{"$f":"UnitsDetails44[[#This Row],[ODS DMC General Units]]+UnitsDetails44[[#This Row],[ODS General Units]]+UnitsDetails44[[#This Row],[ODS DMC AB109 Units]]+UnitsDetails44[[#This Row],[ODS AB109 Units]]+UnitsDetails44[[#This Row],[SUD Non-Billable Units]]+UnitsDetails44[[#This Row],[Room & Board Units]]","v":0},0]
[0,{"$f":"'[4]MH & SUD INVOICE (Sch I)'!B238","v":"Individual - LPHA (MFT  LCSW  LPCC)/Intern or Waivered LPHA (MFT  LCSW  LPCC)"},{"$f":"'[4]MH & SUD INVOICE (Sch I)'!D238","v":"Per Billable Minute"},{"$f":"'[4]MH & SUD INVOICE (Sch I)'!E238","v":5.35},{"$f":"UnitsDetails44[[#This Row],[ODS DMC General Units]]+UnitsDetails44[[#This Row],[ODS General Units]]+UnitsDetails44[[#This Row],[ODS DMC AB109 Units]]+UnitsDetails44[[#This Row],[ODS AB109 Units]]+UnitsDetails44[[#This Row],[Room & Board Units]]+UnitsDetails44[[#This Row],[SUD Non-Billable Units]]","v":0},0,null,0,null,{"$f":"UnitsDetails44[[#This Row],[ODS General Units]]*UnitsDetails44[[#This Row],[Rate]]","v":0},null,{"$f":"UnitsDetails44[[#This Row],[Rate]]*UnitsDetails44[[#This Row],[ODS DMC AB109 Units]]","v":0},null,{"$f":"UnitsDetails44[[#This Row],[Rate]]*UnitsDetails44[[#This Row],[ODS AB109 Units]]","v":0},null,{"$f":"UnitsDetails44[[#This Row],[Rate]]*UnitsDetails44[[#This Row],[SUD Non-Billable Units]]","v":0},null,{"$f":"UnitsDetails44[[#This Row],[Rate]]*UnitsDetails44[[#This Row],[Room & Board Units]]","v":0},null,{"$f":"'[4]Final Recon - Summary'!G156","v":0},{"$f":"UnitsDetails44[[#This Row],[ODS DMC General Units]]+UnitsDetails44[[#This Row],[ODS General Units]]+UnitsDetails44[[#This Row],[ODS DMC AB109 Units]]+UnitsDetails44[[#This Row],[ODS AB109 Units]]+UnitsDetails44[[#This Row],[SUD Non-Billable Units]]+UnitsDetails44[[#This Row],[Room & Board Units]]","v":0},0]
[0,{"$f":"'[4]MH & SUD INVOICE (Sch I)'!B239","v":"Individual - Licensed Vocational Nurse (LVN)"},{"$f":"'[4]MH & SUD INVOICE (Sch I)'!D239","v":"Per Billable Minute"},{"$f":"'[4]MH & SUD INVOICE (Sch I)'!E239","v":4.3800000000000008},{"$f":"UnitsDetails44[[#This Row],[ODS DMC General Units]]+UnitsDetails44[[#This Row],[ODS General Units]]+UnitsDetails44[[#This Row],[ODS DMC AB109 Units]]+UnitsDetails44[[#This Row],[ODS AB109 Units]]+UnitsDetails44[[#This Row],[Room & Board Units]]+UnitsDetails44[[#This Row],[SUD Non-Billable Units]]","v":0},0,null,0,null,{"$f":"UnitsDetails44[[#This Row],[ODS General Units]]*UnitsDetails44[[#This Row],[Rate]]","v":0},null,{"$f":"UnitsDetails44[[#This Row],[Rate]]*UnitsDetails44[[#This Row],[ODS DMC AB109 Units]]","v":0},null,{"$f":"UnitsDetails44[[#This Row],[Rate]]*UnitsDetails44[[#This Row],[ODS AB109 Units]]","v":0},null,{"$f":"UnitsDetails44[[#This Row],[Rate]]*UnitsDetails44[[#This Row],[SUD Non-Billable Units]]","v":0},null,{"$f":"UnitsDetails44[[#This Row],[Rate]]*UnitsDetails44[[#This Row],[Room & Board Units]]","v":0},null,{"$f":"'[4]Final Recon - Summary'!G157","v":0},{"$f":"UnitsDetails44[[#This Row],[ODS DMC General Units]]+UnitsDetails44[[#This Row],[ODS General Units]]+UnitsDetails44[[#This Row],[ODS DMC AB109 Units]]+UnitsDetails44[[#This Row],[ODS AB109 Units]]+UnitsDetails44[[#This Row],[SUD Non-Billable Units]]+UnitsDetails44[[#This Row],[Room & Board Units]]","v":0},0]
[0,{"$f":"'[4]MH & SUD INVOICE (Sch I)'!B240","v":"Individual - Medical Assistant"},{"$f":"'[4]MH & SUD INVOICE (Sch I)'!D240","v":"Per Billable Minute"},{"$f":"'[4]MH & SUD INVOICE (Sch I)'!E240","v":3.02},{"$f":"UnitsDetails44[[#This Row],[ODS DMC General Units]]+UnitsDetails44[[#This Row],[ODS General Units]]+UnitsDetails44[[#This Row],[ODS DMC AB109 Units]]+UnitsDetails44[[#This Row],[ODS AB109 Units]]+UnitsDetails44[[#This Row],[Room & Board Units]]+UnitsDetails44[[#This Row],[SUD Non-Billable Units]]","v":0},0,null,0,null,{"$f":"UnitsDetails44[[#This Row],[ODS General Units]]*UnitsDetails44[[#This Row],[Rate]]","v":0},null,{"$f":"UnitsDetails44[[#This Row],[Rate]]*UnitsDetails44[[#This Row],[ODS DMC AB109 Units]]","v":0},null,{"$f":"UnitsDetails44[[#This Row],[Rate]]*UnitsDetails44[[#This Row],[ODS AB109 Units]]","v":0},null,{"$f":"UnitsDetails44[[#This Row],[Rate]]*UnitsDetails44[[#This Row],[SUD Non-Billable Units]]","v":0},null,{"$f":"UnitsDetails44[[#This Row],[Rate]]*UnitsDetails44[[#This Row],[Room & Board Units]]","v":0},null,{"$f":"'[4]Final Recon - Summary'!G158","v":0},{"$f":"UnitsDetails44[[#This Row],[ODS DMC General Units]]+UnitsDetails44[[#This Row],[ODS General Units]]+UnitsDetails44[[#This Row],[ODS DMC AB109 Units]]+UnitsDetails44[[#This Row],[ODS AB109 Units]]+UnitsDetails44[[#This Row],[SUD Non-Billable Units]]+UnitsDetails44[[#This Row],[Room & Board Units]]","v":0},0]
[0,{"$f":"'[4]MH & SUD INVOICE (Sch I)'!B241","v":"Individual - Mental Health Rehabilitation Specialist"},{"$f":"'[4]MH & SUD INVOICE (Sch I)'!D241","v":"Per Billable Minute"},{"$f":"'[4]MH & SUD INVOICE (Sch I)'!E241","v":4.0199999999999996},{"$f":"UnitsDetails44[[#This Row],[ODS DMC General Units]]+UnitsDetails44[[#This Row],[ODS General Units]]+UnitsDetails44[[#This Row],[ODS DMC AB109 Units]]+UnitsDetails44[[#This Row],[ODS AB109 Units]]+UnitsDetails44[[#This Row],[Room & Board Units]]+UnitsDetails44[[#This Row],[SUD Non-Billable Units]]","v":0},0,null,0,null,{"$f":"UnitsDetails44[[#This Row],[ODS General Units]]*UnitsDetails44[[#This Row],[Rate]]","v":0},null,{"$f":"UnitsDetails44[[#This Row],[Rate]]*UnitsDetails44[[#This Row],[ODS DMC AB109 Units]]","v":0},null,{"$f":"UnitsDetails44[[#This Row],[Rate]]*UnitsDetails44[[#This Row],[ODS AB109 Units]]","v":0},null,{"$f":"UnitsDetails44[[#This Row],[Rate]]*UnitsDetails44[[#This Row],[SUD Non-Billable Units]]","v":0},null,{"$f":"UnitsDetails44[[#This Row],[Rate]]*UnitsDetails44[[#This Row],[Room & Board Units]]","v":0},null,{"$f":"'[4]Final Recon - Summary'!G159","v":0},{"$f":"UnitsDetails44[[#This Row],[ODS DMC General Units]]+UnitsDetails44[[#This Row],[ODS General Units]]+UnitsDetails44[[#This Row],[ODS DMC AB109 Units]]+UnitsDetails44[[#This Row],[ODS AB109 Units]]+UnitsDetails44[[#This Row],[SUD Non-Billable Units]]+UnitsDetails44[[#This Row],[Room & Board Units]]","v":0},0]
[0,{"$f":"'[4]MH & SUD INVOICE (Sch I)'!B242","v":"Individual - Nurse Practitioner"},{"$f":"'[4]MH & SUD INVOICE (Sch I)'!D242","v":"Per Billable Minute"},{"$f":"'[4]MH & SUD INVOICE (Sch I)'!E242","v":10.23},{"$f":"UnitsDetails44[[#This Row],[ODS DMC General Units]]+UnitsDetails44[[#This Row],[ODS General Units]]+UnitsDetails44[[#This Row],[ODS DMC AB109 Units]]+UnitsDetails44[[#This Row],[ODS AB109 Units]]+UnitsDetails44[[#This Row],[Room & Board Units]]+UnitsDetails44[[#This Row],[SUD Non-Billable Units]]","v":0},0,null,0,null,{"$f":"UnitsDetails44[[#This Row],[ODS General Units]]*UnitsDetails44[[#This Row],[Rate]]","v":0},null,{"$f":"UnitsDetails44[[#This Row],[Rate]]*UnitsDetails44[[#This Row],[ODS DMC AB109 Units]]","v":0},null,{"$f":"UnitsDetails44[[#This Row],[Rate]]*UnitsDetails44[[#This Row],[ODS AB109 Units]]","v":0},null,{"$f":"UnitsDetails44[[#This Row],[Rate]]*UnitsDetails44[[#This Row],[SUD Non-Billable Units]]","v":0},null,{"$f":"UnitsDetails44[[#This Row],[Rate]]*UnitsDetails44[[#This Row],[Room & Board Units]]","v":0},null,{"$f":"'[4]Final Recon - Summary'!G160","v":0},{"$f":"UnitsDetails44[[#This Row],[ODS DMC General Units]]+UnitsDetails44[[#This Row],[ODS General Units]]+UnitsDetails44[[#This Row],[ODS DMC AB109 Units]]+UnitsDetails44[[#This Row],[ODS AB109 Units]]+UnitsDetails44[[#This Row],[SUD Non-Billable Units]]+UnitsDetails44[[#This Row],[Room & Board Units]]","v":0},0]
[0,{"$f":"'[4]MH & SUD INVOICE (Sch I)'!B243","v":"Individual - Occupational Therapist"},{"$f":"'[4]MH & SUD INVOICE (Sch I)'!D243","v":"Per Billable Minute"},{"$f":"'[4]MH & SUD INVOICE (Sch I)'!E243","v":7.13},{"$f":"UnitsDetails44[[#This Row],[ODS DMC General Units]]+UnitsDetails44[[#This Row],[ODS General Units]]+UnitsDetails44[[#This Row],[ODS DMC AB109 Units]]+UnitsDetails44[[#This Row],[ODS AB109 Units]]+UnitsDetails44[[#This Row],[Room & Board Units]]+UnitsDetails44[[#This Row],[SUD Non-Billable Units]]","v":0},0,null,0,null,{"$f":"UnitsDetails44[[#This Row],[ODS General Units]]*UnitsDetails44[[#This Row],[Rate]]","v":0},null,{"$f":"UnitsDetails44[[#This Row],[Rate]]*UnitsDetails44[[#This Row],[ODS DMC AB109 Units]]","v":0},null,{"$f":"UnitsDetails44[[#This Row],[Rate]]*UnitsDetails44[[#This Row],[ODS AB109 Units]]","v":0},null,{"$f":"UnitsDetails44[[#This Row],[Rate]]*UnitsDetails44[[#This Row],[SUD Non-Billable Units]]","v":0},null,{"$f":"UnitsDetails44[[#This Row],[Rate]]*UnitsDetails44[[#This Row],[Room & Board Units]]","v":0},null,{"$f":"'[4]Final Recon - Summary'!G161","v":0},{"$f":"UnitsDetails44[[#This Row],[ODS DMC General Units]]+UnitsDetails44[[#This Row],[ODS General Units]]+UnitsDetails44[[#This Row],[ODS DMC AB109 Units]]+UnitsDetails44[[#This Row],[ODS AB109 Units]]+UnitsDetails44[[#This Row],[SUD Non-Billable Units]]+UnitsDetails44[[#This Row],[Room & Board Units]]","v":0},0]
[0,{"$f":"'[4]MH & SUD INVOICE (Sch I)'!B244","v":"Individual - Other Qualified Providers - Other Designated MH staff that bill medical"},{"$f":"'[4]MH & SUD INVOICE (Sch I)'!D244","v":"Per Billable Minute"},{"$f":"'[4]MH & SUD INVOICE (Sch I)'!E244","v":4.0199999999999996},{"$f":"UnitsDetails44[[#This Row],[ODS DMC General Units]]+UnitsDetails44[[#This Row],[ODS General Units]]+UnitsDetails44[[#This Row],[ODS DMC AB109 Units]]+UnitsDetails44[[#This Row],[ODS AB109 Units]]+UnitsDetails44[[#This Row],[Room & Board Units]]+UnitsDetails44[[#This Row],[SUD Non-Billable Units]]","v":0},0,null,0,null,{"$f":"UnitsDetails44[[#This Row],[ODS General Units]]*UnitsDetails44[[#This Row],[Rate]]","v":0},null,{"$f":"UnitsDetails44[[#This Row],[Rate]]*UnitsDetails44[[#This Row],[ODS DMC AB109 Units]]","v":0},null,{"$f":"UnitsDetails44[[#This Row],[Rate]]*UnitsDetails44[[#This Row],[ODS AB109 Units]]","v":0},null,{"$f":"UnitsDetails44[[#This Row],[Rate]]*UnitsDetails44[[#This Row],[SUD Non-Billable Units]]","v":0},null,{"$f":"UnitsDetails44[[#This Row],[Rate]]*UnitsDetails44[[#This Row],[Room & Board Units]]","v":0},null,{"$f":"'[4]Final Recon - Summary'!G162","v":0},{"$f":"UnitsDetails44[[#This Row],[ODS DMC General Units]]+UnitsDetails44[[#This Row],[ODS General Units]]+UnitsDetails44[[#This Row],[ODS DMC AB109 Units]]+UnitsDetails44[[#This Row],[ODS AB109 Units]]+UnitsDetails44[[#This Row],[SUD Non-Billable Units]]+UnitsDetails44[[#This Row],[Room & Board Units]]","v":0},0]
[0,{"$f":"'[4]MH & SUD INVOICE (Sch I)'!B245","v":"Individual - Peer Support Specialist"},{"$f":"'[4]MH & SUD INVOICE (Sch I)'!D245","v":"Per Billable Minute"},{"$f":"'[4]MH & SUD INVOICE (Sch I)'!E245","v":4.22},{"$f":"UnitsDetails44[[#This Row],[ODS DMC General Units]]+UnitsDetails44[[#This Row],[ODS General Units]]+UnitsDetails44[[#This Row],[ODS DMC AB109 Units]]+UnitsDetails44[[#This Row],[ODS AB109 Units]]+UnitsDetails44[[#This Row],[Room & Board Units]]+UnitsDetails44[[#This Row],[SUD Non-Billable Units]]","v":0},0,null,0,null,{"$f":"UnitsDetails44[[#This Row],[ODS General Units]]*UnitsDetails44[[#This Row],[Rate]]","v":0},null,{"$f":"UnitsDetails44[[#This Row],[Rate]]*UnitsDetails44[[#This Row],[ODS DMC AB109 Units]]","v":0},null,{"$f":"UnitsDetails44[[#This Row],[Rate]]*UnitsDetails44[[#This Row],[ODS AB109 Units]]","v":0},null,{"$f":"UnitsDetails44[[#This Row],[Rate]]*UnitsDetails44[[#This Row],[SUD Non-Billable Units]]","v":0},null,{"$f":"UnitsDetails44[[#This Row],[Rate]]*UnitsDetails44[[#This Row],[Room & Board Units]]","v":0},null,{"$f":"'[4]Final Recon - Summary'!G163","v":0},{"$f":"UnitsDetails44[[#This Row],[ODS DMC General Units]]+UnitsDetails44[[#This Row],[ODS General Units]]+UnitsDetails44[[#This Row],[ODS DMC AB109 Units]]+UnitsDetails44[[#This Row],[ODS AB109 Units]]+UnitsDetails44[[#This Row],[SUD Non-Billable Units]]+UnitsDetails44[[#This Row],[Room & Board Units]]","v":0},0]
[0,{"$f":"'[4]MH & SUD INVOICE (Sch I)'!B246","v":"Individual - Physician Assistant"},{"$f":"'[4]MH & SUD INVOICE (Sch I)'!D246","v":"Per Billable Minute"},{"$f":"'[4]MH & SUD INVOICE (Sch I)'!E246","v":9.23},{"$f":"UnitsDetails44[[#This Row],[ODS DMC General Units]]+UnitsDetails44[[#This Row],[ODS General Units]]+UnitsDetails44[[#This Row],[ODS DMC AB109 Units]]+UnitsDetails44[[#This Row],[ODS AB109 Units]]+UnitsDetails44[[#This Row],[Room & Board Units]]+UnitsDetails44[[#This Row],[SUD Non-Billable Units]]","v":0},0,null,0,null,{"$f":"UnitsDetails44[[#This Row],[ODS General Units]]*UnitsDetails44[[#This Row],[Rate]]","v":0},null,{"$f":"UnitsDetails44[[#This Row],[Rate]]*UnitsDetails44[[#This Row],[ODS DMC AB109 Units]]","v":0},null,{"$f":"UnitsDetails44[[#This Row],[Rate]]*UnitsDetails44[[#This Row],[ODS AB109 Units]]","v":0},null,{"$f":"UnitsDetails44[[#This Row],[Rate]]*UnitsDetails44[[#This Row],[SUD Non-Billable Units]]","v":0},null,{"$f":"UnitsDetails44[[#This Row],[Rate]]*UnitsDetails44[[#This Row],[Room & Board Units]]","v":0},null,{"$f":"'[4]Final Recon - Summary'!G164","v":0},{"$f":"UnitsDetails44[[#This Row],[ODS DMC General Units]]+UnitsDetails44[[#This Row],[ODS General Units]]+UnitsDetails44[[#This Row],[ODS DMC AB109 Units]]+UnitsDetails44[[#This Row],[ODS AB109 Units]]+UnitsDetails44[[#This Row],[SUD Non-Billable Units]]+UnitsDetails44[[#This Row],[Room & Board Units]]","v":0},0]
[0,{"$f":"'[4]MH & SUD INVOICE (Sch I)'!B247","v":"Individual - Psychologist/Pre-licensed Psychologist"},{"$f":"'[4]MH & SUD INVOICE (Sch I)'!D247","v":"Per Billable Minute"},{"$f":"'[4]MH & SUD INVOICE (Sch I)'!E247","v":8.2799999999999994},{"$f":"UnitsDetails44[[#This Row],[ODS DMC General Units]]+UnitsDetails44[[#This Row],[ODS General Units]]+UnitsDetails44[[#This Row],[ODS DMC AB109 Units]]+UnitsDetails44[[#This Row],[ODS AB109 Units]]+UnitsDetails44[[#This Row],[Room & Board Units]]+UnitsDetails44[[#This Row],[SUD Non-Billable Units]]","v":0},0,null,0,null,{"$f":"UnitsDetails44[[#This Row],[ODS General Units]]*UnitsDetails44[[#This Row],[Rate]]","v":0},null,{"$f":"UnitsDetails44[[#This Row],[Rate]]*UnitsDetails44[[#This Row],[ODS DMC AB109 Units]]","v":0},null,{"$f":"UnitsDetails44[[#This Row],[Rate]]*UnitsDetails44[[#This Row],[ODS AB109 Units]]","v":0},null,{"$f":"UnitsDetails44[[#This Row],[Rate]]*UnitsDetails44[[#This Row],[SUD Non-Billable Units]]","v":0},null,{"$f":"UnitsDetails44[[#This Row],[Rate]]*UnitsDetails44[[#This Row],[Room & Board Units]]","v":0},null,{"$f":"'[4]Final Recon - Summary'!G165","v":0},{"$f":"UnitsDetails44[[#This Row],[ODS DMC General Units]]+UnitsDetails44[[#This Row],[ODS General Units]]+UnitsDetails44[[#This Row],[ODS DMC AB109 Units]]+UnitsDetails44[[#This Row],[ODS AB109 Units]]+UnitsDetails44[[#This Row],[SUD Non-Billable Units]]+UnitsDetails44[[#This Row],[Room & Board Units]]","v":0},0]
[0,{"$f":"'[4]MH & SUD INVOICE (Sch I)'!B248","v":"Individual - Psychiatrist/ Contracted Psychiatrist/Licensed Physician (MD)"},{"$f":"'[4]MH & SUD INVOICE (Sch I)'!D248","v":"Per Billable Minute"},{"$f":"'[4]MH & SUD INVOICE (Sch I)'!E248","v":11.57},{"$f":"UnitsDetails44[[#This Row],[ODS DMC General Units]]+UnitsDetails44[[#This Row],[ODS General Units]]+UnitsDetails44[[#This Row],[ODS DMC AB109 Units]]+UnitsDetails44[[#This Row],[ODS AB109 Units]]+UnitsDetails44[[#This Row],[Room & Board Units]]+UnitsDetails44[[#This Row],[SUD Non-Billable Units]]","v":0},0,null,0,null,{"$f":"UnitsDetails44[[#This Row],[ODS General Units]]*UnitsDetails44[[#This Row],[Rate]]","v":0},null,{"$f":"UnitsDetails44[[#This Row],[Rate]]*UnitsDetails44[[#This Row],[ODS DMC AB109 Units]]","v":0},null,{"$f":"UnitsDetails44[[#This Row],[Rate]]*UnitsDetails44[[#This Row],[ODS AB109 Units]]","v":0},null,{"$f":"UnitsDetails44[[#This Row],[Rate]]*UnitsDetails44[[#This Row],[SUD Non-Billable Units]]","v":0},null,{"$f":"UnitsDetails44[[#This Row],[Rate]]*UnitsDetails44[[#This Row],[Room & Board Units]]","v":0},null,{"$f":"'[4]Final Recon - Summary'!G166","v":0},{"$f":"UnitsDetails44[[#This Row],[ODS DMC General Units]]+UnitsDetails44[[#This Row],[ODS General Units]]+UnitsDetails44[[#This Row],[ODS DMC AB109 Units]]+UnitsDetails44[[#This Row],[ODS AB109 Units]]+UnitsDetails44[[#This Row],[SUD Non-Billable Units]]+UnitsDetails44[[#This Row],[Room & Board Units]]","v":0},0]
[0,{"$f":"'[4]MH & SUD INVOICE (Sch I)'!B249","v":"Individual - Registered Nurse (RN)"},{"$f":"'[4]MH & SUD INVOICE (Sch I)'!D249","v":"Per Billable Minute"},{"$f":"'[4]MH & SUD INVOICE (Sch I)'!E249","v":8.36},{"$f":"UnitsDetails44[[#This Row],[ODS DMC General Units]]+UnitsDetails44[[#This Row],[ODS General Units]]+UnitsDetails44[[#This Row],[ODS DMC AB109 Units]]+UnitsDetails44[[#This Row],[ODS AB109 Units]]+UnitsDetails44[[#This Row],[Room & Board Units]]+UnitsDetails44[[#This Row],[SUD Non-Billable Units]]","v":0},0,null,0,null,{"$f":"UnitsDetails44[[#This Row],[ODS General Units]]*UnitsDetails44[[#This Row],[Rate]]","v":0},null,{"$f":"UnitsDetails44[[#This Row],[Rate]]*UnitsDetails44[[#This Row],[ODS DMC AB109 Units]]","v":0},null,{"$f":"UnitsDetails44[[#This Row],[Rate]]*UnitsDetails44[[#This Row],[ODS AB109 Units]]","v":0},null,{"$f":"UnitsDetails44[[#This Row],[Rate]]*UnitsDetails44[[#This Row],[SUD Non-Billable Units]]","v":0},null,{"$f":"UnitsDetails44[[#This Row],[Rate]]*UnitsDetails44[[#This Row],[Room & Board Units]]","v":0},null,{"$f":"'[4]Final Recon - Summary'!G167","v":0},{"$f":"UnitsDetails44[[#This Row],[ODS DMC General Units]]+UnitsDetails44[[#This Row],[ODS General Units]]+UnitsDetails44[[#This Row],[ODS DMC AB109 Units]]+UnitsDetails44[[#This Row],[ODS AB109 Units]]+UnitsDetails44[[#This Row],[SUD Non-Billable Units]]+UnitsDetails44[[#This Row],[Room & Board Units]]","v":0},0]
[0,{"$f":"'[4]MH & SUD INVOICE (Sch I)'!B250","v":"Individual - Registered Pharmacist"},{"$f":"'[4]MH & SUD INVOICE (Sch I)'!D250","v":"Per Billable Minute"},{"$f":"'[4]MH & SUD INVOICE (Sch I)'!E250","v":9.84},{"$f":"UnitsDetails44[[#This Row],[ODS DMC General Units]]+UnitsDetails44[[#This Row],[ODS General Units]]+UnitsDetails44[[#This Row],[ODS DMC AB109 Units]]+UnitsDetails44[[#This Row],[ODS AB109 Units]]+UnitsDetails44[[#This Row],[Room & Board Units]]+UnitsDetails44[[#This Row],[SUD Non-Billable Units]]","v":0},0,null,0,null,{"$f":"UnitsDetails44[[#This Row],[ODS General Units]]*UnitsDetails44[[#This Row],[Rate]]","v":0},null,{"$f":"UnitsDetails44[[#This Row],[Rate]]*UnitsDetails44[[#This Row],[ODS DMC AB109 Units]]","v":0},null,{"$f":"UnitsDetails44[[#This Row],[Rate]]*UnitsDetails44[[#This Row],[ODS AB109 Units]]","v":0},null,{"$f":"UnitsDetails44[[#This Row],[Rate]]*UnitsDetails44[[#This Row],[SUD Non-Billable Units]]","v":0},null,{"$f":"UnitsDetails44[[#This Row],[Rate]]*UnitsDetails44[[#This Row],[Room & Board Units]]","v":0},null,{"$f":"'[4]Final Recon - Summary'!G168","v":0},{"$f":"UnitsDetails44[[#This Row],[ODS DMC General Units]]+UnitsDetails44[[#This Row],[ODS General Units]]+UnitsDetails44[[#This Row],[ODS DMC AB109 Units]]+UnitsDetails44[[#This Row],[ODS AB109 Units]]+UnitsDetails44[[#This Row],[SUD Non-Billable Units]]+UnitsDetails44[[#This Row],[Room & Board Units]]","v":0},0]
[0,{"$f":"'[4]MH & SUD INVOICE (Sch I)'!B251","v":"Individual - Interpreter Services"},{"$f":"'[4]MH & SUD INVOICE (Sch I)'!D251","v":"Per Billable Minute"},{"$f":"'[4]MH & SUD INVOICE (Sch I)'!E251","v":2.19},{"$f":"UnitsDetails44[[#This Row],[ODS DMC General Units]]+UnitsDetails44[[#This Row],[ODS General Units]]+UnitsDetails44[[#This Row],[ODS DMC AB109 Units]]+UnitsDetails44[[#This Row],[ODS AB109 Units]]+UnitsDetails44[[#This Row],[Room & Board Units]]+UnitsDetails44[[#This Row],[SUD Non-Billable Units]]","v":0},0,null,0,null,{"$f":"UnitsDetails44[[#This Row],[ODS General Units]]*UnitsDetails44[[#This Row],[Rate]]","v":0},null,{"$f":"UnitsDetails44[[#This Row],[Rate]]*UnitsDetails44[[#This Row],[ODS DMC AB109 Units]]","v":0},null,{"$f":"UnitsDetails44[[#This Row],[Rate]]*UnitsDetails44[[#This Row],[ODS AB109 Units]]","v":0},null,{"$f":"UnitsDetails44[[#This Row],[Rate]]*UnitsDetails44[[#This Row],[SUD Non-Billable Units]]","v":0},null,{"$f":"UnitsDetails44[[#This Row],[Rate]]*UnitsDetails44[[#This Row],[Room & Board Units]]","v":0},null,{"$f":"'[4]Final Recon - Summary'!G169","v":0},{"$f":"UnitsDetails44[[#This Row],[ODS DMC General Units]]+UnitsDetails44[[#This Row],[ODS General Units]]+UnitsDetails44[[#This Row],[ODS DMC AB109 Units]]+UnitsDetails44[[#This Row],[ODS AB109 Units]]+UnitsDetails44[[#This Row],[SUD Non-Billable Units]]+UnitsDetails44[[#This Row],[Room & Board Units]]","v":0},0]
[0,{"$f":"'[4]MH & SUD INVOICE (Sch I)'!B252","v":"Interactive Complexity"},{"$f":"'[4]MH & SUD INVOICE (Sch I)'!D252","v":"Per Occurrence"},{"$f":"'[4]MH & SUD INVOICE (Sch I)'!E252","v":14.61},{"$f":"UnitsDetails44[[#This Row],[ODS DMC General Units]]+UnitsDetails44[[#This Row],[ODS General Units]]+UnitsDetails44[[#This Row],[ODS DMC AB109 Units]]+UnitsDetails44[[#This Row],[ODS AB109 Units]]+UnitsDetails44[[#This Row],[Room & Board Units]]+UnitsDetails44[[#This Row],[SUD Non-Billable Units]]","v":0},0,null,0,null,{"$f":"UnitsDetails44[[#This Row],[ODS General Units]]*UnitsDetails44[[#This Row],[Rate]]","v":0},null,{"$f":"UnitsDetails44[[#This Row],[Rate]]*UnitsDetails44[[#This Row],[ODS DMC AB109 Units]]","v":0},null,{"$f":"UnitsDetails44[[#This Row],[Rate]]*UnitsDetails44[[#This Row],[ODS AB109 Units]]","v":0},null,{"$f":"UnitsDetails44[[#This Row],[Rate]]*UnitsDetails44[[#This Row],[SUD Non-Billable Units]]","v":0},null,{"$f":"UnitsDetails44[[#This Row],[Rate]]*UnitsDetails44[[#This Row],[Room & Board Units]]","v":0},null,{"$f":"'[4]Final Recon - Summary'!G170","v":0},{"$f":"UnitsDetails44[[#This Row],[ODS DMC General Units]]+UnitsDetails44[[#This Row],[ODS General Units]]+UnitsDetails44[[#This Row],[ODS DMC AB109 Units]]+UnitsDetails44[[#This Row],[ODS AB109 Units]]+UnitsDetails44[[#This Row],[SUD Non-Billable Units]]+UnitsDetails44[[#This Row],[Room & Board Units]]","v":0},0]
[0,{"$f":"'[4]MH & SUD INVOICE (Sch I)'!B253","v":"Parent-Child Interaction Therapy (PCIT Modifier 22)"},{"$f":"'[4]MH & SUD INVOICE (Sch I)'!D253","v":"Per Occurrence"},{"$f":"'[4]MH & SUD INVOICE (Sch I)'!E253","v":2.56},{"$f":"UnitsDetails44[[#This Row],[ODS DMC General Units]]+UnitsDetails44[[#This Row],[ODS General Units]]+UnitsDetails44[[#This Row],[ODS DMC AB109 Units]]+UnitsDetails44[[#This Row],[ODS AB109 Units]]+UnitsDetails44[[#This Row],[Room & Board Units]]+UnitsDetails44[[#This Row],[SUD Non-Billable Units]]","v":0},0,null,0,null,{"$f":"UnitsDetails44[[#This Row],[ODS General Units]]*UnitsDetails44[[#This Row],[Rate]]","v":0},null,{"$f":"UnitsDetails44[[#This Row],[Rate]]*UnitsDetails44[[#This Row],[ODS DMC AB109 Units]]","v":0},null,{"$f":"UnitsDetails44[[#This Row],[Rate]]*UnitsDetails44[[#This Row],[ODS AB109 Units]]","v":0},null,{"$f":"UnitsDetails44[[#This Row],[Rate]]*UnitsDetails44[[#This Row],[SUD Non-Billable Units]]","v":0},null,{"$f":"UnitsDetails44[[#This Row],[Rate]]*UnitsDetails44[[#This Row],[Room & Board Units]]","v":0},null,{"$f":"'[4]Final Recon - Summary'!G171","v":0},{"$f":"UnitsDetails44[[#This Row],[ODS DMC General Units]]+UnitsDetails44[[#This Row],[ODS General Units]]+UnitsDetails44[[#This Row],[ODS DMC AB109 Units]]+UnitsDetails44[[#This Row],[ODS AB109 Units]]+UnitsDetails44[[#This Row],[SUD Non-Billable Units]]+UnitsDetails44[[#This Row],[Room & Board Units]]","v":0},0]
[0,{"$f":"'[4]MH & SUD INVOICE (Sch I)'!B254","v":"Group - Alcohol and Drug Counselor"},{"$f":"'[4]MH & SUD INVOICE (Sch I)'!D254","v":"Per Billable Minute"},{"$f":"'[4]MH & SUD INVOICE (Sch I)'!E254","v":0.98},{"$f":"UnitsDetails44[[#This Row],[ODS DMC General Units]]+UnitsDetails44[[#This Row],[ODS General Units]]+UnitsDetails44[[#This Row],[ODS DMC AB109 Units]]+UnitsDetails44[[#This Row],[ODS AB109 Units]]+UnitsDetails44[[#This Row],[Room & Board Units]]+UnitsDetails44[[#This Row],[SUD Non-Billable Units]]","v":0},0,null,0,null,{"$f":"UnitsDetails44[[#This Row],[ODS General Units]]*UnitsDetails44[[#This Row],[Rate]]","v":0},null,{"$f":"UnitsDetails44[[#This Row],[Rate]]*UnitsDetails44[[#This Row],[ODS DMC AB109 Units]]","v":0},null,{"$f":"UnitsDetails44[[#This Row],[Rate]]*UnitsDetails44[[#This Row],[ODS AB109 Units]]","v":0},null,{"$f":"UnitsDetails44[[#This Row],[Rate]]*UnitsDetails44[[#This Row],[SUD Non-Billable Units]]","v":0},null,{"$f":"UnitsDetails44[[#This Row],[Rate]]*UnitsDetails44[[#This Row],[Room & Board Units]]","v":0},null,{"$f":"'[4]Final Recon - Summary'!G172","v":0},{"$f":"UnitsDetails44[[#This Row],[ODS DMC General Units]]+UnitsDetails44[[#This Row],[ODS General Units]]+UnitsDetails44[[#This Row],[ODS DMC AB109 Units]]+UnitsDetails44[[#This Row],[ODS AB109 Units]]+UnitsDetails44[[#This Row],[SUD Non-Billable Units]]+UnitsDetails44[[#This Row],[Room & Board Units]]","v":0},0]
[0,{"$f":"'[4]MH & SUD INVOICE (Sch I)'!B255","v":"Group - Clinical Nurse Specialist"},{"$f":"'[4]MH & SUD INVOICE (Sch I)'!D255","v":"Per Billable Minute"},{"$f":"'[4]MH & SUD INVOICE (Sch I)'!E255","v":2.2799999999999998},{"$f":"UnitsDetails44[[#This Row],[ODS DMC General Units]]+UnitsDetails44[[#This Row],[ODS General Units]]+UnitsDetails44[[#This Row],[ODS DMC AB109 Units]]+UnitsDetails44[[#This Row],[ODS AB109 Units]]+UnitsDetails44[[#This Row],[Room & Board Units]]+UnitsDetails44[[#This Row],[SUD Non-Billable Units]]","v":0},0,null,0,null,{"$f":"UnitsDetails44[[#This Row],[ODS General Units]]*UnitsDetails44[[#This Row],[Rate]]","v":0},null,{"$f":"UnitsDetails44[[#This Row],[Rate]]*UnitsDetails44[[#This Row],[ODS DMC AB109 Units]]","v":0},null,{"$f":"UnitsDetails44[[#This Row],[Rate]]*UnitsDetails44[[#This Row],[ODS AB109 Units]]","v":0},null,{"$f":"UnitsDetails44[[#This Row],[Rate]]*UnitsDetails44[[#This Row],[SUD Non-Billable Units]]","v":0},null,{"$f":"UnitsDetails44[[#This Row],[Rate]]*UnitsDetails44[[#This Row],[Room & Board Units]]","v":0},null,{"$f":"'[4]Final Recon - Summary'!G173","v":0},{"$f":"UnitsDetails44[[#This Row],[ODS DMC General Units]]+UnitsDetails44[[#This Row],[ODS General Units]]+UnitsDetails44[[#This Row],[ODS DMC AB109 Units]]+UnitsDetails44[[#This Row],[ODS AB109 Units]]+UnitsDetails44[[#This Row],[SUD Non-Billable Units]]+UnitsDetails44[[#This Row],[Room & Board Units]]","v":0},0]
[0,{"$f":"'[4]MH & SUD INVOICE (Sch I)'!B256","v":"Group - Community Health Worker (CPT 98961)"},{"$f":"'[4]MH & SUD INVOICE (Sch I)'!D256","v":"Per Billable Minute"},{"$f":"'[4]MH & SUD INVOICE (Sch I)'!E256","v":1.3800000000000001},{"$f":"UnitsDetails44[[#This Row],[ODS DMC General Units]]+UnitsDetails44[[#This Row],[ODS General Units]]+UnitsDetails44[[#This Row],[ODS DMC AB109 Units]]+UnitsDetails44[[#This Row],[ODS AB109 Units]]+UnitsDetails44[[#This Row],[Room & Board Units]]+UnitsDetails44[[#This Row],[SUD Non-Billable Units]]","v":0},0,null,0,null,{"$f":"UnitsDetails44[[#This Row],[ODS General Units]]*UnitsDetails44[[#This Row],[Rate]]","v":0},null,{"$f":"UnitsDetails44[[#This Row],[Rate]]*UnitsDetails44[[#This Row],[ODS DMC AB109 Units]]","v":0},null,{"$f":"UnitsDetails44[[#This Row],[Rate]]*UnitsDetails44[[#This Row],[ODS AB109 Units]]","v":0},null,{"$f":"UnitsDetails44[[#This Row],[Rate]]*UnitsDetails44[[#This Row],[SUD Non-Billable Units]]","v":0},null,{"$f":"UnitsDetails44[[#This Row],[Rate]]*UnitsDetails44[[#This Row],[Room & Board Units]]","v":0},null,{"$f":"'[4]Final Recon - Summary'!G174","v":0},{"$f":"UnitsDetails44[[#This Row],[ODS DMC General Units]]+UnitsDetails44[[#This Row],[ODS General Units]]+UnitsDetails44[[#This Row],[ODS DMC AB109 Units]]+UnitsDetails44[[#This Row],[ODS AB109 Units]]+UnitsDetails44[[#This Row],[SUD Non-Billable Units]]+UnitsDetails44[[#This Row],[Room & Board Units]]","v":0},0]
[0,{"$f":"'[4]MH & SUD INVOICE (Sch I)'!B257","v":"Group - Community Health Worker (CPT 98962)"},{"$f":"'[4]MH & SUD INVOICE (Sch I)'!D257","v":"Per Billable Minute"},{"$f":"'[4]MH & SUD INVOICE (Sch I)'!E257","v":0.63},{"$f":"UnitsDetails44[[#This Row],[ODS DMC General Units]]+UnitsDetails44[[#This Row],[ODS General Units]]+UnitsDetails44[[#This Row],[ODS DMC AB109 Units]]+UnitsDetails44[[#This Row],[ODS AB109 Units]]+UnitsDetails44[[#This Row],[Room & Board Units]]+UnitsDetails44[[#This Row],[SUD Non-Billable Units]]","v":0},0,null,0,null,{"$f":"UnitsDetails44[[#This Row],[ODS General Units]]*UnitsDetails44[[#This Row],[Rate]]","v":0},null,{"$f":"UnitsDetails44[[#This Row],[Rate]]*UnitsDetails44[[#This Row],[ODS DMC AB109 Units]]","v":0},null,{"$f":"UnitsDetails44[[#This Row],[Rate]]*UnitsDetails44[[#This Row],[ODS AB109 Units]]","v":0},null,{"$f":"UnitsDetails44[[#This Row],[Rate]]*UnitsDetails44[[#This Row],[SUD Non-Billable Units]]","v":0},null,{"$f":"UnitsDetails44[[#This Row],[Rate]]*UnitsDetails44[[#This Row],[Room & Board Units]]","v":0},null,{"$f":"'[4]Final Recon - Summary'!G175","v":0},{"$f":"UnitsDetails44[[#This Row],[ODS DMC General Units]]+UnitsDetails44[[#This Row],[ODS General Units]]+UnitsDetails44[[#This Row],[ODS DMC AB109 Units]]+UnitsDetails44[[#This Row],[ODS AB109 Units]]+UnitsDetails44[[#This Row],[SUD Non-Billable Units]]+UnitsDetails44[[#This Row],[Room & Board Units]]","v":0},0]
[0,{"$f":"'[4]MH & SUD INVOICE (Sch I)'!B258","v":"Group - Licensed Psychiatric Technician"},{"$f":"'[4]MH & SUD INVOICE (Sch I)'!D258","v":"Per Billable Minute"},{"$f":"'[4]MH & SUD INVOICE (Sch I)'!E258","v":0.84000000000000008},{"$f":"UnitsDetails44[[#This Row],[ODS DMC General Units]]+UnitsDetails44[[#This Row],[ODS General Units]]+UnitsDetails44[[#This Row],[ODS DMC AB109 Units]]+UnitsDetails44[[#This Row],[ODS AB109 Units]]+UnitsDetails44[[#This Row],[Room & Board Units]]+UnitsDetails44[[#This Row],[SUD Non-Billable Units]]","v":0},0,null,0,null,{"$f":"UnitsDetails44[[#This Row],[ODS General Units]]*UnitsDetails44[[#This Row],[Rate]]","v":0},null,{"$f":"UnitsDetails44[[#This Row],[Rate]]*UnitsDetails44[[#This Row],[ODS DMC AB109 Units]]","v":0},null,{"$f":"UnitsDetails44[[#This Row],[Rate]]*UnitsDetails44[[#This Row],[ODS AB109 Units]]","v":0},null,{"$f":"UnitsDetails44[[#This Row],[Rate]]*UnitsDetails44[[#This Row],[SUD Non-Billable Units]]","v":0},null,{"$f":"UnitsDetails44[[#This Row],[Rate]]*UnitsDetails44[[#This Row],[Room & Board Units]]","v":0},null,{"$f":"'[4]Final Recon - Summary'!G176","v":0},{"$f":"UnitsDetails44[[#This Row],[ODS DMC General Units]]+UnitsDetails44[[#This Row],[ODS General Units]]+UnitsDetails44[[#This Row],[ODS DMC AB109 Units]]+UnitsDetails44[[#This Row],[ODS AB109 Units]]+UnitsDetails44[[#This Row],[SUD Non-Billable Units]]+UnitsDetails44[[#This Row],[Room & Board Units]]","v":0},0]
[0,{"$f":"'[4]MH & SUD INVOICE (Sch I)'!B259","v":"Group - LPHA (MFT  LCSW  LPCC)/Intern or Waivered LPHA (MFT  LCSW  LPCC)"},{"$f":"'[4]MH & SUD INVOICE (Sch I)'!D259","v":"Per Billable Minute"},{"$f":"'[4]MH & SUD INVOICE (Sch I)'!E259","v":1.1900000000000002},{"$f":"UnitsDetails44[[#This Row],[ODS DMC General Units]]+UnitsDetails44[[#This Row],[ODS General Units]]+UnitsDetails44[[#This Row],[ODS DMC AB109 Units]]+UnitsDetails44[[#This Row],[ODS AB109 Units]]+UnitsDetails44[[#This Row],[Room & Board Units]]+UnitsDetails44[[#This Row],[SUD Non-Billable Units]]","v":0},0,null,0,null,{"$f":"UnitsDetails44[[#This Row],[ODS General Units]]*UnitsDetails44[[#This Row],[Rate]]","v":0},null,{"$f":"UnitsDetails44[[#This Row],[Rate]]*UnitsDetails44[[#This Row],[ODS DMC AB109 Units]]","v":0},null,{"$f":"UnitsDetails44[[#This Row],[Rate]]*UnitsDetails44[[#This Row],[ODS AB109 Units]]","v":0},null,{"$f":"UnitsDetails44[[#This Row],[Rate]]*UnitsDetails44[[#This Row],[SUD Non-Billable Units]]","v":0},null,{"$f":"UnitsDetails44[[#This Row],[Rate]]*UnitsDetails44[[#This Row],[Room & Board Units]]","v":0},null,{"$f":"'[4]Final Recon - Summary'!G177","v":0},{"$f":"UnitsDetails44[[#This Row],[ODS DMC General Units]]+UnitsDetails44[[#This Row],[ODS General Units]]+UnitsDetails44[[#This Row],[ODS DMC AB109 Units]]+UnitsDetails44[[#This Row],[ODS AB109 Units]]+UnitsDetails44[[#This Row],[SUD Non-Billable Units]]+UnitsDetails44[[#This Row],[Room & Board Units]]","v":0},0]
[0,{"$f":"'[4]MH & SUD INVOICE (Sch I)'!B260","v":"Group - Licensed Vocational Nurse (LVN)"},{"$f":"'[4]MH & SUD INVOICE (Sch I)'!D260","v":"Per Billable Minute"},{"$f":"'[4]MH & SUD INVOICE (Sch I)'!E260","v":0.98},{"$f":"UnitsDetails44[[#This Row],[ODS DMC General Units]]+UnitsDetails44[[#This Row],[ODS General Units]]+UnitsDetails44[[#This Row],[ODS DMC AB109 Units]]+UnitsDetails44[[#This Row],[ODS AB109 Units]]+UnitsDetails44[[#This Row],[Room & Board Units]]+UnitsDetails44[[#This Row],[SUD Non-Billable Units]]","v":0},0,null,0,null,{"$f":"UnitsDetails44[[#This Row],[ODS General Units]]*UnitsDetails44[[#This Row],[Rate]]","v":0},null,{"$f":"UnitsDetails44[[#This Row],[Rate]]*UnitsDetails44[[#This Row],[ODS DMC AB109 Units]]","v":0},null,{"$f":"UnitsDetails44[[#This Row],[Rate]]*UnitsDetails44[[#This Row],[ODS AB109 Units]]","v":0},null,{"$f":"UnitsDetails44[[#This Row],[Rate]]*UnitsDetails44[[#This Row],[SUD Non-Billable Units]]","v":0},null,{"$f":"UnitsDetails44[[#This Row],[Rate]]*UnitsDetails44[[#This Row],[Room & Board Units]]","v":0},null,{"$f":"'[4]Final Recon - Summary'!G178","v":0},{"$f":"UnitsDetails44[[#This Row],[ODS DMC General Units]]+UnitsDetails44[[#This Row],[ODS General Units]]+UnitsDetails44[[#This Row],[ODS DMC AB109 Units]]+UnitsDetails44[[#This Row],[ODS AB109 Units]]+UnitsDetails44[[#This Row],[SUD Non-Billable Units]]+UnitsDetails44[[#This Row],[Room & Board Units]]","v":0},0]
[0,{"$f":"'[4]MH & SUD INVOICE (Sch I)'!B261","v":"Group - Medical Assistant"},{"$f":"'[4]MH & SUD INVOICE (Sch I)'!D261","v":"Per Billable Minute"},{"$f":"'[4]MH & SUD INVOICE (Sch I)'!E261","v":0.68},{"$f":"UnitsDetails44[[#This Row],[ODS DMC General Units]]+UnitsDetails44[[#This Row],[ODS General Units]]+UnitsDetails44[[#This Row],[ODS DMC AB109 Units]]+UnitsDetails44[[#This Row],[ODS AB109 Units]]+UnitsDetails44[[#This Row],[Room & Board Units]]+UnitsDetails44[[#This Row],[SUD Non-Billable Units]]","v":0},0,null,0,null,{"$f":"UnitsDetails44[[#This Row],[ODS General Units]]*UnitsDetails44[[#This Row],[Rate]]","v":0},null,{"$f":"UnitsDetails44[[#This Row],[Rate]]*UnitsDetails44[[#This Row],[ODS DMC AB109 Units]]","v":0},null,{"$f":"UnitsDetails44[[#This Row],[Rate]]*UnitsDetails44[[#This Row],[ODS AB109 Units]]","v":0},null,{"$f":"UnitsDetails44[[#This Row],[Rate]]*UnitsDetails44[[#This Row],[SUD Non-Billable Units]]","v":0},null,{"$f":"UnitsDetails44[[#This Row],[Rate]]*UnitsDetails44[[#This Row],[Room & Board Units]]","v":0},null,{"$f":"'[4]Final Recon - Summary'!G179","v":0},{"$f":"UnitsDetails44[[#This Row],[ODS DMC General Units]]+UnitsDetails44[[#This Row],[ODS General Units]]+UnitsDetails44[[#This Row],[ODS DMC AB109 Units]]+UnitsDetails44[[#This Row],[ODS AB109 Units]]+UnitsDetails44[[#This Row],[SUD Non-Billable Units]]+UnitsDetails44[[#This Row],[Room & Board Units]]","v":0},0]
[0,{"$f":"'[4]MH & SUD INVOICE (Sch I)'!B262","v":"Group - Mental Health Rehabilitation Specialist"},{"$f":"'[4]MH & SUD INVOICE (Sch I)'!D262","v":"Per Billable Minute"},{"$f":"'[4]MH & SUD INVOICE (Sch I)'!E262","v":0.89999999999999991},{"$f":"UnitsDetails44[[#This Row],[ODS DMC General Units]]+UnitsDetails44[[#This Row],[ODS General Units]]+UnitsDetails44[[#This Row],[ODS DMC AB109 Units]]+UnitsDetails44[[#This Row],[ODS AB109 Units]]+UnitsDetails44[[#This Row],[Room & Board Units]]+UnitsDetails44[[#This Row],[SUD Non-Billable Units]]","v":0},0,null,0,null,{"$f":"UnitsDetails44[[#This Row],[ODS General Units]]*UnitsDetails44[[#This Row],[Rate]]","v":0},null,{"$f":"UnitsDetails44[[#This Row],[Rate]]*UnitsDetails44[[#This Row],[ODS DMC AB109 Units]]","v":0},null,{"$f":"UnitsDetails44[[#This Row],[Rate]]*UnitsDetails44[[#This Row],[ODS AB109 Units]]","v":0},null,{"$f":"UnitsDetails44[[#This Row],[Rate]]*UnitsDetails44[[#This Row],[SUD Non-Billable Units]]","v":0},null,{"$f":"UnitsDetails44[[#This Row],[Rate]]*UnitsDetails44[[#This Row],[Room & Board Units]]","v":0},null,{"$f":"'[4]Final Recon - Summary'!G180","v":0},{"$f":"UnitsDetails44[[#This Row],[ODS DMC General Units]]+UnitsDetails44[[#This Row],[ODS General Units]]+UnitsDetails44[[#This Row],[ODS DMC AB109 Units]]+UnitsDetails44[[#This Row],[ODS AB109 Units]]+UnitsDetails44[[#This Row],[SUD Non-Billable Units]]+UnitsDetails44[[#This Row],[Room & Board Units]]","v":0},0]
[0,{"$f":"'[4]MH & SUD INVOICE (Sch I)'!B263","v":"Group - Nurse Practitioner"},{"$f":"'[4]MH & SUD INVOICE (Sch I)'!D263","v":"Per Billable Minute"},{"$f":"'[4]MH & SUD INVOICE (Sch I)'!E263","v":2.2799999999999998},{"$f":"UnitsDetails44[[#This Row],[ODS DMC General Units]]+UnitsDetails44[[#This Row],[ODS General Units]]+UnitsDetails44[[#This Row],[ODS DMC AB109 Units]]+UnitsDetails44[[#This Row],[ODS AB109 Units]]+UnitsDetails44[[#This Row],[Room & Board Units]]+UnitsDetails44[[#This Row],[SUD Non-Billable Units]]","v":0},0,null,0,null,{"$f":"UnitsDetails44[[#This Row],[ODS General Units]]*UnitsDetails44[[#This Row],[Rate]]","v":0},null,{"$f":"UnitsDetails44[[#This Row],[Rate]]*UnitsDetails44[[#This Row],[ODS DMC AB109 Units]]","v":0},null,{"$f":"UnitsDetails44[[#This Row],[Rate]]*UnitsDetails44[[#This Row],[ODS AB109 Units]]","v":0},null,{"$f":"UnitsDetails44[[#This Row],[Rate]]*UnitsDetails44[[#This Row],[SUD Non-Billable Units]]","v":0},null,{"$f":"UnitsDetails44[[#This Row],[Rate]]*UnitsDetails44[[#This Row],[Room & Board Units]]","v":0},null,{"$f":"'[4]Final Recon - Summary'!G181","v":0},{"$f":"UnitsDetails44[[#This Row],[ODS DMC General Units]]+UnitsDetails44[[#This Row],[ODS General Units]]+UnitsDetails44[[#This Row],[ODS DMC AB109 Units]]+UnitsDetails44[[#This Row],[ODS AB109 Units]]+UnitsDetails44[[#This Row],[SUD Non-Billable Units]]+UnitsDetails44[[#This Row],[Room & Board Units]]","v":0},0]
[0,{"$f":"'[4]MH & SUD INVOICE (Sch I)'!B264","v":"Group - Occupational Therapist"},{"$f":"'[4]MH & SUD INVOICE (Sch I)'!D264","v":"Per Billable Minute"},{"$f":"'[4]MH & SUD INVOICE (Sch I)'!E264","v":1.59},{"$f":"UnitsDetails44[[#This Row],[ODS DMC General Units]]+UnitsDetails44[[#This Row],[ODS General Units]]+UnitsDetails44[[#This Row],[ODS DMC AB109 Units]]+UnitsDetails44[[#This Row],[ODS AB109 Units]]+UnitsDetails44[[#This Row],[Room & Board Units]]+UnitsDetails44[[#This Row],[SUD Non-Billable Units]]","v":0},0,null,0,null,{"$f":"UnitsDetails44[[#This Row],[ODS General Units]]*UnitsDetails44[[#This Row],[Rate]]","v":0},null,{"$f":"UnitsDetails44[[#This Row],[Rate]]*UnitsDetails44[[#This Row],[ODS DMC AB109 Units]]","v":0},null,{"$f":"UnitsDetails44[[#This Row],[Rate]]*UnitsDetails44[[#This Row],[ODS AB109 Units]]","v":0},null,{"$f":"UnitsDetails44[[#This Row],[Rate]]*UnitsDetails44[[#This Row],[SUD Non-Billable Units]]","v":0},null,{"$f":"UnitsDetails44[[#This Row],[Rate]]*UnitsDetails44[[#This Row],[Room & Board Units]]","v":0},null,{"$f":"'[4]Final Recon - Summary'!G182","v":0},{"$f":"UnitsDetails44[[#This Row],[ODS DMC General Units]]+UnitsDetails44[[#This Row],[ODS General Units]]+UnitsDetails44[[#This Row],[ODS DMC AB109 Units]]+UnitsDetails44[[#This Row],[ODS AB109 Units]]+UnitsDetails44[[#This Row],[SUD Non-Billable Units]]+UnitsDetails44[[#This Row],[Room & Board Units]]","v":0},0]
[0,{"$f":"'[4]MH & SUD INVOICE (Sch I)'!B265","v":"Group - Other Qualified Providers - Other Designated MH staff that bill medical"},{"$f":"'[4]MH & SUD INVOICE (Sch I)'!D265","v":"Per Billable Minute"},{"$f":"'[4]MH & SUD INVOICE (Sch I)'!E265","v":0.89999999999999991},{"$f":"UnitsDetails44[[#This Row],[ODS DMC General Units]]+UnitsDetails44[[#This Row],[ODS General Units]]+UnitsDetails44[[#This Row],[ODS DMC AB109 Units]]+UnitsDetails44[[#This Row],[ODS AB109 Units]]+UnitsDetails44[[#This Row],[Room & Board Units]]+UnitsDetails44[[#This Row],[SUD Non-Billable Units]]","v":0},0,null,0,null,{"$f":"UnitsDetails44[[#This Row],[ODS General Units]]*UnitsDetails44[[#This Row],[Rate]]","v":0},null,{"$f":"UnitsDetails44[[#This Row],[Rate]]*UnitsDetails44[[#This Row],[ODS DMC AB109 Units]]","v":0},null,{"$f":"UnitsDetails44[[#This Row],[Rate]]*UnitsDetails44[[#This Row],[ODS AB109 Units]]","v":0},null,{"$f":"UnitsDetails44[[#This Row],[Rate]]*UnitsDetails44[[#This Row],[SUD Non-Billable Units]]","v":0},null,{"$f":"UnitsDetails44[[#This Row],[Rate]]*UnitsDetails44[[#This Row],[Room & Board Units]]","v":0},null,{"$f":"'[4]Final Recon - Summary'!G183","v":0},{"$f":"UnitsDetails44[[#This Row],[ODS DMC General Units]]+UnitsDetails44[[#This Row],[ODS General Units]]+UnitsDetails44[[#This Row],[ODS DMC AB109 Units]]+UnitsDetails44[[#This Row],[ODS AB109 Units]]+UnitsDetails44[[#This Row],[SUD Non-Billable Units]]+UnitsDetails44[[#This Row],[Room & Board Units]]","v":0},0]
[{"$f":"$C$5","v":0},{"$f":"'[4]MH & SUD INVOICE (Sch I)'!B266","v":"Group - Peer Support Specialist"},{"$f":"'[4]MH & SUD INVOICE (Sch I)'!D266","v":"Per Billable Minute"},{"$f":"'[4]MH & SUD INVOICE (Sch I)'!E266","v":0.94},{"$f":"UnitsDetails44[[#This Row],[ODS DMC General Units]]+UnitsDetails44[[#This Row],[ODS General Units]]+UnitsDetails44[[#This Row],[ODS DMC AB109 Units]]+UnitsDetails44[[#This Row],[ODS AB109 Units]]+UnitsDetails44[[#This Row],[Room & Board Units]]+UnitsDetails44[[#This Row],[SUD Non-Billable Units]]","v":0},0,null,0,null,{"$f":"UnitsDetails44[[#This Row],[ODS General Units]]*UnitsDetails44[[#This Row],[Rate]]","v":0},null,{"$f":"UnitsDetails44[[#This Row],[Rate]]*UnitsDetails44[[#This Row],[ODS DMC AB109 Units]]","v":0},null,{"$f":"UnitsDetails44[[#This Row],[Rate]]*UnitsDetails44[[#This Row],[ODS AB109 Units]]","v":0},null,{"$f":"UnitsDetails44[[#This Row],[Rate]]*UnitsDetails44[[#This Row],[SUD Non-Billable Units]]","v":0},null,{"$f":"UnitsDetails44[[#This Row],[Rate]]*UnitsDetails44[[#This Row],[Room & Board Units]]","v":0},null,{"$f":"'[4]Final Recon - Summary'!G184","v":0},{"$f":"UnitsDetails44[[#This Row],[ODS DMC General Units]]+UnitsDetails44[[#This Row],[ODS General Units]]+UnitsDetails44[[#This Row],[ODS DMC AB109 Units]]+UnitsDetails44[[#This Row],[ODS AB109 Units]]+UnitsDetails44[[#This Row],[SUD Non-Billable Units]]+UnitsDetails44[[#This Row],[Room & Board Units]]","v":0},{"$f":"T154-U154","v":0}]
[0,{"$f":"'[4]MH & SUD INVOICE (Sch I)'!B267","v":"Group - Physician Assistant"},{"$f":"'[4]MH & SUD INVOICE (Sch I)'!D267","v":"Per Billable Minute"},{"$f":"'[4]MH & SUD INVOICE (Sch I)'!E267","v":2.04},{"$f":"UnitsDetails44[[#This Row],[ODS DMC General Units]]+UnitsDetails44[[#This Row],[ODS General Units]]+UnitsDetails44[[#This Row],[ODS DMC AB109 Units]]+UnitsDetails44[[#This Row],[ODS AB109 Units]]+UnitsDetails44[[#This Row],[Room & Board Units]]+UnitsDetails44[[#This Row],[SUD Non-Billable Units]]","v":0},0,null,0,null,{"$f":"UnitsDetails44[[#This Row],[ODS General Units]]*UnitsDetails44[[#This Row],[Rate]]","v":0},null,{"$f":"UnitsDetails44[[#This Row],[Rate]]*UnitsDetails44[[#This Row],[ODS DMC AB109 Units]]","v":0},null,{"$f":"UnitsDetails44[[#This Row],[Rate]]*UnitsDetails44[[#This Row],[ODS AB109 Units]]","v":0},null,{"$f":"UnitsDetails44[[#This Row],[Rate]]*UnitsDetails44[[#This Row],[SUD Non-Billable Units]]","v":0},null,{"$f":"UnitsDetails44[[#This Row],[Rate]]*UnitsDetails44[[#This Row],[Room & Board Units]]","v":0},null,{"$f":"'[4]Final Recon - Summary'!G185","v":0},{"$f":"UnitsDetails44[[#This Row],[ODS DMC General Units]]+UnitsDetails44[[#This Row],[ODS General Units]]+UnitsDetails44[[#This Row],[ODS DMC AB109 Units]]+UnitsDetails44[[#This Row],[ODS AB109 Units]]+UnitsDetails44[[#This Row],[SUD Non-Billable Units]]+UnitsDetails44[[#This Row],[Room & Board Units]]","v":0},0]
[0,{"$f":"'[4]MH & SUD INVOICE (Sch I)'!B268","v":"Group - Psychologist/Pre-licensed Psychologist"},{"$f":"'[4]MH & SUD INVOICE (Sch I)'!D268","v":"Per Billable Minute"},{"$f":"'[4]MH & SUD INVOICE (Sch I)'!E268","v":1.84},{"$f":"UnitsDetails44[[#This Row],[ODS DMC General Units]]+UnitsDetails44[[#This Row],[ODS General Units]]+UnitsDetails44[[#This Row],[ODS DMC AB109 Units]]+UnitsDetails44[[#This Row],[ODS AB109 Units]]+UnitsDetails44[[#This Row],[Room & Board Units]]+UnitsDetails44[[#This Row],[SUD Non-Billable Units]]","v":0},0,null,0,null,{"$f":"UnitsDetails44[[#This Row],[ODS General Units]]*UnitsDetails44[[#This Row],[Rate]]","v":0},null,{"$f":"UnitsDetails44[[#This Row],[Rate]]*UnitsDetails44[[#This Row],[ODS DMC AB109 Units]]","v":0},null,{"$f":"UnitsDetails44[[#This Row],[Rate]]*UnitsDetails44[[#This Row],[ODS AB109 Units]]","v":0},null,{"$f":"UnitsDetails44[[#This Row],[Rate]]*UnitsDetails44[[#This Row],[SUD Non-Billable Units]]","v":0},null,{"$f":"UnitsDetails44[[#This Row],[Rate]]*UnitsDetails44[[#This Row],[Room & Board Units]]","v":0},null,{"$f":"'[4]Final Recon - Summary'!G186","v":0},{"$f":"UnitsDetails44[[#This Row],[ODS DMC General Units]]+UnitsDetails44[[#This Row],[ODS General Units]]+UnitsDetails44[[#This Row],[ODS DMC AB109 Units]]+UnitsDetails44[[#This Row],[ODS AB109 Units]]+UnitsDetails44[[#This Row],[SUD Non-Billable Units]]+UnitsDetails44[[#This Row],[Room & Board Units]]","v":0},0]
[0,{"$f":"'[4]MH & SUD INVOICE (Sch I)'!B269","v":"Group - Psychiatrist/ Contracted Psychiatrist/Licensed Physician (MD)"},{"$f":"'[4]MH & SUD INVOICE (Sch I)'!D269","v":"Per Billable Minute"},{"$f":"'[4]MH & SUD INVOICE (Sch I)'!E269","v":2.57},{"$f":"UnitsDetails44[[#This Row],[ODS DMC General Units]]+UnitsDetails44[[#This Row],[ODS General Units]]+UnitsDetails44[[#This Row],[ODS DMC AB109 Units]]+UnitsDetails44[[#This Row],[ODS AB109 Units]]+UnitsDetails44[[#This Row],[Room & Board Units]]+UnitsDetails44[[#This Row],[SUD Non-Billable Units]]","v":0},0,null,0,null,{"$f":"UnitsDetails44[[#This Row],[ODS General Units]]*UnitsDetails44[[#This Row],[Rate]]","v":0},null,{"$f":"UnitsDetails44[[#This Row],[Rate]]*UnitsDetails44[[#This Row],[ODS DMC AB109 Units]]","v":0},null,{"$f":"UnitsDetails44[[#This Row],[Rate]]*UnitsDetails44[[#This Row],[ODS AB109 Units]]","v":0},null,{"$f":"UnitsDetails44[[#This Row],[Rate]]*UnitsDetails44[[#This Row],[SUD Non-Billable Units]]","v":0},null,{"$f":"UnitsDetails44[[#This Row],[Rate]]*UnitsDetails44[[#This Row],[Room & Board Units]]","v":0},null,{"$f":"'[4]Final Recon - Summary'!G187","v":0},{"$f":"UnitsDetails44[[#This Row],[ODS DMC General Units]]+UnitsDetails44[[#This Row],[ODS General Units]]+UnitsDetails44[[#This Row],[ODS DMC AB109 Units]]+UnitsDetails44[[#This Row],[ODS AB109 Units]]+UnitsDetails44[[#This Row],[SUD Non-Billable Units]]+UnitsDetails44[[#This Row],[Room & Board Units]]","v":0},0]
[0,{"$f":"'[4]MH & SUD INVOICE (Sch I)'!B270","v":"Group - Registered Nurse (RN)"},{"$f":"'[4]MH & SUD INVOICE (Sch I)'!D270","v":"Per Billable Minute"},{"$f":"'[4]MH & SUD INVOICE (Sch I)'!E270","v":1.8599999999999999},{"$f":"UnitsDetails44[[#This Row],[ODS DMC General Units]]+UnitsDetails44[[#This Row],[ODS General Units]]+UnitsDetails44[[#This Row],[ODS DMC AB109 Units]]+UnitsDetails44[[#This Row],[ODS AB109 Units]]+UnitsDetails44[[#This Row],[Room & Board Units]]+UnitsDetails44[[#This Row],[SUD Non-Billable Units]]","v":0},0,null,0,null,{"$f":"UnitsDetails44[[#This Row],[ODS General Units]]*UnitsDetails44[[#This Row],[Rate]]","v":0},null,{"$f":"UnitsDetails44[[#This Row],[Rate]]*UnitsDetails44[[#This Row],[ODS DMC AB109 Units]]","v":0},null,{"$f":"UnitsDetails44[[#This Row],[Rate]]*UnitsDetails44[[#This Row],[ODS AB109 Units]]","v":0},null,{"$f":"UnitsDetails44[[#This Row],[Rate]]*UnitsDetails44[[#This Row],[SUD Non-Billable Units]]","v":0},null,{"$f":"UnitsDetails44[[#This Row],[Rate]]*UnitsDetails44[[#This Row],[Room & Board Units]]","v":0},null,{"$f":"'[4]Final Recon - Summary'!G188","v":0},{"$f":"UnitsDetails44[[#This Row],[ODS DMC General Units]]+UnitsDetails44[[#This Row],[ODS General Units]]+UnitsDetails44[[#This Row],[ODS DMC AB109 Units]]+UnitsDetails44[[#This Row],[ODS AB109 Units]]+UnitsDetails44[[#This Row],[SUD Non-Billable Units]]+UnitsDetails44[[#This Row],[Room & Board Units]]","v":0},0]
[0,{"$f":"'[4]MH & SUD INVOICE (Sch I)'!B271","v":"Group - Registered Pharmacist"},{"$f":"'[4]MH & SUD INVOICE (Sch I)'!D271","v":"Per Billable Minute"},{"$f":"'[4]MH & SUD INVOICE (Sch I)'!E271","v":2.19},{"$f":"UnitsDetails44[[#This Row],[ODS DMC General Units]]+UnitsDetails44[[#This Row],[ODS General Units]]+UnitsDetails44[[#This Row],[ODS DMC AB109 Units]]+UnitsDetails44[[#This Row],[ODS AB109 Units]]+UnitsDetails44[[#This Row],[Room & Board Units]]+UnitsDetails44[[#This Row],[SUD Non-Billable Units]]","v":0},0,null,0,null,{"$f":"UnitsDetails44[[#This Row],[ODS General Units]]*UnitsDetails44[[#This Row],[Rate]]","v":0},null,{"$f":"UnitsDetails44[[#This Row],[Rate]]*UnitsDetails44[[#This Row],[ODS DMC AB109 Units]]","v":0},null,{"$f":"UnitsDetails44[[#This Row],[Rate]]*UnitsDetails44[[#This Row],[ODS AB109 Units]]","v":0},null,{"$f":"UnitsDetails44[[#This Row],[Rate]]*UnitsDetails44[[#This Row],[SUD Non-Billable Units]]","v":0},null,{"$f":"UnitsDetails44[[#This Row],[Rate]]*UnitsDetails44[[#This Row],[Room & Board Units]]","v":0},null,{"$f":"'[4]Final Recon - Summary'!G189","v":0},{"$f":"UnitsDetails44[[#This Row],[ODS DMC General Units]]+UnitsDetails44[[#This Row],[ODS General Units]]+UnitsDetails44[[#This Row],[ODS DMC AB109 Units]]+UnitsDetails44[[#This Row],[ODS AB109 Units]]+UnitsDetails44[[#This Row],[SUD Non-Billable Units]]+UnitsDetails44[[#This Row],[Room & Board Units]]","v":0},0]
[0,{"$f":"'[4]MH & SUD INVOICE (Sch I)'!B272","v":"Group - Interpreter Services"},{"$f":"'[4]MH & SUD INVOICE (Sch I)'!D272","v":"Per Billable Minute"},{"$f":"'[4]MH & SUD INVOICE (Sch I)'!E272","v":0.49},{"$f":"UnitsDetails44[[#This Row],[ODS DMC General Units]]+UnitsDetails44[[#This Row],[ODS General Units]]+UnitsDetails44[[#This Row],[ODS DMC AB109 Units]]+UnitsDetails44[[#This Row],[ODS AB109 Units]]+UnitsDetails44[[#This Row],[Room & Board Units]]+UnitsDetails44[[#This Row],[SUD Non-Billable Units]]","v":0},0,null,0,null,{"$f":"UnitsDetails44[[#This Row],[ODS General Units]]*UnitsDetails44[[#This Row],[Rate]]","v":0},null,{"$f":"UnitsDetails44[[#This Row],[Rate]]*UnitsDetails44[[#This Row],[ODS DMC AB109 Units]]","v":0},null,{"$f":"UnitsDetails44[[#This Row],[Rate]]*UnitsDetails44[[#This Row],[ODS AB109 Units]]","v":0},null,{"$f":"UnitsDetails44[[#This Row],[Rate]]*UnitsDetails44[[#This Row],[SUD Non-Billable Units]]","v":0},null,{"$f":"UnitsDetails44[[#This Row],[Rate]]*UnitsDetails44[[#This Row],[Room & Board Units]]","v":0},null,{"$f":"'[4]Final Recon - Summary'!G190","v":0},{"$f":"UnitsDetails44[[#This Row],[ODS DMC General Units]]+UnitsDetails44[[#This Row],[ODS General Units]]+UnitsDetails44[[#This Row],[ODS DMC AB109 Units]]+UnitsDetails44[[#This Row],[ODS AB109 Units]]+UnitsDetails44[[#This Row],[SUD Non-Billable Units]]+UnitsDetails44[[#This Row],[Room & Board Units]]","v":0},0]
[0,{"$f":"'[4]MH & SUD INVOICE (Sch I)'!B273","v":0},null,null,null,null,null,null,null,null,null,null,null,null,null,null,null,null,null,{"$f":"'[4]Final Recon - Summary'!G171","v":0},{"$f":"UnitsDetails44[[#This Row],[ODS DMC General Units]]+UnitsDetails44[[#This Row],[ODS General Units]]+UnitsDetails44[[#This Row],[ODS DMC AB109 Units]]+UnitsDetails44[[#This Row],[ODS AB109 Units]]+UnitsDetails44[[#This Row],[SUD Non-Billable Units]]+UnitsDetails44[[#This Row],[Room & Board Units]]","v":0},0]
[0,{"$f":"'[4]MH & SUD INVOICE (Sch I)'!B274","v":"Coordinated Specialty Care"},{"$f":"'[4]MH & SUD INVOICE (Sch I)'!D274","v":"Bundled Full Month"},{"$f":"'[4]MH & SUD INVOICE (Sch I)'!E274","v":2520.7600000000002},{"$f":"UnitsDetails44[[#This Row],[ODS DMC General Units]]+UnitsDetails44[[#This Row],[ODS General Units]]+UnitsDetails44[[#This Row],[ODS DMC AB109 Units]]+UnitsDetails44[[#This Row],[ODS AB109 Units]]+UnitsDetails44[[#This Row],[Room & Board Units]]+UnitsDetails44[[#This Row],[SUD Non-Billable Units]]","v":0},{"$f":"+D162*E162","v":0},null,{"$f":"+D162*G162","v":0},null,{"$f":"UnitsDetails44[[#This Row],[ODS General Units]]*UnitsDetails44[[#This Row],[Rate]]","v":0},null,{"$f":"UnitsDetails44[[#This Row],[Rate]]*UnitsDetails44[[#This Row],[ODS DMC AB109 Units]]","v":0},null,{"$f":"UnitsDetails44[[#This Row],[Rate]]*UnitsDetails44[[#This Row],[ODS AB109 Units]]","v":0},null,{"$f":"UnitsDetails44[[#This Row],[Rate]]*UnitsDetails44[[#This Row],[SUD Non-Billable Units]]","v":0},null,{"$f":"UnitsDetails44[[#This Row],[Rate]]*UnitsDetails44[[#This Row],[Room & Board Units]]","v":0},null,{"$f":"'[4]Final Recon - Summary'!G192","v":0},{"$f":"UnitsDetails44[[#This Row],[ODS DMC General Units]]+UnitsDetails44[[#This Row],[ODS General Units]]+UnitsDetails44[[#This Row],[ODS DMC AB109 Units]]+UnitsDetails44[[#This Row],[ODS AB109 Units]]+UnitsDetails44[[#This Row],[SUD Non-Billable Units]]+UnitsDetails44[[#This Row],[Room & Board Units]]","v":0},0]
[0,{"$f":"'[4]MH & SUD INVOICE (Sch I)'!B275","v":0},{"$f":"'[4]MH & SUD INVOICE (Sch I)'!D275","v":0},{"$f":"'[4]MH & SUD INVOICE (Sch I)'!E275","v":0},{"$f":"UnitsDetails44[[#This Row],[ODS DMC General Units]]+UnitsDetails44[[#This Row],[ODS General Units]]+UnitsDetails44[[#This Row],[ODS DMC AB109 Units]]+UnitsDetails44[[#This Row],[ODS AB109 Units]]+UnitsDetails44[[#This Row],[Room & Board Units]]+UnitsDetails44[[#This Row],[SUD Non-Billable Units]]","v":0},0,null,0,null,{"$f":"UnitsDetails44[[#This Row],[ODS General Units]]*UnitsDetails44[[#This Row],[Rate]]","v":0},null,{"$f":"UnitsDetails44[[#This Row],[Rate]]*UnitsDetails44[[#This Row],[ODS DMC AB109 Units]]","v":0},null,{"$f":"UnitsDetails44[[#This Row],[Rate]]*UnitsDetails44[[#This Row],[ODS AB109 Units]]","v":0},null,{"$f":"UnitsDetails44[[#This Row],[Rate]]*UnitsDetails44[[#This Row],[SUD Non-Billable Units]]","v":0},null,{"$f":"UnitsDetails44[[#This Row],[Rate]]*UnitsDetails44[[#This Row],[Room & Board Units]]","v":0},null,{"$f":"'[4]Final Recon - Summary'!G193","v":0},{"$f":"UnitsDetails44[[#This Row],[ODS DMC General Units]]+UnitsDetails44[[#This Row],[ODS General Units]]+UnitsDetails44[[#This Row],[ODS DMC AB109 Units]]+UnitsDetails44[[#This Row],[ODS AB109 Units]]+UnitsDetails44[[#This Row],[SUD Non-Billable Units]]+UnitsDetails44[[#This Row],[Room & Board Units]]","v":0},0]
[0,null,null,null,null,0,null,0,null,{"$f":"UnitsDetails44[[#This Row],[ODS General Units]]*UnitsDetails44[[#This Row],[Rate]]","v":0},null,{"$f":"UnitsDetails44[[#This Row],[Rate]]*UnitsDetails44[[#This Row],[ODS DMC AB109 Units]]","v":0},null,{"$f":"UnitsDetails44[[#This Row],[Rate]]*UnitsDetails44[[#This Row],[ODS AB109 Units]]","v":0},null,{"$f":"UnitsDetails44[[#This Row],[Rate]]*UnitsDetails44[[#This Row],[SUD Non-Billable Units]]","v":0},null,{"$f":"UnitsDetails44[[#This Row],[Rate]]*UnitsDetails44[[#This Row],[Room & Board Units]]","v":0},null,{"$f":"'[4]Final Recon - Summary'!G174","v":0},{"$f":"UnitsDetails44[[#This Row],[ODS DMC General Units]]+UnitsDetails44[[#This Row],[ODS General Units]]+UnitsDetails44[[#This Row],[ODS DMC AB109 Units]]+UnitsDetails44[[#This Row],[ODS AB109 Units]]+UnitsDetails44[[#This Row],[SUD Non-Billable Units]]+UnitsDetails44[[#This Row],[Room & Board Units]]","v":0},0]
[0,null,null,null,null,0,null,0,null,{"$f":"UnitsDetails44[[#This Row],[ODS General Units]]*UnitsDetails44[[#This Row],[Rate]]","v":0},null,{"$f":"UnitsDetails44[[#This Row],[Rate]]*UnitsDetails44[[#This Row],[ODS DMC AB109 Units]]","v":0},null,{"$f":"UnitsDetails44[[#This Row],[Rate]]*UnitsDetails44[[#This Row],[ODS AB109 Units]]","v":0},null,{"$f":"UnitsDetails44[[#This Row],[Rate]]*UnitsDetails44[[#This Row],[SUD Non-Billable Units]]","v":0},null,{"$f":"UnitsDetails44[[#This Row],[Rate]]*UnitsDetails44[[#This Row],[Room & Board Units]]","v":0},null,{"$f":"'[4]Final Recon - Summary'!G175","v":0},{"$f":"UnitsDetails44[[#This Row],[ODS DMC General Units]]+UnitsDetails44[[#This Row],[ODS General Units]]+UnitsDetails44[[#This Row],[ODS DMC AB109 Units]]+UnitsDetails44[[#This Row],[ODS AB109 Units]]+UnitsDetails44[[#This Row],[SUD Non-Billable Units]]+UnitsDetails44[[#This Row],[Room & Board Units]]","v":0},0]
[0,null,null,null,null,0,null,0,null,{"$f":"UnitsDetails44[[#This Row],[ODS General Units]]*UnitsDetails44[[#This Row],[Rate]]","v":0},null,{"$f":"UnitsDetails44[[#This Row],[Rate]]*UnitsDetails44[[#This Row],[ODS DMC AB109 Units]]","v":0},null,{"$f":"UnitsDetails44[[#This Row],[Rate]]*UnitsDetails44[[#This Row],[ODS AB109 Units]]","v":0},null,{"$f":"UnitsDetails44[[#This Row],[Rate]]*UnitsDetails44[[#This Row],[SUD Non-Billable Units]]","v":0},null,{"$f":"UnitsDetails44[[#This Row],[Rate]]*UnitsDetails44[[#This Row],[Room & Board Units]]","v":0},null,{"$f":"'[4]Final Recon - Summary'!G176","v":0},{"$f":"UnitsDetails44[[#This Row],[ODS DMC General Units]]+UnitsDetails44[[#This Row],[ODS General Units]]+UnitsDetails44[[#This Row],[ODS DMC AB109 Units]]+UnitsDetails44[[#This Row],[ODS AB109 Units]]+UnitsDetails44[[#This Row],[SUD Non-Billable Units]]+UnitsDetails44[[#This Row],[Room & Board Units]]","v":0},0]
[0,null,null,null,null,0,null,0,null,{"$f":"UnitsDetails44[[#This Row],[ODS General Units]]*UnitsDetails44[[#This Row],[Rate]]","v":0},null,{"$f":"UnitsDetails44[[#This Row],[Rate]]*UnitsDetails44[[#This Row],[ODS DMC AB109 Units]]","v":0},null,{"$f":"UnitsDetails44[[#This Row],[Rate]]*UnitsDetails44[[#This Row],[ODS AB109 Units]]","v":0},null,{"$f":"UnitsDetails44[[#This Row],[Rate]]*UnitsDetails44[[#This Row],[SUD Non-Billable Units]]","v":0},null,{"$f":"UnitsDetails44[[#This Row],[Rate]]*UnitsDetails44[[#This Row],[Room & Board Units]]","v":0},null,{"$f":"'[4]Final Recon - Summary'!G177","v":0},{"$f":"UnitsDetails44[[#This Row],[ODS DMC General Units]]+UnitsDetails44[[#This Row],[ODS General Units]]+UnitsDetails44[[#This Row],[ODS DMC AB109 Units]]+UnitsDetails44[[#This Row],[ODS AB109 Units]]+UnitsDetails44[[#This Row],[SUD Non-Billable Units]]+UnitsDetails44[[#This Row],[Room & Board Units]]","v":0},0]
[0,null,null,null,null,0,null,0,null,{"$f":"UnitsDetails44[[#This Row],[ODS General Units]]*UnitsDetails44[[#This Row],[Rate]]","v":0},null,{"$f":"UnitsDetails44[[#This Row],[Rate]]*UnitsDetails44[[#This Row],[ODS DMC AB109 Units]]","v":0},null,{"$f":"UnitsDetails44[[#This Row],[Rate]]*UnitsDetails44[[#This Row],[ODS AB109 Units]]","v":0},null,{"$f":"UnitsDetails44[[#This Row],[Rate]]*UnitsDetails44[[#This Row],[SUD Non-Billable Units]]","v":0},null,{"$f":"UnitsDetails44[[#This Row],[Rate]]*UnitsDetails44[[#This Row],[Room & Board Units]]","v":0},null,{"$f":"'[4]Final Recon - Summary'!G178","v":0},{"$f":"UnitsDetails44[[#This Row],[ODS DMC General Units]]+UnitsDetails44[[#This Row],[ODS General Units]]+UnitsDetails44[[#This Row],[ODS DMC AB109 Units]]+UnitsDetails44[[#This Row],[ODS AB109 Units]]+UnitsDetails44[[#This Row],[SUD Non-Billable Units]]+UnitsDetails44[[#This Row],[Room & Board Units]]","v":0},0]
[0,null,null,null,null,0,null,0,null,{"$f":"UnitsDetails44[[#This Row],[ODS General Units]]*UnitsDetails44[[#This Row],[Rate]]","v":0},null,{"$f":"UnitsDetails44[[#This Row],[Rate]]*UnitsDetails44[[#This Row],[ODS DMC AB109 Units]]","v":0},null,{"$f":"UnitsDetails44[[#This Row],[Rate]]*UnitsDetails44[[#This Row],[ODS AB109 Units]]","v":0},null,{"$f":"UnitsDetails44[[#This Row],[Rate]]*UnitsDetails44[[#This Row],[SUD Non-Billable Units]]","v":0},null,{"$f":"UnitsDetails44[[#This Row],[Rate]]*UnitsDetails44[[#This Row],[Room & Board Units]]","v":0},null,{"$f":"'[4]Final Recon - Summary'!G179","v":0},{"$f":"UnitsDetails44[[#This Row],[ODS DMC General Units]]+UnitsDetails44[[#This Row],[ODS General Units]]+UnitsDetails44[[#This Row],[ODS DMC AB109 Units]]+UnitsDetails44[[#This Row],[ODS AB109 Units]]+UnitsDetails44[[#This Row],[SUD Non-Billable Units]]+UnitsDetails44[[#This Row],[Room & Board Units]]","v":0},0]
[0,null,null,null,null,0,null,0,null,{"$f":"UnitsDetails44[[#This Row],[ODS General Units]]*UnitsDetails44[[#This Row],[Rate]]","v":0},null,{"$f":"UnitsDetails44[[#This Row],[Rate]]*UnitsDetails44[[#This Row],[ODS DMC AB109 Units]]","v":0},null,{"$f":"UnitsDetails44[[#This Row],[Rate]]*UnitsDetails44[[#This Row],[ODS AB109 Units]]","v":0},null,{"$f":"UnitsDetails44[[#This Row],[Rate]]*UnitsDetails44[[#This Row],[SUD Non-Billable Units]]","v":0},null,{"$f":"UnitsDetails44[[#This Row],[Rate]]*UnitsDetails44[[#This Row],[Room & Board Units]]","v":0},null,{"$f":"'[4]Final Recon - Summary'!G180","v":0},{"$f":"UnitsDetails44[[#This Row],[ODS DMC General Units]]+UnitsDetails44[[#This Row],[ODS General Units]]+UnitsDetails44[[#This Row],[ODS DMC AB109 Units]]+UnitsDetails44[[#This Row],[ODS AB109 Units]]+UnitsDetails44[[#This Row],[SUD Non-Billable Units]]+UnitsDetails44[[#This Row],[Room & Board Units]]","v":0},0]
[0,null,null,null,null,0,null,0,null,{"$f":"UnitsDetails44[[#This Row],[ODS General Units]]*UnitsDetails44[[#This Row],[Rate]]","v":0},null,{"$f":"UnitsDetails44[[#This Row],[Rate]]*UnitsDetails44[[#This Row],[ODS DMC AB109 Units]]","v":0},null,{"$f":"UnitsDetails44[[#This Row],[Rate]]*UnitsDetails44[[#This Row],[ODS AB109 Units]]","v":0},null,{"$f":"UnitsDetails44[[#This Row],[Rate]]*UnitsDetails44[[#This Row],[SUD Non-Billable Units]]","v":0},null,{"$f":"UnitsDetails44[[#This Row],[Rate]]*UnitsDetails44[[#This Row],[Room & Board Units]]","v":0},null,{"$f":"'[4]Final Recon - Summary'!G181","v":0},{"$f":"UnitsDetails44[[#This Row],[ODS DMC General Units]]+UnitsDetails44[[#This Row],[ODS General Units]]+UnitsDetails44[[#This Row],[ODS DMC AB109 Units]]+UnitsDetails44[[#This Row],[ODS AB109 Units]]+UnitsDetails44[[#This Row],[SUD Non-Billable Units]]+UnitsDetails44[[#This Row],[Room & Board Units]]","v":0},0]
[0,null,null,null,null,0,null,0,null,{"$f":"UnitsDetails44[[#This Row],[ODS General Units]]*UnitsDetails44[[#This Row],[Rate]]","v":0},null,{"$f":"UnitsDetails44[[#This Row],[Rate]]*UnitsDetails44[[#This Row],[ODS DMC AB109 Units]]","v":0},null,{"$f":"UnitsDetails44[[#This Row],[Rate]]*UnitsDetails44[[#This Row],[ODS AB109 Units]]","v":0},null,{"$f":"UnitsDetails44[[#This Row],[Rate]]*UnitsDetails44[[#This Row],[SUD Non-Billable Units]]","v":0},null,{"$f":"UnitsDetails44[[#This Row],[Rate]]*UnitsDetails44[[#This Row],[Room & Board Units]]","v":0},null,{"$f":"'[4]Final Recon - Summary'!G182","v":0},{"$f":"UnitsDetails44[[#This Row],[ODS DMC General Units]]+UnitsDetails44[[#This Row],[ODS General Units]]+UnitsDetails44[[#This Row],[ODS DMC AB109 Units]]+UnitsDetails44[[#This Row],[ODS AB109 Units]]+UnitsDetails44[[#This Row],[SUD Non-Billable Units]]+UnitsDetails44[[#This Row],[Room & Board Units]]","v":0},0]
[0,"Total",null,null,{"$f":"UnitsDetails44[[#This Row],[ODS DMC General Units]]+UnitsDetails44[[#This Row],[ODS General Units]]+UnitsDetails44[[#This Row],[ODS DMC AB109 Units]]+UnitsDetails44[[#This Row],[ODS AB109 Units]]+UnitsDetails44[[#This Row],[Room & Board Units]]+UnitsDetails44[[#This Row],[SUD Non-Billable Units]]","v":0},{"$f":"SUM(F122:F172)","v":0},null,{"$f":"SUM(H122:H172)","v":0},null,{"$f":"SUM(J122:J172)","v":0},null,{"$f":"SUM(L122:L172)","v":0},null,{"$f":"SUM(N122:N172)","v":0},null,{"$f":"SUM(P122:P172)","v":0},null,{"$f":"SUM(R122:R172)","v":0}]
[]
["BEHAVIORAL HEALTH SERVICES"]
["Fical Year-End Units Details"]
[]
[null,"Contractor:",{"$f":"C117","v":0}]
[null,"Contract #:",{"$f":"C118","v":0}]
[null,"Program Name:",{"$f":"'[4]Final Recon - Summary'!C219","v":"Program 4"}]
[]
["Column1","Service Modalities","Unit","Rate","Final TUOS Units Reconciliation","Final Amount Reconciliation","ODS DMC General Units","ODS DMC General Amount","ODS General Units","ODS General Amount","ODS DMC AB109 Units","ODS DMC AB109 Amount","ODS AB109 Units","ODS AB109 Amount","SUD Non-Billable Units","SUD Non-Billable Amount","Room & Board Units","Room & Board Amount",null,"Total Units (Summary)","Total Units (Details)","Checkpoint"]
[{"$f":"$C$5","v":0},{"$f":"'[4]Final Recon - Summary'!B223","v":"Individual - Alcohol and Drug Counselor"},{"$f":"'[4]Final Recon - Summary'!C223","v":"Per Billable Minute"},{"$f":"'[4]Final Recon - Summary'!D223","v":4.58},{"$f":"UnitsDetails45[[#This Row],[ODS DMC General Units]]+UnitsDetails45[[#This Row],[ODS General Units]]+UnitsDetails45[[#This Row],[ODS DMC AB109 Units]]+UnitsDetails45[[#This Row],[ODS AB109 Units]]+UnitsDetails45[[#This Row],[Room & Board Units]]+UnitsDetails45[[#This Row],[SUD Non-Billable Units]]","v":0},{"$f":"+D183*E183","v":0},null,{"$f":"+D183*G183","v":0},null,{"$f":"UnitsDetails45[[#This Row],[ODS General Units]]*UnitsDetails45[[#This Row],[Rate]]","v":0},null,{"$f":"UnitsDetails45[[#This Row],[Rate]]*UnitsDetails45[[#This Row],[ODS DMC AB109 Units]]","v":0},null,{"$f":"UnitsDetails45[[#This Row],[Rate]]*UnitsDetails45[[#This Row],[ODS AB109 Units]]","v":0},null,{"$f":"UnitsDetails45[[#This Row],[Rate]]*UnitsDetails45[[#This Row],[SUD Non-Billable Units]]","v":0},null,{"$f":"UnitsDetails45[[#This Row],[Rate]]*UnitsDetails45[[#This Row],[Room & Board Units]]","v":0},null,{"$f":"'[4]Final Recon - Summary'!G223","v":0},{"$f":"UnitsDetails45[[#This Row],[ODS DMC General Units]]+UnitsDetails45[[#This Row],[ODS General Units]]+UnitsDetails45[[#This Row],[ODS DMC AB109 Units]]+UnitsDetails45[[#This Row],[ODS AB109 Units]]+UnitsDetails45[[#This Row],[SUD Non-Billable Units]]+UnitsDetails45[[#This Row],[Room & Board Units]]","v":0},{"$f":"T183-U183","v":0}]
[0,{"$f":"'[4]Final Recon - Summary'!B224","v":"Individual - Clinical Nurse Specialist"},{"$f":"'[4]Final Recon - Summary'!C224","v":"Per Billable Minute"},{"$f":"'[4]Final Recon - Summary'!D224","v":10.54},{"$f":"UnitsDetails45[[#This Row],[ODS DMC General Units]]+UnitsDetails45[[#This Row],[ODS General Units]]+UnitsDetails45[[#This Row],[ODS DMC AB109 Units]]+UnitsDetails45[[#This Row],[ODS AB109 Units]]+UnitsDetails45[[#This Row],[Room & Board Units]]+UnitsDetails45[[#This Row],[SUD Non-Billable Units]]","v":0},0,null,0,null,{"$f":"UnitsDetails45[[#This Row],[ODS General Units]]*UnitsDetails45[[#This Row],[Rate]]","v":0},null,{"$f":"UnitsDetails45[[#This Row],[Rate]]*UnitsDetails45[[#This Row],[ODS DMC AB109 Units]]","v":0},null,{"$f":"UnitsDetails45[[#This Row],[Rate]]*UnitsDetails45[[#This Row],[ODS AB109 Units]]","v":0},null,{"$f":"UnitsDetails45[[#This Row],[Rate]]*UnitsDetails45[[#This Row],[SUD Non-Billable Units]]","v":0},null,{"$f":"UnitsDetails45[[#This Row],[Rate]]*UnitsDetails45[[#This Row],[Room & Board Units]]","v":0},null,{"$f":"'[4]Final Recon - Summary'!G224","v":0},{"$f":"UnitsDetails45[[#This Row],[ODS DMC General Units]]+UnitsDetails45[[#This Row],[ODS General Units]]+UnitsDetails45[[#This Row],[ODS DMC AB109 Units]]+UnitsDetails45[[#This Row],[ODS AB109 Units]]+UnitsDetails45[[#This Row],[SUD Non-Billable Units]]+UnitsDetails45[[#This Row],[Room & Board Units]]","v":0},0]
[0,{"$f":"'[4]Final Recon - Summary'!B225","v":"Individual - Community Health Worker"},{"$f":"'[4]Final Recon - Summary'!C225","v":"Per Billable Minute"},{"$f":"'[4]Final Recon - Summary'!D225","v":4.26},{"$f":"UnitsDetails45[[#This Row],[ODS DMC General Units]]+UnitsDetails45[[#This Row],[ODS General Units]]+UnitsDetails45[[#This Row],[ODS DMC AB109 Units]]+UnitsDetails45[[#This Row],[ODS AB109 Units]]+UnitsDetails45[[#This Row],[Room & Board Units]]+UnitsDetails45[[#This Row],[SUD Non-Billable Units]]","v":0},0,null,0,null,{"$f":"UnitsDetails45[[#This Row],[ODS General Units]]*UnitsDetails45[[#This Row],[Rate]]","v":0},null,{"$f":"UnitsDetails45[[#This Row],[Rate]]*UnitsDetails45[[#This Row],[ODS DMC AB109 Units]]","v":0},null,{"$f":"UnitsDetails45[[#This Row],[Rate]]*UnitsDetails45[[#This Row],[ODS AB109 Units]]","v":0},null,{"$f":"UnitsDetails45[[#This Row],[Rate]]*UnitsDetails45[[#This Row],[SUD Non-Billable Units]]","v":0},null,{"$f":"UnitsDetails45[[#This Row],[Rate]]*UnitsDetails45[[#This Row],[Room & Board Units]]","v":0},null,{"$f":"'[4]Final Recon - Summary'!G225","v":0},{"$f":"UnitsDetails45[[#This Row],[ODS DMC General Units]]+UnitsDetails45[[#This Row],[ODS General Units]]+UnitsDetails45[[#This Row],[ODS DMC AB109 Units]]+UnitsDetails45[[#This Row],[ODS AB109 Units]]+UnitsDetails45[[#This Row],[SUD Non-Billable Units]]+UnitsDetails45[[#This Row],[Room & Board Units]]","v":0},0]
[0,{"$f":"'[4]Final Recon - Summary'!B226","v":"Individual - Licensed Psychiatric Technician"},{"$f":"'[4]Final Recon - Summary'!C226","v":"Per Billable Minute"},{"$f":"'[4]Final Recon - Summary'!D226","v":3.88},{"$f":"UnitsDetails45[[#This Row],[ODS DMC General Units]]+UnitsDetails45[[#This Row],[ODS General Units]]+UnitsDetails45[[#This Row],[ODS DMC AB109 Units]]+UnitsDetails45[[#This Row],[ODS AB109 Units]]+UnitsDetails45[[#This Row],[Room & Board Units]]+UnitsDetails45[[#This Row],[SUD Non-Billable Units]]","v":0},0,null,0,null,{"$f":"UnitsDetails45[[#This Row],[ODS General Units]]*UnitsDetails45[[#This Row],[Rate]]","v":0},null,{"$f":"UnitsDetails45[[#This Row],[Rate]]*UnitsDetails45[[#This Row],[ODS DMC AB109 Units]]","v":0},null,{"$f":"UnitsDetails45[[#This Row],[Rate]]*UnitsDetails45[[#This Row],[ODS AB109 Units]]","v":0},null,{"$f":"UnitsDetails45[[#This Row],[Rate]]*UnitsDetails45[[#This Row],[SUD Non-Billable Units]]","v":0},null,{"$f":"UnitsDetails45[[#This Row],[Rate]]*UnitsDetails45[[#This Row],[Room & Board Units]]","v":0},null,{"$f":"'[4]Final Recon - Summary'!G226","v":0},{"$f":"UnitsDetails45[[#This Row],[ODS DMC General Units]]+UnitsDetails45[[#This Row],[ODS General Units]]+UnitsDetails45[[#This Row],[ODS DMC AB109 Units]]+UnitsDetails45[[#This Row],[ODS AB109 Units]]+UnitsDetails45[[#This Row],[SUD Non-Billable Units]]+UnitsDetails45[[#This Row],[Room & Board Units]]","v":0},0]
[0,{"$f":"'[4]Final Recon - Summary'!B227","v":"Individual - LPHA (MFT  LCSW  LPCC)/Intern or Waivered LPHA (MFT  LCSW  LPCC)"},{"$f":"'[4]Final Recon - Summary'!C227","v":"Per Billable Minute"},{"$f":"'[4]Final Recon - Summary'!D227","v":5.52},{"$f":"UnitsDetails45[[#This Row],[ODS DMC General Units]]+UnitsDetails45[[#This Row],[ODS General Units]]+UnitsDetails45[[#This Row],[ODS DMC AB109 Units]]+UnitsDetails45[[#This Row],[ODS AB109 Units]]+UnitsDetails45[[#This Row],[Room & Board Units]]+UnitsDetails45[[#This Row],[SUD Non-Billable Units]]","v":0},0,null,0,null,{"$f":"UnitsDetails45[[#This Row],[ODS General Units]]*UnitsDetails45[[#This Row],[Rate]]","v":0},null,{"$f":"UnitsDetails45[[#This Row],[Rate]]*UnitsDetails45[[#This Row],[ODS DMC AB109 Units]]","v":0},null,{"$f":"UnitsDetails45[[#This Row],[Rate]]*UnitsDetails45[[#This Row],[ODS AB109 Units]]","v":0},null,{"$f":"UnitsDetails45[[#This Row],[Rate]]*UnitsDetails45[[#This Row],[SUD Non-Billable Units]]","v":0},null,{"$f":"UnitsDetails45[[#This Row],[Rate]]*UnitsDetails45[[#This Row],[Room & Board Units]]","v":0},null,{"$f":"'[4]Final Recon - Summary'!G227","v":0},{"$f":"UnitsDetails45[[#This Row],[ODS DMC General Units]]+UnitsDetails45[[#This Row],[ODS General Units]]+UnitsDetails45[[#This Row],[ODS DMC AB109 Units]]+UnitsDetails45[[#This Row],[ODS AB109 Units]]+UnitsDetails45[[#This Row],[SUD Non-Billable Units]]+UnitsDetails45[[#This Row],[Room & Board Units]]","v":0},0]
[0,{"$f":"'[4]Final Recon - Summary'!B228","v":"Individual - Licensed Vocational Nurse (LVN)"},{"$f":"'[4]Final Recon - Summary'!C228","v":"Per Billable Minute"},{"$f":"'[4]Final Recon - Summary'!D228","v":4.5200000000000005},{"$f":"UnitsDetails45[[#This Row],[ODS DMC General Units]]+UnitsDetails45[[#This Row],[ODS General Units]]+UnitsDetails45[[#This Row],[ODS DMC AB109 Units]]+UnitsDetails45[[#This Row],[ODS AB109 Units]]+UnitsDetails45[[#This Row],[Room & Board Units]]+UnitsDetails45[[#This Row],[SUD Non-Billable Units]]","v":0},0,null,0,null,{"$f":"UnitsDetails45[[#This Row],[ODS General Units]]*UnitsDetails45[[#This Row],[Rate]]","v":0},null,{"$f":"UnitsDetails45[[#This Row],[Rate]]*UnitsDetails45[[#This Row],[ODS DMC AB109 Units]]","v":0},null,{"$f":"UnitsDetails45[[#This Row],[Rate]]*UnitsDetails45[[#This Row],[ODS AB109 Units]]","v":0},null,{"$f":"UnitsDetails45[[#This Row],[Rate]]*UnitsDetails45[[#This Row],[SUD Non-Billable Units]]","v":0},null,{"$f":"UnitsDetails45[[#This Row],[Rate]]*UnitsDetails45[[#This Row],[Room & Board Units]]","v":0},null,{"$f":"'[4]Final Recon - Summary'!G228","v":0},{"$f":"UnitsDetails45[[#This Row],[ODS DMC General Units]]+UnitsDetails45[[#This Row],[ODS General Units]]+UnitsDetails45[[#This Row],[ODS DMC AB109 Units]]+UnitsDetails45[[#This Row],[ODS AB109 Units]]+UnitsDetails45[[#This Row],[SUD Non-Billable Units]]+UnitsDetails45[[#This Row],[Room & Board Units]]","v":0},0]
[0,{"$f":"'[4]Final Recon - Summary'!B229","v":"Individual - Medical Assistant"},{"$f":"'[4]Final Recon - Summary'!C229","v":"Per Billable Minute"},{"$f":"'[4]Final Recon - Summary'!D229","v":3.1100000000000003},{"$f":"UnitsDetails45[[#This Row],[ODS DMC General Units]]+UnitsDetails45[[#This Row],[ODS General Units]]+UnitsDetails45[[#This Row],[ODS DMC AB109 Units]]+UnitsDetails45[[#This Row],[ODS AB109 Units]]+UnitsDetails45[[#This Row],[Room & Board Units]]+UnitsDetails45[[#This Row],[SUD Non-Billable Units]]","v":0},0,null,0,null,{"$f":"UnitsDetails45[[#This Row],[ODS General Units]]*UnitsDetails45[[#This Row],[Rate]]","v":0},null,{"$f":"UnitsDetails45[[#This Row],[Rate]]*UnitsDetails45[[#This Row],[ODS DMC AB109 Units]]","v":0},null,{"$f":"UnitsDetails45[[#This Row],[Rate]]*UnitsDetails45[[#This Row],[ODS AB109 Units]]","v":0},null,{"$f":"UnitsDetails45[[#This Row],[Rate]]*UnitsDetails45[[#This Row],[SUD Non-Billable Units]]","v":0},null,{"$f":"UnitsDetails45[[#This Row],[Rate]]*UnitsDetails45[[#This Row],[Room & Board Units]]","v":0},null,{"$f":"'[4]Final Recon - Summary'!G229","v":0},{"$f":"UnitsDetails45[[#This Row],[ODS DMC General Units]]+UnitsDetails45[[#This Row],[ODS General Units]]+UnitsDetails45[[#This Row],[ODS DMC AB109 Units]]+UnitsDetails45[[#This Row],[ODS AB109 Units]]+UnitsDetails45[[#This Row],[SUD Non-Billable Units]]+UnitsDetails45[[#This Row],[Room & Board Units]]","v":0},0]
[0,{"$f":"'[4]Final Recon - Summary'!B230","v":"Individual - Mental Health Rehabilitation Specialist"},{"$f":"'[4]Final Recon - Summary'!C230","v":"Per Billable Minute"},{"$f":"'[4]Final Recon - Summary'!D230","v":4.1500000000000004},{"$f":"UnitsDetails45[[#This Row],[ODS DMC General Units]]+UnitsDetails45[[#This Row],[ODS General Units]]+UnitsDetails45[[#This Row],[ODS DMC AB109 Units]]+UnitsDetails45[[#This Row],[ODS AB109 Units]]+UnitsDetails45[[#This Row],[Room & Board Units]]+UnitsDetails45[[#This Row],[SUD Non-Billable Units]]","v":0},0,null,0,null,{"$f":"UnitsDetails45[[#This Row],[ODS General Units]]*UnitsDetails45[[#This Row],[Rate]]","v":0},null,{"$f":"UnitsDetails45[[#This Row],[Rate]]*UnitsDetails45[[#This Row],[ODS DMC AB109 Units]]","v":0},null,{"$f":"UnitsDetails45[[#This Row],[Rate]]*UnitsDetails45[[#This Row],[ODS AB109 Units]]","v":0},null,{"$f":"UnitsDetails45[[#This Row],[Rate]]*UnitsDetails45[[#This Row],[SUD Non-Billable Units]]","v":0},null,{"$f":"UnitsDetails45[[#This Row],[Rate]]*UnitsDetails45[[#This Row],[Room & Board Units]]","v":0},null,{"$f":"'[4]Final Recon - Summary'!G230","v":0},{"$f":"UnitsDetails45[[#This Row],[ODS DMC General Units]]+UnitsDetails45[[#This Row],[ODS General Units]]+UnitsDetails45[[#This Row],[ODS DMC AB109 Units]]+UnitsDetails45[[#This Row],[ODS AB109 Units]]+UnitsDetails45[[#This Row],[SUD Non-Billable Units]]+UnitsDetails45[[#This Row],[Room & Board Units]]","v":0},0]
[0,{"$f":"'[4]Final Recon - Summary'!B231","v":"Individual - Nurse Practitioner"},{"$f":"'[4]Final Recon - Summary'!C231","v":"Per Billable Minute"},{"$f":"'[4]Final Recon - Summary'!D231","v":10.54},{"$f":"UnitsDetails45[[#This Row],[ODS DMC General Units]]+UnitsDetails45[[#This Row],[ODS General Units]]+UnitsDetails45[[#This Row],[ODS DMC AB109 Units]]+UnitsDetails45[[#This Row],[ODS AB109 Units]]+UnitsDetails45[[#This Row],[Room & Board Units]]+UnitsDetails45[[#This Row],[SUD Non-Billable Units]]","v":0},0,null,0,null,{"$f":"UnitsDetails45[[#This Row],[ODS General Units]]*UnitsDetails45[[#This Row],[Rate]]","v":0},null,{"$f":"UnitsDetails45[[#This Row],[Rate]]*UnitsDetails45[[#This Row],[ODS DMC AB109 Units]]","v":0},null,{"$f":"UnitsDetails45[[#This Row],[Rate]]*UnitsDetails45[[#This Row],[ODS AB109 Units]]","v":0},null,{"$f":"UnitsDetails45[[#This Row],[Rate]]*UnitsDetails45[[#This Row],[SUD Non-Billable Units]]","v":0},null,{"$f":"UnitsDetails45[[#This Row],[Rate]]*UnitsDetails45[[#This Row],[Room & Board Units]]","v":0},null,{"$f":"'[4]Final Recon - Summary'!G231","v":0},{"$f":"UnitsDetails45[[#This Row],[ODS DMC General Units]]+UnitsDetails45[[#This Row],[ODS General Units]]+UnitsDetails45[[#This Row],[ODS DMC AB109 Units]]+UnitsDetails45[[#This Row],[ODS AB109 Units]]+UnitsDetails45[[#This Row],[SUD Non-Billable Units]]+UnitsDetails45[[#This Row],[Room & Board Units]]","v":0},0]
[0,{"$f":"'[4]Final Recon - Summary'!B232","v":"Individual - Occupational Therapist"},{"$f":"'[4]Final Recon - Summary'!C232","v":"Per Billable Minute"},{"$f":"'[4]Final Recon - Summary'!D232","v":7.35},{"$f":"UnitsDetails45[[#This Row],[ODS DMC General Units]]+UnitsDetails45[[#This Row],[ODS General Units]]+UnitsDetails45[[#This Row],[ODS DMC AB109 Units]]+UnitsDetails45[[#This Row],[ODS AB109 Units]]+UnitsDetails45[[#This Row],[Room & Board Units]]+UnitsDetails45[[#This Row],[SUD Non-Billable Units]]","v":0},0,null,0,null,{"$f":"UnitsDetails45[[#This Row],[ODS General Units]]*UnitsDetails45[[#This Row],[Rate]]","v":0},null,{"$f":"UnitsDetails45[[#This Row],[Rate]]*UnitsDetails45[[#This Row],[ODS DMC AB109 Units]]","v":0},null,{"$f":"UnitsDetails45[[#This Row],[Rate]]*UnitsDetails45[[#This Row],[ODS AB109 Units]]","v":0},null,{"$f":"UnitsDetails45[[#This Row],[Rate]]*UnitsDetails45[[#This Row],[SUD Non-Billable Units]]","v":0},null,{"$f":"UnitsDetails45[[#This Row],[Rate]]*UnitsDetails45[[#This Row],[Room & Board Units]]","v":0},null,{"$f":"'[4]Final Recon - Summary'!G232","v":0},{"$f":"UnitsDetails45[[#This Row],[ODS DMC General Units]]+UnitsDetails45[[#This Row],[ODS General Units]]+UnitsDetails45[[#This Row],[ODS DMC AB109 Units]]+UnitsDetails45[[#This Row],[ODS AB109 Units]]+UnitsDetails45[[#This Row],[SUD Non-Billable Units]]+UnitsDetails45[[#This Row],[Room & Board Units]]","v":0},0]
[0,{"$f":"'[4]Final Recon - Summary'!B233","v":"Individual - Other Qualified Providers - Other Designated MH staff that bill medical"},{"$f":"'[4]Final Recon - Summary'!C233","v":"Per Billable Minute"},{"$f":"'[4]Final Recon - Summary'!D233","v":4.1500000000000004},{"$f":"UnitsDetails45[[#This Row],[ODS DMC General Units]]+UnitsDetails45[[#This Row],[ODS General Units]]+UnitsDetails45[[#This Row],[ODS DMC AB109 Units]]+UnitsDetails45[[#This Row],[ODS AB109 Units]]+UnitsDetails45[[#This Row],[Room & Board Units]]+UnitsDetails45[[#This Row],[SUD Non-Billable Units]]","v":0},0,null,0,null,{"$f":"UnitsDetails45[[#This Row],[ODS General Units]]*UnitsDetails45[[#This Row],[Rate]]","v":0},null,{"$f":"UnitsDetails45[[#This Row],[Rate]]*UnitsDetails45[[#This Row],[ODS DMC AB109 Units]]","v":0},null,{"$f":"UnitsDetails45[[#This Row],[Rate]]*UnitsDetails45[[#This Row],[ODS AB109 Units]]","v":0},null,{"$f":"UnitsDetails45[[#This Row],[Rate]]*UnitsDetails45[[#This Row],[SUD Non-Billable Units]]","v":0},null,{"$f":"UnitsDetails45[[#This Row],[Rate]]*UnitsDetails45[[#This Row],[Room & Board Units]]","v":0},null,{"$f":"'[4]Final Recon - Summary'!G233","v":0},{"$f":"UnitsDetails45[[#This Row],[ODS DMC General Units]]+UnitsDetails45[[#This Row],[ODS General Units]]+UnitsDetails45[[#This Row],[ODS DMC AB109 Units]]+UnitsDetails45[[#This Row],[ODS AB109 Units]]+UnitsDetails45[[#This Row],[SUD Non-Billable Units]]+UnitsDetails45[[#This Row],[Room & Board Units]]","v":0},0]
[0,{"$f":"'[4]Final Recon - Summary'!B234","v":"Individual - Peer Support Specialist"},{"$f":"'[4]Final Recon - Summary'!C234","v":"Per Billable Minute"},{"$f":"'[4]Final Recon - Summary'!D234","v":4.3600000000000003},{"$f":"UnitsDetails45[[#This Row],[ODS DMC General Units]]+UnitsDetails45[[#This Row],[ODS General Units]]+UnitsDetails45[[#This Row],[ODS DMC AB109 Units]]+UnitsDetails45[[#This Row],[ODS AB109 Units]]+UnitsDetails45[[#This Row],[Room & Board Units]]+UnitsDetails45[[#This Row],[SUD Non-Billable Units]]","v":0},0,null,0,null,{"$f":"UnitsDetails45[[#This Row],[ODS General Units]]*UnitsDetails45[[#This Row],[Rate]]","v":0},null,{"$f":"UnitsDetails45[[#This Row],[Rate]]*UnitsDetails45[[#This Row],[ODS DMC AB109 Units]]","v":0},null,{"$f":"UnitsDetails45[[#This Row],[Rate]]*UnitsDetails45[[#This Row],[ODS AB109 Units]]","v":0},null,{"$f":"UnitsDetails45[[#This Row],[Rate]]*UnitsDetails45[[#This Row],[SUD Non-Billable Units]]","v":0},null,{"$f":"UnitsDetails45[[#This Row],[Rate]]*UnitsDetails45[[#This Row],[Room & Board Units]]","v":0},null,{"$f":"'[4]Final Recon - Summary'!G234","v":0},{"$f":"UnitsDetails45[[#This Row],[ODS DMC General Units]]+UnitsDetails45[[#This Row],[ODS General Units]]+UnitsDetails45[[#This Row],[ODS DMC AB109 Units]]+UnitsDetails45[[#This Row],[ODS AB109 Units]]+UnitsDetails45[[#This Row],[SUD Non-Billable Units]]+UnitsDetails45[[#This Row],[Room & Board Units]]","v":0},0]
[0,{"$f":"'[4]Final Recon - Summary'!B235","v":"Individual - Physician Assistant"},{"$f":"'[4]Final Recon - Summary'!C235","v":"Per Billable Minute"},{"$f":"'[4]Final Recon - Summary'!D235","v":9.51},{"$f":"UnitsDetails45[[#This Row],[ODS DMC General Units]]+UnitsDetails45[[#This Row],[ODS General Units]]+UnitsDetails45[[#This Row],[ODS DMC AB109 Units]]+UnitsDetails45[[#This Row],[ODS AB109 Units]]+UnitsDetails45[[#This Row],[Room & Board Units]]+UnitsDetails45[[#This Row],[SUD Non-Billable Units]]","v":0},0,null,0,null,{"$f":"UnitsDetails45[[#This Row],[ODS General Units]]*UnitsDetails45[[#This Row],[Rate]]","v":0},null,{"$f":"UnitsDetails45[[#This Row],[Rate]]*UnitsDetails45[[#This Row],[ODS DMC AB109 Units]]","v":0},null,{"$f":"UnitsDetails45[[#This Row],[Rate]]*UnitsDetails45[[#This Row],[ODS AB109 Units]]","v":0},null,{"$f":"UnitsDetails45[[#This Row],[Rate]]*UnitsDetails45[[#This Row],[SUD Non-Billable Units]]","v":0},null,{"$f":"UnitsDetails45[[#This Row],[Rate]]*UnitsDetails45[[#This Row],[Room & Board Units]]","v":0},null,{"$f":"'[4]Final Recon - Summary'!G235","v":0},{"$f":"UnitsDetails45[[#This Row],[ODS DMC General Units]]+UnitsDetails45[[#This Row],[ODS General Units]]+UnitsDetails45[[#This Row],[ODS DMC AB109 Units]]+UnitsDetails45[[#This Row],[ODS AB109 Units]]+UnitsDetails45[[#This Row],[SUD Non-Billable Units]]+UnitsDetails45[[#This Row],[Room & Board Units]]","v":0},0]
[0,{"$f":"'[4]Final Recon - Summary'!B236","v":"Individual - Psychologist/Pre-licensed Psychologist"},{"$f":"'[4]Final Recon - Summary'!C236","v":"Per Billable Minute"},{"$f":"'[4]Final Recon - Summary'!D236","v":8.5299999999999994},{"$f":"UnitsDetails45[[#This Row],[ODS DMC General Units]]+UnitsDetails45[[#This Row],[ODS General Units]]+UnitsDetails45[[#This Row],[ODS DMC AB109 Units]]+UnitsDetails45[[#This Row],[ODS AB109 Units]]+UnitsDetails45[[#This Row],[Room & Board Units]]+UnitsDetails45[[#This Row],[SUD Non-Billable Units]]","v":0},0,null,0,null,{"$f":"UnitsDetails45[[#This Row],[ODS General Units]]*UnitsDetails45[[#This Row],[Rate]]","v":0},null,{"$f":"UnitsDetails45[[#This Row],[Rate]]*UnitsDetails45[[#This Row],[ODS DMC AB109 Units]]","v":0},null,{"$f":"UnitsDetails45[[#This Row],[Rate]]*UnitsDetails45[[#This Row],[ODS AB109 Units]]","v":0},null,{"$f":"UnitsDetails45[[#This Row],[Rate]]*UnitsDetails45[[#This Row],[SUD Non-Billable Units]]","v":0},null,{"$f":"UnitsDetails45[[#This Row],[Rate]]*UnitsDetails45[[#This Row],[Room & Board Units]]","v":0},null,{"$f":"'[4]Final Recon - Summary'!G236","v":0},{"$f":"UnitsDetails45[[#This Row],[ODS DMC General Units]]+UnitsDetails45[[#This Row],[ODS General Units]]+UnitsDetails45[[#This Row],[ODS DMC AB109 Units]]+UnitsDetails45[[#This Row],[ODS AB109 Units]]+UnitsDetails45[[#This Row],[SUD Non-Billable Units]]+UnitsDetails45[[#This Row],[Room & Board Units]]","v":0},0]
[0,{"$f":"'[4]Final Recon - Summary'!B237","v":"Individual - Psychiatrist/ Contracted Psychiatrist/Licensed Physician (MD)"},{"$f":"'[4]Final Recon - Summary'!C237","v":"Per Billable Minute"},{"$f":"'[4]Final Recon - Summary'!D237","v":11.57},{"$f":"UnitsDetails45[[#This Row],[ODS DMC General Units]]+UnitsDetails45[[#This Row],[ODS General Units]]+UnitsDetails45[[#This Row],[ODS DMC AB109 Units]]+UnitsDetails45[[#This Row],[ODS AB109 Units]]+UnitsDetails45[[#This Row],[Room & Board Units]]+UnitsDetails45[[#This Row],[SUD Non-Billable Units]]","v":0},0,null,0,null,{"$f":"UnitsDetails45[[#This Row],[ODS General Units]]*UnitsDetails45[[#This Row],[Rate]]","v":0},null,{"$f":"UnitsDetails45[[#This Row],[Rate]]*UnitsDetails45[[#This Row],[ODS DMC AB109 Units]]","v":0},null,{"$f":"UnitsDetails45[[#This Row],[Rate]]*UnitsDetails45[[#This Row],[ODS AB109 Units]]","v":0},null,{"$f":"UnitsDetails45[[#This Row],[Rate]]*UnitsDetails45[[#This Row],[SUD Non-Billable Units]]","v":0},null,{"$f":"UnitsDetails45[[#This Row],[Rate]]*UnitsDetails45[[#This Row],[Room & Board Units]]","v":0},null,{"$f":"'[4]Final Recon - Summary'!G237","v":0},{"$f":"UnitsDetails45[[#This Row],[ODS DMC General Units]]+UnitsDetails45[[#This Row],[ODS General Units]]+UnitsDetails45[[#This Row],[ODS DMC AB109 Units]]+UnitsDetails45[[#This Row],[ODS AB109 Units]]+UnitsDetails45[[#This Row],[SUD Non-Billable Units]]+UnitsDetails45[[#This Row],[Room & Board Units]]","v":0},0]
[0,{"$f":"'[4]Final Recon - Summary'!B238","v":"Individual - Registered Nurse (RN)"},{"$f":"'[4]Final Recon - Summary'!C238","v":"Per Billable Minute"},{"$f":"'[4]Final Recon - Summary'!D238","v":8.61},{"$f":"UnitsDetails45[[#This Row],[ODS DMC General Units]]+UnitsDetails45[[#This Row],[ODS General Units]]+UnitsDetails45[[#This Row],[ODS DMC AB109 Units]]+UnitsDetails45[[#This Row],[ODS AB109 Units]]+UnitsDetails45[[#This Row],[Room & Board Units]]+UnitsDetails45[[#This Row],[SUD Non-Billable Units]]","v":0},0,null,0,null,{"$f":"UnitsDetails45[[#This Row],[ODS General Units]]*UnitsDetails45[[#This Row],[Rate]]","v":0},null,{"$f":"UnitsDetails45[[#This Row],[Rate]]*UnitsDetails45[[#This Row],[ODS DMC AB109 Units]]","v":0},null,{"$f":"UnitsDetails45[[#This Row],[Rate]]*UnitsDetails45[[#This Row],[ODS AB109 Units]]","v":0},null,{"$f":"UnitsDetails45[[#This Row],[Rate]]*UnitsDetails45[[#This Row],[SUD Non-Billable Units]]","v":0},null,{"$f":"UnitsDetails45[[#This Row],[Rate]]*UnitsDetails45[[#This Row],[Room & Board Units]]","v":0},null,{"$f":"'[4]Final Recon - Summary'!G238","v":0},{"$f":"UnitsDetails45[[#This Row],[ODS DMC General Units]]+UnitsDetails45[[#This Row],[ODS General Units]]+UnitsDetails45[[#This Row],[ODS DMC AB109 Units]]+UnitsDetails45[[#This Row],[ODS AB109 Units]]+UnitsDetails45[[#This Row],[SUD Non-Billable Units]]+UnitsDetails45[[#This Row],[Room & Board Units]]","v":0},0]
[0,{"$f":"'[4]Final Recon - Summary'!B239","v":"Individual - Registered Pharmacist"},{"$f":"'[4]Final Recon - Summary'!C239","v":"Per Billable Minute"},{"$f":"'[4]Final Recon - Summary'!D239","v":10.15},{"$f":"UnitsDetails45[[#This Row],[ODS DMC General Units]]+UnitsDetails45[[#This Row],[ODS General Units]]+UnitsDetails45[[#This Row],[ODS DMC AB109 Units]]+UnitsDetails45[[#This Row],[ODS AB109 Units]]+UnitsDetails45[[#This Row],[Room & Board Units]]+UnitsDetails45[[#This Row],[SUD Non-Billable Units]]","v":0},0,null,0,null,{"$f":"UnitsDetails45[[#This Row],[ODS General Units]]*UnitsDetails45[[#This Row],[Rate]]","v":0},null,{"$f":"UnitsDetails45[[#This Row],[Rate]]*UnitsDetails45[[#This Row],[ODS DMC AB109 Units]]","v":0},null,{"$f":"UnitsDetails45[[#This Row],[Rate]]*UnitsDetails45[[#This Row],[ODS AB109 Units]]","v":0},null,{"$f":"UnitsDetails45[[#This Row],[Rate]]*UnitsDetails45[[#This Row],[SUD Non-Billable Units]]","v":0},null,{"$f":"UnitsDetails45[[#This Row],[Rate]]*UnitsDetails45[[#This Row],[Room & Board Units]]","v":0},null,{"$f":"'[4]Final Recon - Summary'!G239","v":0},{"$f":"UnitsDetails45[[#This Row],[ODS DMC General Units]]+UnitsDetails45[[#This Row],[ODS General Units]]+UnitsDetails45[[#This Row],[ODS DMC AB109 Units]]+UnitsDetails45[[#This Row],[ODS AB109 Units]]+UnitsDetails45[[#This Row],[SUD Non-Billable Units]]+UnitsDetails45[[#This Row],[Room & Board Units]]","v":0},0]
[0,{"$f":"'[4]Final Recon - Summary'!B240","v":"Individual - Interpreter Services"},{"$f":"'[4]Final Recon - Summary'!C240","v":"Per Billable Minute"},{"$f":"'[4]Final Recon - Summary'!D240","v":2.19},{"$f":"UnitsDetails45[[#This Row],[ODS DMC General Units]]+UnitsDetails45[[#This Row],[ODS General Units]]+UnitsDetails45[[#This Row],[ODS DMC AB109 Units]]+UnitsDetails45[[#This Row],[ODS AB109 Units]]+UnitsDetails45[[#This Row],[Room & Board Units]]+UnitsDetails45[[#This Row],[SUD Non-Billable Units]]","v":0},0,null,0,null,{"$f":"UnitsDetails45[[#This Row],[ODS General Units]]*UnitsDetails45[[#This Row],[Rate]]","v":0},null,{"$f":"UnitsDetails45[[#This Row],[Rate]]*UnitsDetails45[[#This Row],[ODS DMC AB109 Units]]","v":0},null,{"$f":"UnitsDetails45[[#This Row],[Rate]]*UnitsDetails45[[#This Row],[ODS AB109 Units]]","v":0},null,{"$f":"UnitsDetails45[[#This Row],[Rate]]*UnitsDetails45[[#This Row],[SUD Non-Billable Units]]","v":0},null,{"$f":"UnitsDetails45[[#This Row],[Rate]]*UnitsDetails45[[#This Row],[Room & Board Units]]","v":0},null,{"$f":"'[4]Final Recon - Summary'!G240","v":0},{"$f":"UnitsDetails45[[#This Row],[ODS DMC General Units]]+UnitsDetails45[[#This Row],[ODS General Units]]+UnitsDetails45[[#This Row],[ODS DMC AB109 Units]]+UnitsDetails45[[#This Row],[ODS AB109 Units]]+UnitsDetails45[[#This Row],[SUD Non-Billable Units]]+UnitsDetails45[[#This Row],[Room & Board Units]]","v":0},0]
[0,{"$f":"'[4]Final Recon - Summary'!B241","v":"Interactive Complexity"},{"$f":"'[4]Final Recon - Summary'!C241","v":"Per Occurrence"},{"$f":"'[4]Final Recon - Summary'!D241","v":14.61},{"$f":"UnitsDetails45[[#This Row],[ODS DMC General Units]]+UnitsDetails45[[#This Row],[ODS General Units]]+UnitsDetails45[[#This Row],[ODS DMC AB109 Units]]+UnitsDetails45[[#This Row],[ODS AB109 Units]]+UnitsDetails45[[#This Row],[Room & Board Units]]+UnitsDetails45[[#This Row],[SUD Non-Billable Units]]","v":0},0,null,0,null,{"$f":"UnitsDetails45[[#This Row],[ODS General Units]]*UnitsDetails45[[#This Row],[Rate]]","v":0},null,{"$f":"UnitsDetails45[[#This Row],[Rate]]*UnitsDetails45[[#This Row],[ODS DMC AB109 Units]]","v":0},null,{"$f":"UnitsDetails45[[#This Row],[Rate]]*UnitsDetails45[[#This Row],[ODS AB109 Units]]","v":0},null,{"$f":"UnitsDetails45[[#This Row],[Rate]]*UnitsDetails45[[#This Row],[SUD Non-Billable Units]]","v":0},null,{"$f":"UnitsDetails45[[#This Row],[Rate]]*UnitsDetails45[[#This Row],[Room & Board Units]]","v":0},null,{"$f":"'[4]Final Recon - Summary'!G241","v":0},{"$f":"UnitsDetails45[[#This Row],[ODS DMC General Units]]+UnitsDetails45[[#This Row],[ODS General Units]]+UnitsDetails45[[#This Row],[ODS DMC AB109 Units]]+UnitsDetails45[[#This Row],[ODS AB109 Units]]+UnitsDetails45[[#This Row],[SUD Non-Billable Units]]+UnitsDetails45[[#This Row],[Room & Board Units]]","v":0},0]
[0,{"$f":"'[4]Final Recon - Summary'!B242","v":"Parent-Child Interaction Therapy (PCIT Modifier 22)"},{"$f":"'[4]Final Recon - Summary'!C242","v":"Per Occurrence"},{"$f":"'[4]Final Recon - Summary'!D242","v":2.6399999999999997},{"$f":"UnitsDetails45[[#This Row],[ODS DMC General Units]]+UnitsDetails45[[#This Row],[ODS General Units]]+UnitsDetails45[[#This Row],[ODS DMC AB109 Units]]+UnitsDetails45[[#This Row],[ODS AB109 Units]]+UnitsDetails45[[#This Row],[Room & Board Units]]+UnitsDetails45[[#This Row],[SUD Non-Billable Units]]","v":0},0,null,0,null,{"$f":"UnitsDetails45[[#This Row],[ODS General Units]]*UnitsDetails45[[#This Row],[Rate]]","v":0},null,{"$f":"UnitsDetails45[[#This Row],[Rate]]*UnitsDetails45[[#This Row],[ODS DMC AB109 Units]]","v":0},null,{"$f":"UnitsDetails45[[#This Row],[Rate]]*UnitsDetails45[[#This Row],[ODS AB109 Units]]","v":0},null,{"$f":"UnitsDetails45[[#This Row],[Rate]]*UnitsDetails45[[#This Row],[SUD Non-Billable Units]]","v":0},null,{"$f":"UnitsDetails45[[#This Row],[Rate]]*UnitsDetails45[[#This Row],[Room & Board Units]]","v":0},null,{"$f":"'[4]Final Recon - Summary'!G242","v":0},{"$f":"UnitsDetails45[[#This Row],[ODS DMC General Units]]+UnitsDetails45[[#This Row],[ODS General Units]]+UnitsDetails45[[#This Row],[ODS DMC AB109 Units]]+UnitsDetails45[[#This Row],[ODS AB109 Units]]+UnitsDetails45[[#This Row],[SUD Non-Billable Units]]+UnitsDetails45[[#This Row],[Room & Board Units]]","v":0},0]
[0,{"$f":"'[4]Final Recon - Summary'!B243","v":"Group - Alcohol and Drug Counselor"},{"$f":"'[4]Final Recon - Summary'!C243","v":"Per Billable Minute"},{"$f":"'[4]Final Recon - Summary'!D243","v":1.01},{"$f":"UnitsDetails45[[#This Row],[ODS DMC General Units]]+UnitsDetails45[[#This Row],[ODS General Units]]+UnitsDetails45[[#This Row],[ODS DMC AB109 Units]]+UnitsDetails45[[#This Row],[ODS AB109 Units]]+UnitsDetails45[[#This Row],[Room & Board Units]]+UnitsDetails45[[#This Row],[SUD Non-Billable Units]]","v":0},0,null,0,null,{"$f":"UnitsDetails45[[#This Row],[ODS General Units]]*UnitsDetails45[[#This Row],[Rate]]","v":0},null,{"$f":"UnitsDetails45[[#This Row],[Rate]]*UnitsDetails45[[#This Row],[ODS DMC AB109 Units]]","v":0},null,{"$f":"UnitsDetails45[[#This Row],[Rate]]*UnitsDetails45[[#This Row],[ODS AB109 Units]]","v":0},null,{"$f":"UnitsDetails45[[#This Row],[Rate]]*UnitsDetails45[[#This Row],[SUD Non-Billable Units]]","v":0},null,{"$f":"UnitsDetails45[[#This Row],[Rate]]*UnitsDetails45[[#This Row],[Room & Board Units]]","v":0},null,{"$f":"'[4]Final Recon - Summary'!G243","v":0},{"$f":"UnitsDetails45[[#This Row],[ODS DMC General Units]]+UnitsDetails45[[#This Row],[ODS General Units]]+UnitsDetails45[[#This Row],[ODS DMC AB109 Units]]+UnitsDetails45[[#This Row],[ODS AB109 Units]]+UnitsDetails45[[#This Row],[SUD Non-Billable Units]]+UnitsDetails45[[#This Row],[Room & Board Units]]","v":0},0]
[0,{"$f":"'[4]Final Recon - Summary'!B244","v":"Group - Clinical Nurse Specialist"},{"$f":"'[4]Final Recon - Summary'!C244","v":"Per Billable Minute"},{"$f":"'[4]Final Recon - Summary'!D244","v":2.34},{"$f":"UnitsDetails45[[#This Row],[ODS DMC General Units]]+UnitsDetails45[[#This Row],[ODS General Units]]+UnitsDetails45[[#This Row],[ODS DMC AB109 Units]]+UnitsDetails45[[#This Row],[ODS AB109 Units]]+UnitsDetails45[[#This Row],[Room & Board Units]]+UnitsDetails45[[#This Row],[SUD Non-Billable Units]]","v":0},0,null,0,null,{"$f":"UnitsDetails45[[#This Row],[ODS General Units]]*UnitsDetails45[[#This Row],[Rate]]","v":0},null,{"$f":"UnitsDetails45[[#This Row],[Rate]]*UnitsDetails45[[#This Row],[ODS DMC AB109 Units]]","v":0},null,{"$f":"UnitsDetails45[[#This Row],[Rate]]*UnitsDetails45[[#This Row],[ODS AB109 Units]]","v":0},null,{"$f":"UnitsDetails45[[#This Row],[Rate]]*UnitsDetails45[[#This Row],[SUD Non-Billable Units]]","v":0},null,{"$f":"UnitsDetails45[[#This Row],[Rate]]*UnitsDetails45[[#This Row],[Room & Board Units]]","v":0},null,{"$f":"'[4]Final Recon - Summary'!G244","v":0},{"$f":"UnitsDetails45[[#This Row],[ODS DMC General Units]]+UnitsDetails45[[#This Row],[ODS General Units]]+UnitsDetails45[[#This Row],[ODS DMC AB109 Units]]+UnitsDetails45[[#This Row],[ODS AB109 Units]]+UnitsDetails45[[#This Row],[SUD Non-Billable Units]]+UnitsDetails45[[#This Row],[Room & Board Units]]","v":0},0]
[0,{"$f":"'[4]Final Recon - Summary'!B245","v":"Group - Community Health Worker (CPT 98961)"},{"$f":"'[4]Final Recon - Summary'!C245","v":"Per Billable Minute"},{"$f":"'[4]Final Recon - Summary'!D245","v":1.42},{"$f":"UnitsDetails45[[#This Row],[ODS DMC General Units]]+UnitsDetails45[[#This Row],[ODS General Units]]+UnitsDetails45[[#This Row],[ODS DMC AB109 Units]]+UnitsDetails45[[#This Row],[ODS AB109 Units]]+UnitsDetails45[[#This Row],[Room & Board Units]]+UnitsDetails45[[#This Row],[SUD Non-Billable Units]]","v":0},0,null,0,null,{"$f":"UnitsDetails45[[#This Row],[ODS General Units]]*UnitsDetails45[[#This Row],[Rate]]","v":0},null,{"$f":"UnitsDetails45[[#This Row],[Rate]]*UnitsDetails45[[#This Row],[ODS DMC AB109 Units]]","v":0},null,{"$f":"UnitsDetails45[[#This Row],[Rate]]*UnitsDetails45[[#This Row],[ODS AB109 Units]]","v":0},null,{"$f":"UnitsDetails45[[#This Row],[Rate]]*UnitsDetails45[[#This Row],[SUD Non-Billable Units]]","v":0},null,{"$f":"UnitsDetails45[[#This Row],[Rate]]*UnitsDetails45[[#This Row],[Room & Board Units]]","v":0},null,{"$f":"'[4]Final Recon - Summary'!G245","v":0},{"$f":"UnitsDetails45[[#This Row],[ODS DMC General Units]]+UnitsDetails45[[#This Row],[ODS General Units]]+UnitsDetails45[[#This Row],[ODS DMC AB109 Units]]+UnitsDetails45[[#This Row],[ODS AB109 Units]]+UnitsDetails45[[#This Row],[SUD Non-Billable Units]]+UnitsDetails45[[#This Row],[Room & Board Units]]","v":0},0]
[0,{"$f":"'[4]Final Recon - Summary'!B246","v":"Group - Community Health Worker (CPT 98962)"},{"$f":"'[4]Final Recon - Summary'!C246","v":"Per Billable Minute"},{"$f":"'[4]Final Recon - Summary'!D246","v":0.64999999999999991},{"$f":"UnitsDetails45[[#This Row],[ODS DMC General Units]]+UnitsDetails45[[#This Row],[ODS General Units]]+UnitsDetails45[[#This Row],[ODS DMC AB109 Units]]+UnitsDetails45[[#This Row],[ODS AB109 Units]]+UnitsDetails45[[#This Row],[Room & Board Units]]+UnitsDetails45[[#This Row],[SUD Non-Billable Units]]","v":0},0,null,0,null,{"$f":"UnitsDetails45[[#This Row],[ODS General Units]]*UnitsDetails45[[#This Row],[Rate]]","v":0},null,{"$f":"UnitsDetails45[[#This Row],[Rate]]*UnitsDetails45[[#This Row],[ODS DMC AB109 Units]]","v":0},null,{"$f":"UnitsDetails45[[#This Row],[Rate]]*UnitsDetails45[[#This Row],[ODS AB109 Units]]","v":0},null,{"$f":"UnitsDetails45[[#This Row],[Rate]]*UnitsDetails45[[#This Row],[SUD Non-Billable Units]]","v":0},null,{"$f":"UnitsDetails45[[#This Row],[Rate]]*UnitsDetails45[[#This Row],[Room & Board Units]]","v":0},null,{"$f":"'[4]Final Recon - Summary'!G246","v":0},{"$f":"UnitsDetails45[[#This Row],[ODS DMC General Units]]+UnitsDetails45[[#This Row],[ODS General Units]]+UnitsDetails45[[#This Row],[ODS DMC AB109 Units]]+UnitsDetails45[[#This Row],[ODS AB109 Units]]+UnitsDetails45[[#This Row],[SUD Non-Billable Units]]+UnitsDetails45[[#This Row],[Room & Board Units]]","v":0},0]
[0,{"$f":"'[4]Final Recon - Summary'!B247","v":"Group - Licensed Psychiatric Technician"},{"$f":"'[4]Final Recon - Summary'!C247","v":"Per Billable Minute"},{"$f":"'[4]Final Recon - Summary'!D247","v":0.86},{"$f":"UnitsDetails45[[#This Row],[ODS DMC General Units]]+UnitsDetails45[[#This Row],[ODS General Units]]+UnitsDetails45[[#This Row],[ODS DMC AB109 Units]]+UnitsDetails45[[#This Row],[ODS AB109 Units]]+UnitsDetails45[[#This Row],[Room & Board Units]]+UnitsDetails45[[#This Row],[SUD Non-Billable Units]]","v":0},0,null,0,null,{"$f":"UnitsDetails45[[#This Row],[ODS General Units]]*UnitsDetails45[[#This Row],[Rate]]","v":0},null,{"$f":"UnitsDetails45[[#This Row],[Rate]]*UnitsDetails45[[#This Row],[ODS DMC AB109 Units]]","v":0},null,{"$f":"UnitsDetails45[[#This Row],[Rate]]*UnitsDetails45[[#This Row],[ODS AB109 Units]]","v":0},null,{"$f":"UnitsDetails45[[#This Row],[Rate]]*UnitsDetails45[[#This Row],[SUD Non-Billable Units]]","v":0},null,{"$f":"UnitsDetails45[[#This Row],[Rate]]*UnitsDetails45[[#This Row],[Room & Board Units]]","v":0},null,{"$f":"'[4]Final Recon - Summary'!G247","v":0},{"$f":"UnitsDetails45[[#This Row],[ODS DMC General Units]]+UnitsDetails45[[#This Row],[ODS General Units]]+UnitsDetails45[[#This Row],[ODS DMC AB109 Units]]+UnitsDetails45[[#This Row],[ODS AB109 Units]]+UnitsDetails45[[#This Row],[SUD Non-Billable Units]]+UnitsDetails45[[#This Row],[Room & Board Units]]","v":0},0]
[0,{"$f":"'[4]Final Recon - Summary'!B248","v":"Group - LPHA (MFT  LCSW  LPCC)/Intern or Waivered LPHA (MFT  LCSW  LPCC)"},{"$f":"'[4]Final Recon - Summary'!C248","v":"Per Billable Minute"},{"$f":"'[4]Final Recon - Summary'!D248","v":1.2300000000000002},{"$f":"UnitsDetails45[[#This Row],[ODS DMC General Units]]+UnitsDetails45[[#This Row],[ODS General Units]]+UnitsDetails45[[#This Row],[ODS DMC AB109 Units]]+UnitsDetails45[[#This Row],[ODS AB109 Units]]+UnitsDetails45[[#This Row],[Room & Board Units]]+UnitsDetails45[[#This Row],[SUD Non-Billable Units]]","v":0},0,null,0,null,{"$f":"UnitsDetails45[[#This Row],[ODS General Units]]*UnitsDetails45[[#This Row],[Rate]]","v":0},null,{"$f":"UnitsDetails45[[#This Row],[Rate]]*UnitsDetails45[[#This Row],[ODS DMC AB109 Units]]","v":0},null,{"$f":"UnitsDetails45[[#This Row],[Rate]]*UnitsDetails45[[#This Row],[ODS AB109 Units]]","v":0},null,{"$f":"UnitsDetails45[[#This Row],[Rate]]*UnitsDetails45[[#This Row],[SUD Non-Billable Units]]","v":0},null,{"$f":"UnitsDetails45[[#This Row],[Rate]]*UnitsDetails45[[#This Row],[Room & Board Units]]","v":0},null,{"$f":"'[4]Final Recon - Summary'!G248","v":0},{"$f":"UnitsDetails45[[#This Row],[ODS DMC General Units]]+UnitsDetails45[[#This Row],[ODS General Units]]+UnitsDetails45[[#This Row],[ODS DMC AB109 Units]]+UnitsDetails45[[#This Row],[ODS AB109 Units]]+UnitsDetails45[[#This Row],[SUD Non-Billable Units]]+UnitsDetails45[[#This Row],[Room & Board Units]]","v":0},0]
[0,{"$f":"'[4]Final Recon - Summary'!B249","v":"Group - Licensed Vocational Nurse (LVN)"},{"$f":"'[4]Final Recon - Summary'!C249","v":"Per Billable Minute"},{"$f":"'[4]Final Recon - Summary'!D249","v":1.01},{"$f":"UnitsDetails45[[#This Row],[ODS DMC General Units]]+UnitsDetails45[[#This Row],[ODS General Units]]+UnitsDetails45[[#This Row],[ODS DMC AB109 Units]]+UnitsDetails45[[#This Row],[ODS AB109 Units]]+UnitsDetails45[[#This Row],[Room & Board Units]]+UnitsDetails45[[#This Row],[SUD Non-Billable Units]]","v":0},0,null,0,null,{"$f":"UnitsDetails45[[#This Row],[ODS General Units]]*UnitsDetails45[[#This Row],[Rate]]","v":0},null,{"$f":"UnitsDetails45[[#This Row],[Rate]]*UnitsDetails45[[#This Row],[ODS DMC AB109 Units]]","v":0},null,{"$f":"UnitsDetails45[[#This Row],[Rate]]*UnitsDetails45[[#This Row],[ODS AB109 Units]]","v":0},null,{"$f":"UnitsDetails45[[#This Row],[Rate]]*UnitsDetails45[[#This Row],[SUD Non-Billable Units]]","v":0},null,{"$f":"UnitsDetails45[[#This Row],[Rate]]*UnitsDetails45[[#This Row],[Room & Board Units]]","v":0},null,{"$f":"'[4]Final Recon - Summary'!G249","v":0},{"$f":"UnitsDetails45[[#This Row],[ODS DMC General Units]]+UnitsDetails45[[#This Row],[ODS General Units]]+UnitsDetails45[[#This Row],[ODS DMC AB109 Units]]+UnitsDetails45[[#This Row],[ODS AB109 Units]]+UnitsDetails45[[#This Row],[SUD Non-Billable Units]]+UnitsDetails45[[#This Row],[Room & Board Units]]","v":0},0]
[0,{"$f":"'[4]Final Recon - Summary'!B250","v":"Group - Medical Assistant"},{"$f":"'[4]Final Recon - Summary'!C250","v":"Per Billable Minute"},{"$f":"'[4]Final Recon - Summary'!D250","v":0.69},{"$f":"UnitsDetails45[[#This Row],[ODS DMC General Units]]+UnitsDetails45[[#This Row],[ODS General Units]]+UnitsDetails45[[#This Row],[ODS DMC AB109 Units]]+UnitsDetails45[[#This Row],[ODS AB109 Units]]+UnitsDetails45[[#This Row],[Room & Board Units]]+UnitsDetails45[[#This Row],[SUD Non-Billable Units]]","v":0},0,null,0,null,{"$f":"UnitsDetails45[[#This Row],[ODS General Units]]*UnitsDetails45[[#This Row],[Rate]]","v":0},null,{"$f":"UnitsDetails45[[#This Row],[Rate]]*UnitsDetails45[[#This Row],[ODS DMC AB109 Units]]","v":0},null,{"$f":"UnitsDetails45[[#This Row],[Rate]]*UnitsDetails45[[#This Row],[ODS AB109 Units]]","v":0},null,{"$f":"UnitsDetails45[[#This Row],[Rate]]*UnitsDetails45[[#This Row],[SUD Non-Billable Units]]","v":0},null,{"$f":"UnitsDetails45[[#This Row],[Rate]]*UnitsDetails45[[#This Row],[Room & Board Units]]","v":0},null,{"$f":"'[4]Final Recon - Summary'!G250","v":0},{"$f":"UnitsDetails45[[#This Row],[ODS DMC General Units]]+UnitsDetails45[[#This Row],[ODS General Units]]+UnitsDetails45[[#This Row],[ODS DMC AB109 Units]]+UnitsDetails45[[#This Row],[ODS AB109 Units]]+UnitsDetails45[[#This Row],[SUD Non-Billable Units]]+UnitsDetails45[[#This Row],[Room & Board Units]]","v":0},0]
[0,{"$f":"'[4]Final Recon - Summary'!B251","v":"Group - Mental Health Rehabilitation Specialist"},{"$f":"'[4]Final Recon - Summary'!C251","v":"Per Billable Minute"},{"$f":"'[4]Final Recon - Summary'!D251","v":0.91999999999999993},{"$f":"UnitsDetails45[[#This Row],[ODS DMC General Units]]+UnitsDetails45[[#This Row],[ODS General Units]]+UnitsDetails45[[#This Row],[ODS DMC AB109 Units]]+UnitsDetails45[[#This Row],[ODS AB109 Units]]+UnitsDetails45[[#This Row],[Room & Board Units]]+UnitsDetails45[[#This Row],[SUD Non-Billable Units]]","v":0},0,null,0,null,{"$f":"UnitsDetails45[[#This Row],[ODS General Units]]*UnitsDetails45[[#This Row],[Rate]]","v":0},null,{"$f":"UnitsDetails45[[#This Row],[Rate]]*UnitsDetails45[[#This Row],[ODS DMC AB109 Units]]","v":0},null,{"$f":"UnitsDetails45[[#This Row],[Rate]]*UnitsDetails45[[#This Row],[ODS AB109 Units]]","v":0},null,{"$f":"UnitsDetails45[[#This Row],[Rate]]*UnitsDetails45[[#This Row],[SUD Non-Billable Units]]","v":0},null,{"$f":"UnitsDetails45[[#This Row],[Rate]]*UnitsDetails45[[#This Row],[Room & Board Units]]","v":0},null,{"$f":"'[4]Final Recon - Summary'!G251","v":0},{"$f":"UnitsDetails45[[#This Row],[ODS DMC General Units]]+UnitsDetails45[[#This Row],[ODS General Units]]+UnitsDetails45[[#This Row],[ODS DMC AB109 Units]]+UnitsDetails45[[#This Row],[ODS AB109 Units]]+UnitsDetails45[[#This Row],[SUD Non-Billable Units]]+UnitsDetails45[[#This Row],[Room & Board Units]]","v":0},0]
[0,{"$f":"'[4]Final Recon - Summary'!B252","v":"Group - Nurse Practitioner"},{"$f":"'[4]Final Recon - Summary'!C252","v":"Per Billable Minute"},{"$f":"'[4]Final Recon - Summary'!D252","v":2.34},{"$f":"UnitsDetails45[[#This Row],[ODS DMC General Units]]+UnitsDetails45[[#This Row],[ODS General Units]]+UnitsDetails45[[#This Row],[ODS DMC AB109 Units]]+UnitsDetails45[[#This Row],[ODS AB109 Units]]+UnitsDetails45[[#This Row],[Room & Board Units]]+UnitsDetails45[[#This Row],[SUD Non-Billable Units]]","v":0},0,null,0,null,{"$f":"UnitsDetails45[[#This Row],[ODS General Units]]*UnitsDetails45[[#This Row],[Rate]]","v":0},null,{"$f":"UnitsDetails45[[#This Row],[Rate]]*UnitsDetails45[[#This Row],[ODS DMC AB109 Units]]","v":0},null,{"$f":"UnitsDetails45[[#This Row],[Rate]]*UnitsDetails45[[#This Row],[ODS AB109 Units]]","v":0},null,{"$f":"UnitsDetails45[[#This Row],[Rate]]*UnitsDetails45[[#This Row],[SUD Non-Billable Units]]","v":0},null,{"$f":"UnitsDetails45[[#This Row],[Rate]]*UnitsDetails45[[#This Row],[Room & Board Units]]","v":0},null,{"$f":"'[4]Final Recon - Summary'!G252","v":0},{"$f":"UnitsDetails45[[#This Row],[ODS DMC General Units]]+UnitsDetails45[[#This Row],[ODS General Units]]+UnitsDetails45[[#This Row],[ODS DMC AB109 Units]]+UnitsDetails45[[#This Row],[ODS AB109 Units]]+UnitsDetails45[[#This Row],[SUD Non-Billable Units]]+UnitsDetails45[[#This Row],[Room & Board Units]]","v":0},0]
[0,{"$f":"'[4]Final Recon - Summary'!B253","v":"Group - Occupational Therapist"},{"$f":"'[4]Final Recon - Summary'!C253","v":"Per Billable Minute"},{"$f":"'[4]Final Recon - Summary'!D253","v":1.63},{"$f":"UnitsDetails45[[#This Row],[ODS DMC General Units]]+UnitsDetails45[[#This Row],[ODS General Units]]+UnitsDetails45[[#This Row],[ODS DMC AB109 Units]]+UnitsDetails45[[#This Row],[ODS AB109 Units]]+UnitsDetails45[[#This Row],[Room & Board Units]]+UnitsDetails45[[#This Row],[SUD Non-Billable Units]]","v":0},0,null,0,null,{"$f":"UnitsDetails45[[#This Row],[ODS General Units]]*UnitsDetails45[[#This Row],[Rate]]","v":0},null,{"$f":"UnitsDetails45[[#This Row],[Rate]]*UnitsDetails45[[#This Row],[ODS DMC AB109 Units]]","v":0},null,{"$f":"UnitsDetails45[[#This Row],[Rate]]*UnitsDetails45[[#This Row],[ODS AB109 Units]]","v":0},null,{"$f":"UnitsDetails45[[#This Row],[Rate]]*UnitsDetails45[[#This Row],[SUD Non-Billable Units]]","v":0},null,{"$f":"UnitsDetails45[[#This Row],[Rate]]*UnitsDetails45[[#This Row],[Room & Board Units]]","v":0},null,{"$f":"'[4]Final Recon - Summary'!G253","v":0},{"$f":"UnitsDetails45[[#This Row],[ODS DMC General Units]]+UnitsDetails45[[#This Row],[ODS General Units]]+UnitsDetails45[[#This Row],[ODS DMC AB109 Units]]+UnitsDetails45[[#This Row],[ODS AB109 Units]]+UnitsDetails45[[#This Row],[SUD Non-Billable Units]]+UnitsDetails45[[#This Row],[Room & Board Units]]","v":0},0]
[0,{"$f":"'[4]Final Recon - Summary'!B254","v":"Group - Other Qualified Providers - Other Designated MH staff that bill medical"},{"$f":"'[4]Final Recon - Summary'!C254","v":"Per Billable Minute"},{"$f":"'[4]Final Recon - Summary'!D254","v":0.91999999999999993},{"$f":"UnitsDetails45[[#This Row],[ODS DMC General Units]]+UnitsDetails45[[#This Row],[ODS General Units]]+UnitsDetails45[[#This Row],[ODS DMC AB109 Units]]+UnitsDetails45[[#This Row],[ODS AB109 Units]]+UnitsDetails45[[#This Row],[Room & Board Units]]+UnitsDetails45[[#This Row],[SUD Non-Billable Units]]","v":0},0,null,0,null,{"$f":"UnitsDetails45[[#This Row],[ODS General Units]]*UnitsDetails45[[#This Row],[Rate]]","v":0},null,{"$f":"UnitsDetails45[[#This Row],[Rate]]*UnitsDetails45[[#This Row],[ODS DMC AB109 Units]]","v":0},null,{"$f":"UnitsDetails45[[#This Row],[Rate]]*UnitsDetails45[[#This Row],[ODS AB109 Units]]","v":0},null,{"$f":"UnitsDetails45[[#This Row],[Rate]]*UnitsDetails45[[#This Row],[SUD Non-Billable Units]]","v":0},null,{"$f":"UnitsDetails45[[#This Row],[Rate]]*UnitsDetails45[[#This Row],[Room & Board Units]]","v":0},null,{"$f":"'[4]Final Recon - Summary'!G254","v":0},{"$f":"UnitsDetails45[[#This Row],[ODS DMC General Units]]+UnitsDetails45[[#This Row],[ODS General Units]]+UnitsDetails45[[#This Row],[ODS DMC AB109 Units]]+UnitsDetails45[[#This Row],[ODS AB109 Units]]+UnitsDetails45[[#This Row],[SUD Non-Billable Units]]+UnitsDetails45[[#This Row],[Room & Board Units]]","v":0},0]
[{"$f":"$C$5","v":0},{"$f":"'[4]Final Recon - Summary'!B255","v":"Group - Peer Support Specialist"},{"$f":"'[4]Final Recon - Summary'!C255","v":"Per Billable Minute"},{"$f":"'[4]Final Recon - Summary'!D255","v":0.97},{"$f":"UnitsDetails45[[#This Row],[ODS DMC General Units]]+UnitsDetails45[[#This Row],[ODS General Units]]+UnitsDetails45[[#This Row],[ODS DMC AB109 Units]]+UnitsDetails45[[#This Row],[ODS AB109 Units]]+UnitsDetails45[[#This Row],[Room & Board Units]]+UnitsDetails45[[#This Row],[SUD Non-Billable Units]]","v":0},0,null,0,null,{"$f":"UnitsDetails45[[#This Row],[ODS General Units]]*UnitsDetails45[[#This Row],[Rate]]","v":0},null,{"$f":"UnitsDetails45[[#This Row],[Rate]]*UnitsDetails45[[#This Row],[ODS DMC AB109 Units]]","v":0},null,{"$f":"UnitsDetails45[[#This Row],[Rate]]*UnitsDetails45[[#This Row],[ODS AB109 Units]]","v":0},null,{"$f":"UnitsDetails45[[#This Row],[Rate]]*UnitsDetails45[[#This Row],[SUD Non-Billable Units]]","v":0},null,{"$f":"UnitsDetails45[[#This Row],[Rate]]*UnitsDetails45[[#This Row],[Room & Board Units]]","v":0},null,{"$f":"'[4]Final Recon - Summary'!G255","v":0},{"$f":"UnitsDetails45[[#This Row],[ODS DMC General Units]]+UnitsDetails45[[#This Row],[ODS General Units]]+UnitsDetails45[[#This Row],[ODS DMC AB109 Units]]+UnitsDetails45[[#This Row],[ODS AB109 Units]]+UnitsDetails45[[#This Row],[SUD Non-Billable Units]]+UnitsDetails45[[#This Row],[Room & Board Units]]","v":0},0]
[0,{"$f":"'[4]Final Recon - Summary'!B256","v":"Group - Physician Assistant"},{"$f":"'[4]Final Recon - Summary'!C256","v":"Per Billable Minute"},{"$f":"'[4]Final Recon - Summary'!D256","v":2.11},{"$f":"UnitsDetails45[[#This Row],[ODS DMC General Units]]+UnitsDetails45[[#This Row],[ODS General Units]]+UnitsDetails45[[#This Row],[ODS DMC AB109 Units]]+UnitsDetails45[[#This Row],[ODS AB109 Units]]+UnitsDetails45[[#This Row],[Room & Board Units]]+UnitsDetails45[[#This Row],[SUD Non-Billable Units]]","v":0},0,null,0,null,{"$f":"UnitsDetails45[[#This Row],[ODS General Units]]*UnitsDetails45[[#This Row],[Rate]]","v":0},null,{"$f":"UnitsDetails45[[#This Row],[Rate]]*UnitsDetails45[[#This Row],[ODS DMC AB109 Units]]","v":0},null,{"$f":"UnitsDetails45[[#This Row],[Rate]]*UnitsDetails45[[#This Row],[ODS AB109 Units]]","v":0},null,{"$f":"UnitsDetails45[[#This Row],[Rate]]*UnitsDetails45[[#This Row],[SUD Non-Billable Units]]","v":0},null,{"$f":"UnitsDetails45[[#This Row],[Rate]]*UnitsDetails45[[#This Row],[Room & Board Units]]","v":0},null,{"$f":"'[4]Final Recon - Summary'!G256","v":0},{"$f":"UnitsDetails45[[#This Row],[ODS DMC General Units]]+UnitsDetails45[[#This Row],[ODS General Units]]+UnitsDetails45[[#This Row],[ODS DMC AB109 Units]]+UnitsDetails45[[#This Row],[ODS AB109 Units]]+UnitsDetails45[[#This Row],[SUD Non-Billable Units]]+UnitsDetails45[[#This Row],[Room & Board Units]]","v":0},0]
[0,{"$f":"'[4]Final Recon - Summary'!B257","v":"Group - Psychologist/Pre-licensed Psychologist"},{"$f":"'[4]Final Recon - Summary'!C257","v":"Per Billable Minute"},{"$f":"'[4]Final Recon - Summary'!D257","v":1.9},{"$f":"UnitsDetails45[[#This Row],[ODS DMC General Units]]+UnitsDetails45[[#This Row],[ODS General Units]]+UnitsDetails45[[#This Row],[ODS DMC AB109 Units]]+UnitsDetails45[[#This Row],[ODS AB109 Units]]+UnitsDetails45[[#This Row],[Room & Board Units]]+UnitsDetails45[[#This Row],[SUD Non-Billable Units]]","v":0},0,null,0,null,{"$f":"UnitsDetails45[[#This Row],[ODS General Units]]*UnitsDetails45[[#This Row],[Rate]]","v":0},null,{"$f":"UnitsDetails45[[#This Row],[Rate]]*UnitsDetails45[[#This Row],[ODS DMC AB109 Units]]","v":0},null,{"$f":"UnitsDetails45[[#This Row],[Rate]]*UnitsDetails45[[#This Row],[ODS AB109 Units]]","v":0},null,{"$f":"UnitsDetails45[[#This Row],[Rate]]*UnitsDetails45[[#This Row],[SUD Non-Billable Units]]","v":0},null,{"$f":"UnitsDetails45[[#This Row],[Rate]]*UnitsDetails45[[#This Row],[Room & Board Units]]","v":0},null,{"$f":"'[4]Final Recon - Summary'!G257","v":0},{"$f":"UnitsDetails45[[#This Row],[ODS DMC General Units]]+UnitsDetails45[[#This Row],[ODS General Units]]+UnitsDetails45[[#This Row],[ODS DMC AB109 Units]]+UnitsDetails45[[#This Row],[ODS AB109 Units]]+UnitsDetails45[[#This Row],[SUD Non-Billable Units]]+UnitsDetails45[[#This Row],[Room & Board Units]]","v":0},0]
[0,{"$f":"'[4]Final Recon - Summary'!B258","v":"Group - Psychiatrist/ Contracted Psychiatrist/Licensed Physician (MD)"},{"$f":"'[4]Final Recon - Summary'!C258","v":"Per Billable Minute"},{"$f":"'[4]Final Recon - Summary'!D258","v":2.57},{"$f":"UnitsDetails45[[#This Row],[ODS DMC General Units]]+UnitsDetails45[[#This Row],[ODS General Units]]+UnitsDetails45[[#This Row],[ODS DMC AB109 Units]]+UnitsDetails45[[#This Row],[ODS AB109 Units]]+UnitsDetails45[[#This Row],[Room & Board Units]]+UnitsDetails45[[#This Row],[SUD Non-Billable Units]]","v":0},0,null,0,null,{"$f":"UnitsDetails45[[#This Row],[ODS General Units]]*UnitsDetails45[[#This Row],[Rate]]","v":0},null,{"$f":"UnitsDetails45[[#This Row],[Rate]]*UnitsDetails45[[#This Row],[ODS DMC AB109 Units]]","v":0},null,{"$f":"UnitsDetails45[[#This Row],[Rate]]*UnitsDetails45[[#This Row],[ODS AB109 Units]]","v":0},null,{"$f":"UnitsDetails45[[#This Row],[Rate]]*UnitsDetails45[[#This Row],[SUD Non-Billable Units]]","v":0},null,{"$f":"UnitsDetails45[[#This Row],[Rate]]*UnitsDetails45[[#This Row],[Room & Board Units]]","v":0},null,{"$f":"'[4]Final Recon - Summary'!G258","v":0},{"$f":"UnitsDetails45[[#This Row],[ODS DMC General Units]]+UnitsDetails45[[#This Row],[ODS General Units]]+UnitsDetails45[[#This Row],[ODS DMC AB109 Units]]+UnitsDetails45[[#This Row],[ODS AB109 Units]]+UnitsDetails45[[#This Row],[SUD Non-Billable Units]]+UnitsDetails45[[#This Row],[Room & Board Units]]","v":0},0]
[0,{"$f":"'[4]Final Recon - Summary'!B259","v":"Group - Registered Nurse (RN)"},{"$f":"'[4]Final Recon - Summary'!C259","v":"Per Billable Minute"},{"$f":"'[4]Final Recon - Summary'!D259","v":1.91},{"$f":"UnitsDetails45[[#This Row],[ODS DMC General Units]]+UnitsDetails45[[#This Row],[ODS General Units]]+UnitsDetails45[[#This Row],[ODS DMC AB109 Units]]+UnitsDetails45[[#This Row],[ODS AB109 Units]]+UnitsDetails45[[#This Row],[Room & Board Units]]+UnitsDetails45[[#This Row],[SUD Non-Billable Units]]","v":0},0,null,0,null,{"$f":"UnitsDetails45[[#This Row],[ODS General Units]]*UnitsDetails45[[#This Row],[Rate]]","v":0},null,{"$f":"UnitsDetails45[[#This Row],[Rate]]*UnitsDetails45[[#This Row],[ODS DMC AB109 Units]]","v":0},null,{"$f":"UnitsDetails45[[#This Row],[Rate]]*UnitsDetails45[[#This Row],[ODS AB109 Units]]","v":0},null,{"$f":"UnitsDetails45[[#This Row],[Rate]]*UnitsDetails45[[#This Row],[SUD Non-Billable Units]]","v":0},null,{"$f":"UnitsDetails45[[#This Row],[Rate]]*UnitsDetails45[[#This Row],[Room & Board Units]]","v":0},null,{"$f":"'[4]Final Recon - Summary'!G259","v":0},{"$f":"UnitsDetails45[[#This Row],[ODS DMC General Units]]+UnitsDetails45[[#This Row],[ODS General Units]]+UnitsDetails45[[#This Row],[ODS DMC AB109 Units]]+UnitsDetails45[[#This Row],[ODS AB109 Units]]+UnitsDetails45[[#This Row],[SUD Non-Billable Units]]+UnitsDetails45[[#This Row],[Room & Board Units]]","v":0},0]
[0,{"$f":"'[4]Final Recon - Summary'!B260","v":"Group - Registered Pharmacist"},{"$f":"'[4]Final Recon - Summary'!C260","v":"Per Billable Minute"},{"$f":"'[4]Final Recon - Summary'!D260","v":2.25},{"$f":"UnitsDetails45[[#This Row],[ODS DMC General Units]]+UnitsDetails45[[#This Row],[ODS General Units]]+UnitsDetails45[[#This Row],[ODS DMC AB109 Units]]+UnitsDetails45[[#This Row],[ODS AB109 Units]]+UnitsDetails45[[#This Row],[Room & Board Units]]+UnitsDetails45[[#This Row],[SUD Non-Billable Units]]","v":0},0,null,0,null,{"$f":"UnitsDetails45[[#This Row],[ODS General Units]]*UnitsDetails45[[#This Row],[Rate]]","v":0},null,{"$f":"UnitsDetails45[[#This Row],[Rate]]*UnitsDetails45[[#This Row],[ODS DMC AB109 Units]]","v":0},null,{"$f":"UnitsDetails45[[#This Row],[Rate]]*UnitsDetails45[[#This Row],[ODS AB109 Units]]","v":0},null,{"$f":"UnitsDetails45[[#This Row],[Rate]]*UnitsDetails45[[#This Row],[SUD Non-Billable Units]]","v":0},null,{"$f":"UnitsDetails45[[#This Row],[Rate]]*UnitsDetails45[[#This Row],[Room & Board Units]]","v":0},null,{"$f":"'[4]Final Recon - Summary'!G260","v":0},{"$f":"UnitsDetails45[[#This Row],[ODS DMC General Units]]+UnitsDetails45[[#This Row],[ODS General Units]]+UnitsDetails45[[#This Row],[ODS DMC AB109 Units]]+UnitsDetails45[[#This Row],[ODS AB109 Units]]+UnitsDetails45[[#This Row],[SUD Non-Billable Units]]+UnitsDetails45[[#This Row],[Room & Board Units]]","v":0},0]
[0,{"$f":"'[4]Final Recon - Summary'!B261","v":"Group - Interpreter Services"},{"$f":"'[4]Final Recon - Summary'!C261","v":"Per Billable Minute"},{"$f":"'[4]Final Recon - Summary'!D261","v":0.49},{"$f":"UnitsDetails45[[#This Row],[ODS DMC General Units]]+UnitsDetails45[[#This Row],[ODS General Units]]+UnitsDetails45[[#This Row],[ODS DMC AB109 Units]]+UnitsDetails45[[#This Row],[ODS AB109 Units]]+UnitsDetails45[[#This Row],[Room & Board Units]]+UnitsDetails45[[#This Row],[SUD Non-Billable Units]]","v":0},0,null,0,null,{"$f":"UnitsDetails45[[#This Row],[ODS General Units]]*UnitsDetails45[[#This Row],[Rate]]","v":0},null,{"$f":"UnitsDetails45[[#This Row],[Rate]]*UnitsDetails45[[#This Row],[ODS DMC AB109 Units]]","v":0},null,{"$f":"UnitsDetails45[[#This Row],[Rate]]*UnitsDetails45[[#This Row],[ODS AB109 Units]]","v":0},null,{"$f":"UnitsDetails45[[#This Row],[Rate]]*UnitsDetails45[[#This Row],[SUD Non-Billable Units]]","v":0},null,{"$f":"UnitsDetails45[[#This Row],[Rate]]*UnitsDetails45[[#This Row],[Room & Board Units]]","v":0},null,{"$f":"'[4]Final Recon - Summary'!G261","v":0},{"$f":"UnitsDetails45[[#This Row],[ODS DMC General Units]]+UnitsDetails45[[#This Row],[ODS General Units]]+UnitsDetails45[[#This Row],[ODS DMC AB109 Units]]+UnitsDetails45[[#This Row],[ODS AB109 Units]]+UnitsDetails45[[#This Row],[SUD Non-Billable Units]]+UnitsDetails45[[#This Row],[Room & Board Units]]","v":0},0]
[0,{"$f":"'[4]Final Recon - Summary'!B262","v":"Bundled Rates"}]
[0,{"$f":"'[4]Final Recon - Summary'!B263","v":"Supported Employment"},{"$f":"'[4]Final Recon - Summary'!C263","v":"Bundled Full Month"},{"$f":"'[4]Final Recon - Summary'!D263","v":1209.1699999999998},{"$f":"UnitsDetails45[[#This Row],[ODS DMC General Units]]+UnitsDetails45[[#This Row],[ODS General Units]]+UnitsDetails45[[#This Row],[ODS DMC AB109 Units]]+UnitsDetails45[[#This Row],[ODS AB109 Units]]+UnitsDetails45[[#This Row],[Room & Board Units]]+UnitsDetails45[[#This Row],[SUD Non-Billable Units]]","v":0},{"$f":"+D223*E223","v":0},null,{"$f":"+D223*G223","v":0},null,{"$f":"UnitsDetails45[[#This Row],[ODS General Units]]*UnitsDetails45[[#This Row],[Rate]]","v":0},null,{"$f":"UnitsDetails45[[#This Row],[Rate]]*UnitsDetails45[[#This Row],[ODS DMC AB109 Units]]","v":0},null,{"$f":"UnitsDetails45[[#This Row],[Rate]]*UnitsDetails45[[#This Row],[ODS AB109 Units]]","v":0},null,{"$f":"UnitsDetails45[[#This Row],[Rate]]*UnitsDetails45[[#This Row],[SUD Non-Billable Units]]","v":0},null,{"$f":"UnitsDetails45[[#This Row],[Rate]]*UnitsDetails45[[#This Row],[Room & Board Units]]","v":0},null,{"$f":"'[4]Final Recon - Summary'!G263","v":0},{"$f":"UnitsDetails45[[#This Row],[ODS DMC General Units]]+UnitsDetails45[[#This Row],[ODS General Units]]+UnitsDetails45[[#This Row],[ODS DMC AB109 Units]]+UnitsDetails45[[#This Row],[ODS AB109 Units]]+UnitsDetails45[[#This Row],[SUD Non-Billable Units]]+UnitsDetails45[[#This Row],[Room & Board Units]]","v":0},{"$f":"T223-U223","v":0}]
[0,{"$f":"'[4]Final Recon - Summary'!B264","v":"Supported Employment"},{"$f":"'[4]Final Recon - Summary'!C264","v":"Bundled Partial Month"},{"$f":"'[4]Final Recon - Summary'!D264","v":604.58999999999992},{"$f":"UnitsDetails45[[#This Row],[ODS DMC General Units]]+UnitsDetails45[[#This Row],[ODS General Units]]+UnitsDetails45[[#This Row],[ODS DMC AB109 Units]]+UnitsDetails45[[#This Row],[ODS AB109 Units]]+UnitsDetails45[[#This Row],[Room & Board Units]]+UnitsDetails45[[#This Row],[SUD Non-Billable Units]]","v":0},{"$f":"+D224*E224","v":0},null,{"$f":"+D224*G224","v":0},null,{"$f":"UnitsDetails45[[#This Row],[ODS General Units]]*UnitsDetails45[[#This Row],[Rate]]","v":0},null,{"$f":"UnitsDetails45[[#This Row],[Rate]]*UnitsDetails45[[#This Row],[ODS DMC AB109 Units]]","v":0},null,{"$f":"UnitsDetails45[[#This Row],[Rate]]*UnitsDetails45[[#This Row],[ODS AB109 Units]]","v":0},null,{"$f":"UnitsDetails45[[#This Row],[Rate]]*UnitsDetails45[[#This Row],[SUD Non-Billable Units]]","v":0},null,{"$f":"UnitsDetails45[[#This Row],[Rate]]*UnitsDetails45[[#This Row],[Room & Board Units]]","v":0},null,{"$f":"'[4]Final Recon - Summary'!G264","v":0},{"$f":"UnitsDetails45[[#This Row],[ODS DMC General Units]]+UnitsDetails45[[#This Row],[ODS General Units]]+UnitsDetails45[[#This Row],[ODS DMC AB109 Units]]+UnitsDetails45[[#This Row],[ODS AB109 Units]]+UnitsDetails45[[#This Row],[SUD Non-Billable Units]]+UnitsDetails45[[#This Row],[Room & Board Units]]","v":0},0]
[0,null,null,null,null,null,null,null,null,null,null,null,null,null,null,null,null,null,null,{"$f":"'[4]Final Recon - Summary'!G235","v":0},{"$f":"UnitsDetails45[[#This Row],[ODS DMC General Units]]+UnitsDetails45[[#This Row],[ODS General Units]]+UnitsDetails45[[#This Row],[ODS DMC AB109 Units]]+UnitsDetails45[[#This Row],[ODS AB109 Units]]+UnitsDetails45[[#This Row],[SUD Non-Billable Units]]+UnitsDetails45[[#This Row],[Room & Board Units]]","v":0},0]
[0,null,null,null,null,null,null,null,null,null,null,null,null,null,null,null,null,null,null,{"$f":"'[4]Final Recon - Summary'!G236","v":0},{"$f":"UnitsDetails45[[#This Row],[ODS DMC General Units]]+UnitsDetails45[[#This Row],[ODS General Units]]+UnitsDetails45[[#This Row],[ODS DMC AB109 Units]]+UnitsDetails45[[#This Row],[ODS AB109 Units]]+UnitsDetails45[[#This Row],[SUD Non-Billable Units]]+UnitsDetails45[[#This Row],[Room & Board Units]]","v":0},0]
[0,null,null,null,null,null,null,null,null,null,null,null,null,null,null,null,null,null,null,{"$f":"'[4]Final Recon - Summary'!G237","v":0},{"$f":"UnitsDetails45[[#This Row],[ODS DMC General Units]]+UnitsDetails45[[#This Row],[ODS General Units]]+UnitsDetails45[[#This Row],[ODS DMC AB109 Units]]+UnitsDetails45[[#This Row],[ODS AB109 Units]]+UnitsDetails45[[#This Row],[SUD Non-Billable Units]]+UnitsDetails45[[#This Row],[Room & Board Units]]","v":0},0]
[0,null,null,null,null,null,null,null,null,null,null,null,null,null,null,null,null,null,null,{"$f":"'[4]Final Recon - Summary'!G238","v":0},{"$f":"UnitsDetails45[[#This Row],[ODS DMC General Units]]+UnitsDetails45[[#This Row],[ODS General Units]]+UnitsDetails45[[#This Row],[ODS DMC AB109 Units]]+UnitsDetails45[[#This Row],[ODS AB109 Units]]+UnitsDetails45[[#This Row],[SUD Non-Billable Units]]+UnitsDetails45[[#This Row],[Room & Board Units]]","v":0},0]
[0,null,null,null,null,null,null,null,null,null,null,null,null,null,null,null,null,null,null,{"$f":"'[4]Final Recon - Summary'!G239","v":0},{"$f":"UnitsDetails45[[#This Row],[ODS DMC General Units]]+UnitsDetails45[[#This Row],[ODS General Units]]+UnitsDetails45[[#This Row],[ODS DMC AB109 Units]]+UnitsDetails45[[#This Row],[ODS AB109 Units]]+UnitsDetails45[[#This Row],[SUD Non-Billable Units]]+UnitsDetails45[[#This Row],[Room & Board Units]]","v":0},0]
[0,null,null,null,null,null,null,null,null,null,null,null,null,null,null,null,null,null,null,{"$f":"'[4]Final Recon - Summary'!G240","v":0},{"$f":"UnitsDetails45[[#This Row],[ODS DMC General Units]]+UnitsDetails45[[#This Row],[ODS General Units]]+UnitsDetails45[[#This Row],[ODS DMC AB109 Units]]+UnitsDetails45[[#This Row],[ODS AB109 Units]]+UnitsDetails45[[#This Row],[SUD Non-Billable Units]]+UnitsDetails45[[#This Row],[Room & Board Units]]","v":0},0]
[0,null,null,null,null,null,null,null,null,null,null,null,null,null,null,null,null,null,null,{"$f":"'[4]Final Recon - Summary'!G241","v":0},{"$f":"UnitsDetails45[[#This Row],[ODS DMC General Units]]+UnitsDetails45[[#This Row],[ODS General Units]]+UnitsDetails45[[#This Row],[ODS DMC AB109 Units]]+UnitsDetails45[[#This Row],[ODS AB109 Units]]+UnitsDetails45[[#This Row],[SUD Non-Billable Units]]+UnitsDetails45[[#This Row],[Room & Board Units]]","v":0},0]
[0,null,null,null,null,null,null,null,null,null,null,null,null,null,null,null,null,null,null,{"$f":"'[4]Final Recon - Summary'!G242","v":0},{"$f":"UnitsDetails45[[#This Row],[ODS DMC General Units]]+UnitsDetails45[[#This Row],[ODS General Units]]+UnitsDetails45[[#This Row],[ODS DMC AB109 Units]]+UnitsDetails45[[#This Row],[ODS AB109 Units]]+UnitsDetails45[[#This Row],[SUD Non-Billable Units]]+UnitsDetails45[[#This Row],[Room & Board Units]]","v":0},0]
[0,null,null,null,null,null,null,null,null,null,null,null,null,null,null,null,null,null,null,{"$f":"'[4]Final Recon - Summary'!G243","v":0},{"$f":"UnitsDetails45[[#This Row],[ODS DMC General Units]]+UnitsDetails45[[#This Row],[ODS General Units]]+UnitsDetails45[[#This Row],[ODS DMC AB109 Units]]+UnitsDetails45[[#This Row],[ODS AB109 Units]]+UnitsDetails45[[#This Row],[SUD Non-Billable Units]]+UnitsDetails45[[#This Row],[Room & Board Units]]","v":0},0]
[0,{"$f":"'[4]Final Recon - Summary'!B274","v":"Total"},null,null,{"$f":"UnitsDetails45[[#This Row],[ODS DMC General Units]]+UnitsDetails45[[#This Row],[ODS General Units]]+UnitsDetails45[[#This Row],[ODS DMC AB109 Units]]+UnitsDetails45[[#This Row],[ODS AB109 Units]]+UnitsDetails45[[#This Row],[Room & Board Units]]+UnitsDetails45[[#This Row],[SUD Non-Billable Units]]","v":0},{"$f":"SUM(F183:F233)","v":0},null,{"$f":"SUM(H183:H233)","v":0},null,{"$f":"SUM(J183:J233)","v":0},null,{"$f":"SUM(L183:L233)","v":0},null,{"$f":"SUM(N183:N233)","v":0},null,{"$f":"SUM(P183:P233)","v":0},null,{"$f":"SUM(R183:R233)","v":0}]
[]
["BEHAVIORAL HEALTH SERVICES"]
["Fical Year-End Units Details"]
[]
[null,"Contractor:",{"$f":"C178","v":0}]
[null,"Contract #:",{"$f":"C179","v":0}]
[null,"Program Name:",{"$f":"'[4]Final Recon - Summary'!C290","v":"Program 5"}]
[]
["Column1","Service Modalities","Unit","Rate","Final TUOS Units Reconciliation","Final Amount Reconciliation","ODS DMC General Units","ODS DMC General Amount","ODS General Units","ODS General Amount","ODS DMC AB109 Units","ODS DMC AB109 Amount","ODS AB109 Units","ODS AB109 Amount","SUD Non-Billable Units","SUD Non-Billable Amount","Room & Board Units","Room & Board Amount",null,"Total Units (Summary)","Total Units (Details)","Checkpoint"]
[{"$f":"$C$5","v":0},{"$f":"'[4]Final Recon - Summary'!B294","v":"Individual - Alcohol and Drug Counselor"},{"$f":"'[4]Final Recon - Summary'!C294","v":"Per Billable Minute"},{"$f":"'[4]Final Recon - Summary'!D294","v":4.16},{"$f":"UnitsDetails46[[#This Row],[ODS DMC General Units]]+UnitsDetails46[[#This Row],[ODS General Units]]+UnitsDetails46[[#This Row],[ODS DMC AB109 Units]]+UnitsDetails46[[#This Row],[ODS AB109 Units]]+UnitsDetails46[[#This Row],[Room & Board Units]]+UnitsDetails46[[#This Row],[SUD Non-Billable Units]]","v":0},{"$f":"+D244*E244","v":0},null,{"$f":"+D244*G244","v":0},null,{"$f":"UnitsDetails46[[#This Row],[ODS General Units]]*UnitsDetails46[[#This Row],[Rate]]","v":0},null,{"$f":"UnitsDetails46[[#This Row],[Rate]]*UnitsDetails46[[#This Row],[ODS DMC AB109 Units]]","v":0},null,{"$f":"UnitsDetails46[[#This Row],[Rate]]*UnitsDetails46[[#This Row],[ODS AB109 Units]]","v":0},null,{"$f":"UnitsDetails46[[#This Row],[Rate]]*UnitsDetails46[[#This Row],[SUD Non-Billable Units]]","v":0},null,{"$f":"UnitsDetails46[[#This Row],[Rate]]*UnitsDetails46[[#This Row],[Room & Board Units]]","v":0},null,{"$f":"'[4]Final Recon - Summary'!G294","v":0},{"$f":"UnitsDetails46[[#This Row],[ODS DMC General Units]]+UnitsDetails46[[#This Row],[ODS General Units]]+UnitsDetails46[[#This Row],[ODS DMC AB109 Units]]+UnitsDetails46[[#This Row],[ODS AB109 Units]]+UnitsDetails46[[#This Row],[SUD Non-Billable Units]]+UnitsDetails46[[#This Row],[Room & Board Units]]","v":0},{"$f":"T244-U244","v":0}]
[0,{"$f":"'[4]Final Recon - Summary'!B295","v":"Individual - Clinical Nurse Specialist"},{"$f":"'[4]Final Recon - Summary'!C295","v":"Per Billable Minute"},{"$f":"'[4]Final Recon - Summary'!D295","v":9.59},{"$f":"UnitsDetails46[[#This Row],[ODS DMC General Units]]+UnitsDetails46[[#This Row],[ODS General Units]]+UnitsDetails46[[#This Row],[ODS DMC AB109 Units]]+UnitsDetails46[[#This Row],[ODS AB109 Units]]+UnitsDetails46[[#This Row],[Room & Board Units]]+UnitsDetails46[[#This Row],[SUD Non-Billable Units]]","v":0},0,null,0,null,{"$f":"UnitsDetails46[[#This Row],[ODS General Units]]*UnitsDetails46[[#This Row],[Rate]]","v":0},null,{"$f":"UnitsDetails46[[#This Row],[Rate]]*UnitsDetails46[[#This Row],[ODS DMC AB109 Units]]","v":0},null,{"$f":"UnitsDetails46[[#This Row],[Rate]]*UnitsDetails46[[#This Row],[ODS AB109 Units]]","v":0},null,{"$f":"UnitsDetails46[[#This Row],[Rate]]*UnitsDetails46[[#This Row],[SUD Non-Billable Units]]","v":0},null,{"$f":"UnitsDetails46[[#This Row],[Rate]]*UnitsDetails46[[#This Row],[Room & Board Units]]","v":0},null,{"$f":"'[4]Final Recon - Summary'!G295","v":0},{"$f":"UnitsDetails46[[#This Row],[ODS DMC General Units]]+UnitsDetails46[[#This Row],[ODS General Units]]+UnitsDetails46[[#This Row],[ODS DMC AB109 Units]]+UnitsDetails46[[#This Row],[ODS AB109 Units]]+UnitsDetails46[[#This Row],[SUD Non-Billable Units]]+UnitsDetails46[[#This Row],[Room & Board Units]]","v":0},0]
[0,{"$f":"'[4]Final Recon - Summary'!B296","v":"Individual - Community Health Worker"},{"$f":"'[4]Final Recon - Summary'!C296","v":"Per Billable Minute"},{"$f":"'[4]Final Recon - Summary'!D296","v":3.87},{"$f":"UnitsDetails46[[#This Row],[ODS DMC General Units]]+UnitsDetails46[[#This Row],[ODS General Units]]+UnitsDetails46[[#This Row],[ODS DMC AB109 Units]]+UnitsDetails46[[#This Row],[ODS AB109 Units]]+UnitsDetails46[[#This Row],[Room & Board Units]]+UnitsDetails46[[#This Row],[SUD Non-Billable Units]]","v":0},0,null,0,null,{"$f":"UnitsDetails46[[#This Row],[ODS General Units]]*UnitsDetails46[[#This Row],[Rate]]","v":0},null,{"$f":"UnitsDetails46[[#This Row],[Rate]]*UnitsDetails46[[#This Row],[ODS DMC AB109 Units]]","v":0},null,{"$f":"UnitsDetails46[[#This Row],[Rate]]*UnitsDetails46[[#This Row],[ODS AB109 Units]]","v":0},null,{"$f":"UnitsDetails46[[#This Row],[Rate]]*UnitsDetails46[[#This Row],[SUD Non-Billable Units]]","v":0},null,{"$f":"UnitsDetails46[[#This Row],[Rate]]*UnitsDetails46[[#This Row],[Room & Board Units]]","v":0},null,{"$f":"'[4]Final Recon - Summary'!G296","v":0},{"$f":"UnitsDetails46[[#This Row],[ODS DMC General Units]]+UnitsDetails46[[#This Row],[ODS General Units]]+UnitsDetails46[[#This Row],[ODS DMC AB109 Units]]+UnitsDetails46[[#This Row],[ODS AB109 Units]]+UnitsDetails46[[#This Row],[SUD Non-Billable Units]]+UnitsDetails46[[#This Row],[Room & Board Units]]","v":0},0]
[0,{"$f":"'[4]Final Recon - Summary'!B297","v":"Individual - Licensed Psychiatric Technician"},{"$f":"'[4]Final Recon - Summary'!C297","v":"Per Billable Minute"},{"$f":"'[4]Final Recon - Summary'!D297","v":3.53},{"$f":"UnitsDetails46[[#This Row],[ODS DMC General Units]]+UnitsDetails46[[#This Row],[ODS General Units]]+UnitsDetails46[[#This Row],[ODS DMC AB109 Units]]+UnitsDetails46[[#This Row],[ODS AB109 Units]]+UnitsDetails46[[#This Row],[Room & Board Units]]+UnitsDetails46[[#This Row],[SUD Non-Billable Units]]","v":0},0,null,0,null,{"$f":"UnitsDetails46[[#This Row],[ODS General Units]]*UnitsDetails46[[#This Row],[Rate]]","v":0},null,{"$f":"UnitsDetails46[[#This Row],[Rate]]*UnitsDetails46[[#This Row],[ODS DMC AB109 Units]]","v":0},null,{"$f":"UnitsDetails46[[#This Row],[Rate]]*UnitsDetails46[[#This Row],[ODS AB109 Units]]","v":0},null,{"$f":"UnitsDetails46[[#This Row],[Rate]]*UnitsDetails46[[#This Row],[SUD Non-Billable Units]]","v":0},null,{"$f":"UnitsDetails46[[#This Row],[Rate]]*UnitsDetails46[[#This Row],[Room & Board Units]]","v":0},null,{"$f":"'[4]Final Recon - Summary'!G297","v":0},{"$f":"UnitsDetails46[[#This Row],[ODS DMC General Units]]+UnitsDetails46[[#This Row],[ODS General Units]]+UnitsDetails46[[#This Row],[ODS DMC AB109 Units]]+UnitsDetails46[[#This Row],[ODS AB109 Units]]+UnitsDetails46[[#This Row],[SUD Non-Billable Units]]+UnitsDetails46[[#This Row],[Room & Board Units]]","v":0},0]
[0,{"$f":"'[4]Final Recon - Summary'!B298","v":"Individual - LPHA (MFT  LCSW  LPCC)/Intern or Waivered LPHA (MFT  LCSW  LPCC)"},{"$f":"'[4]Final Recon - Summary'!C298","v":"Per Billable Minute"},{"$f":"'[4]Final Recon - Summary'!D298","v":5.0199999999999996},{"$f":"UnitsDetails46[[#This Row],[ODS DMC General Units]]+UnitsDetails46[[#This Row],[ODS General Units]]+UnitsDetails46[[#This Row],[ODS DMC AB109 Units]]+UnitsDetails46[[#This Row],[ODS AB109 Units]]+UnitsDetails46[[#This Row],[Room & Board Units]]+UnitsDetails46[[#This Row],[SUD Non-Billable Units]]","v":0},0,null,0,null,{"$f":"UnitsDetails46[[#This Row],[ODS General Units]]*UnitsDetails46[[#This Row],[Rate]]","v":0},null,{"$f":"UnitsDetails46[[#This Row],[Rate]]*UnitsDetails46[[#This Row],[ODS DMC AB109 Units]]","v":0},null,{"$f":"UnitsDetails46[[#This Row],[Rate]]*UnitsDetails46[[#This Row],[ODS AB109 Units]]","v":0},null,{"$f":"UnitsDetails46[[#This Row],[Rate]]*UnitsDetails46[[#This Row],[SUD Non-Billable Units]]","v":0},null,{"$f":"UnitsDetails46[[#This Row],[Rate]]*UnitsDetails46[[#This Row],[Room & Board Units]]","v":0},null,{"$f":"'[4]Final Recon - Summary'!G298","v":0},{"$f":"UnitsDetails46[[#This Row],[ODS DMC General Units]]+UnitsDetails46[[#This Row],[ODS General Units]]+UnitsDetails46[[#This Row],[ODS DMC AB109 Units]]+UnitsDetails46[[#This Row],[ODS AB109 Units]]+UnitsDetails46[[#This Row],[SUD Non-Billable Units]]+UnitsDetails46[[#This Row],[Room & Board Units]]","v":0},0]
[0,{"$f":"'[4]Final Recon - Summary'!B299","v":"Individual - Licensed Vocational Nurse (LVN)"},{"$f":"'[4]Final Recon - Summary'!C299","v":"Per Billable Minute"},{"$f":"'[4]Final Recon - Summary'!D299","v":4.1100000000000003},{"$f":"UnitsDetails46[[#This Row],[ODS DMC General Units]]+UnitsDetails46[[#This Row],[ODS General Units]]+UnitsDetails46[[#This Row],[ODS DMC AB109 Units]]+UnitsDetails46[[#This Row],[ODS AB109 Units]]+UnitsDetails46[[#This Row],[Room & Board Units]]+UnitsDetails46[[#This Row],[SUD Non-Billable Units]]","v":0},0,null,0,null,{"$f":"UnitsDetails46[[#This Row],[ODS General Units]]*UnitsDetails46[[#This Row],[Rate]]","v":0},null,{"$f":"UnitsDetails46[[#This Row],[Rate]]*UnitsDetails46[[#This Row],[ODS DMC AB109 Units]]","v":0},null,{"$f":"UnitsDetails46[[#This Row],[Rate]]*UnitsDetails46[[#This Row],[ODS AB109 Units]]","v":0},null,{"$f":"UnitsDetails46[[#This Row],[Rate]]*UnitsDetails46[[#This Row],[SUD Non-Billable Units]]","v":0},null,{"$f":"UnitsDetails46[[#This Row],[Rate]]*UnitsDetails46[[#This Row],[Room & Board Units]]","v":0},null,{"$f":"'[4]Final Recon - Summary'!G299","v":0},{"$f":"UnitsDetails46[[#This Row],[ODS DMC General Units]]+UnitsDetails46[[#This Row],[ODS General Units]]+UnitsDetails46[[#This Row],[ODS DMC AB109 Units]]+UnitsDetails46[[#This Row],[ODS AB109 Units]]+UnitsDetails46[[#This Row],[SUD Non-Billable Units]]+UnitsDetails46[[#This Row],[Room & Board Units]]","v":0},0]
[0,{"$f":"'[4]Final Recon - Summary'!B300","v":"Individual - Medical Assistant"},{"$f":"'[4]Final Recon - Summary'!C300","v":"Per Billable Minute"},{"$f":"'[4]Final Recon - Summary'!D300","v":2.83},{"$f":"UnitsDetails46[[#This Row],[ODS DMC General Units]]+UnitsDetails46[[#This Row],[ODS General Units]]+UnitsDetails46[[#This Row],[ODS DMC AB109 Units]]+UnitsDetails46[[#This Row],[ODS AB109 Units]]+UnitsDetails46[[#This Row],[Room & Board Units]]+UnitsDetails46[[#This Row],[SUD Non-Billable Units]]","v":0},0,null,0,null,{"$f":"UnitsDetails46[[#This Row],[ODS General Units]]*UnitsDetails46[[#This Row],[Rate]]","v":0},null,{"$f":"UnitsDetails46[[#This Row],[Rate]]*UnitsDetails46[[#This Row],[ODS DMC AB109 Units]]","v":0},null,{"$f":"UnitsDetails46[[#This Row],[Rate]]*UnitsDetails46[[#This Row],[ODS AB109 Units]]","v":0},null,{"$f":"UnitsDetails46[[#This Row],[Rate]]*UnitsDetails46[[#This Row],[SUD Non-Billable Units]]","v":0},null,{"$f":"UnitsDetails46[[#This Row],[Rate]]*UnitsDetails46[[#This Row],[Room & Board Units]]","v":0},null,{"$f":"'[4]Final Recon - Summary'!G300","v":0},{"$f":"UnitsDetails46[[#This Row],[ODS DMC General Units]]+UnitsDetails46[[#This Row],[ODS General Units]]+UnitsDetails46[[#This Row],[ODS DMC AB109 Units]]+UnitsDetails46[[#This Row],[ODS AB109 Units]]+UnitsDetails46[[#This Row],[SUD Non-Billable Units]]+UnitsDetails46[[#This Row],[Room & Board Units]]","v":0},0]
[0,{"$f":"'[4]Final Recon - Summary'!B301","v":"Individual - Mental Health Rehabilitation Specialist"},{"$f":"'[4]Final Recon - Summary'!C301","v":"Per Billable Minute"},{"$f":"'[4]Final Recon - Summary'!D301","v":3.77},{"$f":"UnitsDetails46[[#This Row],[ODS DMC General Units]]+UnitsDetails46[[#This Row],[ODS General Units]]+UnitsDetails46[[#This Row],[ODS DMC AB109 Units]]+UnitsDetails46[[#This Row],[ODS AB109 Units]]+UnitsDetails46[[#This Row],[Room & Board Units]]+UnitsDetails46[[#This Row],[SUD Non-Billable Units]]","v":0},0,null,0,null,{"$f":"UnitsDetails46[[#This Row],[ODS General Units]]*UnitsDetails46[[#This Row],[Rate]]","v":0},null,{"$f":"UnitsDetails46[[#This Row],[Rate]]*UnitsDetails46[[#This Row],[ODS DMC AB109 Units]]","v":0},null,{"$f":"UnitsDetails46[[#This Row],[Rate]]*UnitsDetails46[[#This Row],[ODS AB109 Units]]","v":0},null,{"$f":"UnitsDetails46[[#This Row],[Rate]]*UnitsDetails46[[#This Row],[SUD Non-Billable Units]]","v":0},null,{"$f":"UnitsDetails46[[#This Row],[Rate]]*UnitsDetails46[[#This Row],[Room & Board Units]]","v":0},null,{"$f":"'[4]Final Recon - Summary'!G301","v":0},{"$f":"UnitsDetails46[[#This Row],[ODS DMC General Units]]+UnitsDetails46[[#This Row],[ODS General Units]]+UnitsDetails46[[#This Row],[ODS DMC AB109 Units]]+UnitsDetails46[[#This Row],[ODS AB109 Units]]+UnitsDetails46[[#This Row],[SUD Non-Billable Units]]+UnitsDetails46[[#This Row],[Room & Board Units]]","v":0},0]
[0,{"$f":"'[4]Final Recon - Summary'!B302","v":"Individual - Nurse Practitioner"},{"$f":"'[4]Final Recon - Summary'!C302","v":"Per Billable Minute"},{"$f":"'[4]Final Recon - Summary'!D302","v":9.59},{"$f":"UnitsDetails46[[#This Row],[ODS DMC General Units]]+UnitsDetails46[[#This Row],[ODS General Units]]+UnitsDetails46[[#This Row],[ODS DMC AB109 Units]]+UnitsDetails46[[#This Row],[ODS AB109 Units]]+UnitsDetails46[[#This Row],[Room & Board Units]]+UnitsDetails46[[#This Row],[SUD Non-Billable Units]]","v":0},0,null,0,null,{"$f":"UnitsDetails46[[#This Row],[ODS General Units]]*UnitsDetails46[[#This Row],[Rate]]","v":0},null,{"$f":"UnitsDetails46[[#This Row],[Rate]]*UnitsDetails46[[#This Row],[ODS DMC AB109 Units]]","v":0},null,{"$f":"UnitsDetails46[[#This Row],[Rate]]*UnitsDetails46[[#This Row],[ODS AB109 Units]]","v":0},null,{"$f":"UnitsDetails46[[#This Row],[Rate]]*UnitsDetails46[[#This Row],[SUD Non-Billable Units]]","v":0},null,{"$f":"UnitsDetails46[[#This Row],[Rate]]*UnitsDetails46[[#This Row],[Room & Board Units]]","v":0},null,{"$f":"'[4]Final Recon - Summary'!G302","v":0},{"$f":"UnitsDetails46[[#This Row],[ODS DMC General Units]]+UnitsDetails46[[#This Row],[ODS General Units]]+UnitsDetails46[[#This Row],[ODS DMC AB109 Units]]+UnitsDetails46[[#This Row],[ODS AB109 Units]]+UnitsDetails46[[#This Row],[SUD Non-Billable Units]]+UnitsDetails46[[#This Row],[Room & Board Units]]","v":0},0]
[0,{"$f":"'[4]Final Recon - Summary'!B303","v":"Individual - Occupational Therapist"},{"$f":"'[4]Final Recon - Summary'!C303","v":"Per Billable Minute"},{"$f":"'[4]Final Recon - Summary'!D303","v":6.68},{"$f":"UnitsDetails46[[#This Row],[ODS DMC General Units]]+UnitsDetails46[[#This Row],[ODS General Units]]+UnitsDetails46[[#This Row],[ODS DMC AB109 Units]]+UnitsDetails46[[#This Row],[ODS AB109 Units]]+UnitsDetails46[[#This Row],[Room & Board Units]]+UnitsDetails46[[#This Row],[SUD Non-Billable Units]]","v":0},0,null,0,null,{"$f":"UnitsDetails46[[#This Row],[ODS General Units]]*UnitsDetails46[[#This Row],[Rate]]","v":0},null,{"$f":"UnitsDetails46[[#This Row],[Rate]]*UnitsDetails46[[#This Row],[ODS DMC AB109 Units]]","v":0},null,{"$f":"UnitsDetails46[[#This Row],[Rate]]*UnitsDetails46[[#This Row],[ODS AB109 Units]]","v":0},null,{"$f":"UnitsDetails46[[#This Row],[Rate]]*UnitsDetails46[[#This Row],[SUD Non-Billable Units]]","v":0},null,{"$f":"UnitsDetails46[[#This Row],[Rate]]*UnitsDetails46[[#This Row],[Room & Board Units]]","v":0},null,{"$f":"'[4]Final Recon - Summary'!G303","v":0},{"$f":"UnitsDetails46[[#This Row],[ODS DMC General Units]]+UnitsDetails46[[#This Row],[ODS General Units]]+UnitsDetails46[[#This Row],[ODS DMC AB109 Units]]+UnitsDetails46[[#This Row],[ODS AB109 Units]]+UnitsDetails46[[#This Row],[SUD Non-Billable Units]]+UnitsDetails46[[#This Row],[Room & Board Units]]","v":0},0]
[0,{"$f":"'[4]Final Recon - Summary'!B304","v":"Individual - Other Qualified Providers - Other Designated MH staff that bill medical"},{"$f":"'[4]Final Recon - Summary'!C304","v":"Per Billable Minute"},{"$f":"'[4]Final Recon - Summary'!D304","v":3.77},{"$f":"UnitsDetails46[[#This Row],[ODS DMC General Units]]+UnitsDetails46[[#This Row],[ODS General Units]]+UnitsDetails46[[#This Row],[ODS DMC AB109 Units]]+UnitsDetails46[[#This Row],[ODS AB109 Units]]+UnitsDetails46[[#This Row],[Room & Board Units]]+UnitsDetails46[[#This Row],[SUD Non-Billable Units]]","v":0},0,null,0,null,{"$f":"UnitsDetails46[[#This Row],[ODS General Units]]*UnitsDetails46[[#This Row],[Rate]]","v":0},null,{"$f":"UnitsDetails46[[#This Row],[Rate]]*UnitsDetails46[[#This Row],[ODS DMC AB109 Units]]","v":0},null,{"$f":"UnitsDetails46[[#This Row],[Rate]]*UnitsDetails46[[#This Row],[ODS AB109 Units]]","v":0},null,{"$f":"UnitsDetails46[[#This Row],[Rate]]*UnitsDetails46[[#This Row],[SUD Non-Billable Units]]","v":0},null,{"$f":"UnitsDetails46[[#This Row],[Rate]]*UnitsDetails46[[#This Row],[Room & Board Units]]","v":0},null,{"$f":"'[4]Final Recon - Summary'!G304","v":0},{"$f":"UnitsDetails46[[#This Row],[ODS DMC General Units]]+UnitsDetails46[[#This Row],[ODS General Units]]+UnitsDetails46[[#This Row],[ODS DMC AB109 Units]]+UnitsDetails46[[#This Row],[ODS AB109 Units]]+UnitsDetails46[[#This Row],[SUD Non-Billable Units]]+UnitsDetails46[[#This Row],[Room & Board Units]]","v":0},0]
[0,{"$f":"'[4]Final Recon - Summary'!B305","v":"Individual - Peer Support Specialist"},{"$f":"'[4]Final Recon - Summary'!C305","v":"Per Billable Minute"},{"$f":"'[4]Final Recon - Summary'!D305","v":3.96},{"$f":"UnitsDetails46[[#This Row],[ODS DMC General Units]]+UnitsDetails46[[#This Row],[ODS General Units]]+UnitsDetails46[[#This Row],[ODS DMC AB109 Units]]+UnitsDetails46[[#This Row],[ODS AB109 Units]]+UnitsDetails46[[#This Row],[Room & Board Units]]+UnitsDetails46[[#This Row],[SUD Non-Billable Units]]","v":0},0,null,0,null,{"$f":"UnitsDetails46[[#This Row],[ODS General Units]]*UnitsDetails46[[#This Row],[Rate]]","v":0},null,{"$f":"UnitsDetails46[[#This Row],[Rate]]*UnitsDetails46[[#This Row],[ODS DMC AB109 Units]]","v":0},null,{"$f":"UnitsDetails46[[#This Row],[Rate]]*UnitsDetails46[[#This Row],[ODS AB109 Units]]","v":0},null,{"$f":"UnitsDetails46[[#This Row],[Rate]]*UnitsDetails46[[#This Row],[SUD Non-Billable Units]]","v":0},null,{"$f":"UnitsDetails46[[#This Row],[Rate]]*UnitsDetails46[[#This Row],[Room & Board Units]]","v":0},null,{"$f":"'[4]Final Recon - Summary'!G305","v":0},{"$f":"UnitsDetails46[[#This Row],[ODS DMC General Units]]+UnitsDetails46[[#This Row],[ODS General Units]]+UnitsDetails46[[#This Row],[ODS DMC AB109 Units]]+UnitsDetails46[[#This Row],[ODS AB109 Units]]+UnitsDetails46[[#This Row],[SUD Non-Billable Units]]+UnitsDetails46[[#This Row],[Room & Board Units]]","v":0},0]
[0,{"$f":"'[4]Final Recon - Summary'!B306","v":"Individual - Physician Assistant"},{"$f":"'[4]Final Recon - Summary'!C306","v":"Per Billable Minute"},{"$f":"'[4]Final Recon - Summary'!D306","v":8.65},{"$f":"UnitsDetails46[[#This Row],[ODS DMC General Units]]+UnitsDetails46[[#This Row],[ODS General Units]]+UnitsDetails46[[#This Row],[ODS DMC AB109 Units]]+UnitsDetails46[[#This Row],[ODS AB109 Units]]+UnitsDetails46[[#This Row],[Room & Board Units]]+UnitsDetails46[[#This Row],[SUD Non-Billable Units]]","v":0},0,null,0,null,{"$f":"UnitsDetails46[[#This Row],[ODS General Units]]*UnitsDetails46[[#This Row],[Rate]]","v":0},null,{"$f":"UnitsDetails46[[#This Row],[Rate]]*UnitsDetails46[[#This Row],[ODS DMC AB109 Units]]","v":0},null,{"$f":"UnitsDetails46[[#This Row],[Rate]]*UnitsDetails46[[#This Row],[ODS AB109 Units]]","v":0},null,{"$f":"UnitsDetails46[[#This Row],[Rate]]*UnitsDetails46[[#This Row],[SUD Non-Billable Units]]","v":0},null,{"$f":"UnitsDetails46[[#This Row],[Rate]]*UnitsDetails46[[#This Row],[Room & Board Units]]","v":0},null,{"$f":"'[4]Final Recon - Summary'!G306","v":0},{"$f":"UnitsDetails46[[#This Row],[ODS DMC General Units]]+UnitsDetails46[[#This Row],[ODS General Units]]+UnitsDetails46[[#This Row],[ODS DMC AB109 Units]]+UnitsDetails46[[#This Row],[ODS AB109 Units]]+UnitsDetails46[[#This Row],[SUD Non-Billable Units]]+UnitsDetails46[[#This Row],[Room & Board Units]]","v":0},0]
[0,{"$f":"'[4]Final Recon - Summary'!B307","v":"Individual - Psychologist/Pre-licensed Psychologist"},{"$f":"'[4]Final Recon - Summary'!C307","v":"Per Billable Minute"},{"$f":"'[4]Final Recon - Summary'!D307","v":7.76},{"$f":"UnitsDetails46[[#This Row],[ODS DMC General Units]]+UnitsDetails46[[#This Row],[ODS General Units]]+UnitsDetails46[[#This Row],[ODS DMC AB109 Units]]+UnitsDetails46[[#This Row],[ODS AB109 Units]]+UnitsDetails46[[#This Row],[Room & Board Units]]+UnitsDetails46[[#This Row],[SUD Non-Billable Units]]","v":0},0,null,0,null,{"$f":"UnitsDetails46[[#This Row],[ODS General Units]]*UnitsDetails46[[#This Row],[Rate]]","v":0},null,{"$f":"UnitsDetails46[[#This Row],[Rate]]*UnitsDetails46[[#This Row],[ODS DMC AB109 Units]]","v":0},null,{"$f":"UnitsDetails46[[#This Row],[Rate]]*UnitsDetails46[[#This Row],[ODS AB109 Units]]","v":0},null,{"$f":"UnitsDetails46[[#This Row],[Rate]]*UnitsDetails46[[#This Row],[SUD Non-Billable Units]]","v":0},null,{"$f":"UnitsDetails46[[#This Row],[Rate]]*UnitsDetails46[[#This Row],[Room & Board Units]]","v":0},null,{"$f":"'[4]Final Recon - Summary'!G307","v":0},{"$f":"UnitsDetails46[[#This Row],[ODS DMC General Units]]+UnitsDetails46[[#This Row],[ODS General Units]]+UnitsDetails46[[#This Row],[ODS DMC AB109 Units]]+UnitsDetails46[[#This Row],[ODS AB109 Units]]+UnitsDetails46[[#This Row],[SUD Non-Billable Units]]+UnitsDetails46[[#This Row],[Room & Board Units]]","v":0},0]
[0,{"$f":"'[4]Final Recon - Summary'!B308","v":"Individual - Psychiatrist/ Contracted Psychiatrist/Licensed Physician (MD)"},{"$f":"'[4]Final Recon - Summary'!C308","v":"Per Billable Minute"},{"$f":"'[4]Final Recon - Summary'!D308","v":11.57},{"$f":"UnitsDetails46[[#This Row],[ODS DMC General Units]]+UnitsDetails46[[#This Row],[ODS General Units]]+UnitsDetails46[[#This Row],[ODS DMC AB109 Units]]+UnitsDetails46[[#This Row],[ODS AB109 Units]]+UnitsDetails46[[#This Row],[Room & Board Units]]+UnitsDetails46[[#This Row],[SUD Non-Billable Units]]","v":0},0,null,0,null,{"$f":"UnitsDetails46[[#This Row],[ODS General Units]]*UnitsDetails46[[#This Row],[Rate]]","v":0},null,{"$f":"UnitsDetails46[[#This Row],[Rate]]*UnitsDetails46[[#This Row],[ODS DMC AB109 Units]]","v":0},null,{"$f":"UnitsDetails46[[#This Row],[Rate]]*UnitsDetails46[[#This Row],[ODS AB109 Units]]","v":0},null,{"$f":"UnitsDetails46[[#This Row],[Rate]]*UnitsDetails46[[#This Row],[SUD Non-Billable Units]]","v":0},null,{"$f":"UnitsDetails46[[#This Row],[Rate]]*UnitsDetails46[[#This Row],[Room & Board Units]]","v":0},null,{"$f":"'[4]Final Recon - Summary'!G308","v":0},{"$f":"UnitsDetails46[[#This Row],[ODS DMC General Units]]+UnitsDetails46[[#This Row],[ODS General Units]]+UnitsDetails46[[#This Row],[ODS DMC AB109 Units]]+UnitsDetails46[[#This Row],[ODS AB109 Units]]+UnitsDetails46[[#This Row],[SUD Non-Billable Units]]+UnitsDetails46[[#This Row],[Room & Board Units]]","v":0},0]
[0,{"$f":"'[4]Final Recon - Summary'!B309","v":"Individual - Registered Nurse (RN)"},{"$f":"'[4]Final Recon - Summary'!C309","v":"Per Billable Minute"},{"$f":"'[4]Final Recon - Summary'!D309","v":7.83},{"$f":"UnitsDetails46[[#This Row],[ODS DMC General Units]]+UnitsDetails46[[#This Row],[ODS General Units]]+UnitsDetails46[[#This Row],[ODS DMC AB109 Units]]+UnitsDetails46[[#This Row],[ODS AB109 Units]]+UnitsDetails46[[#This Row],[Room & Board Units]]+UnitsDetails46[[#This Row],[SUD Non-Billable Units]]","v":0},0,null,0,null,{"$f":"UnitsDetails46[[#This Row],[ODS General Units]]*UnitsDetails46[[#This Row],[Rate]]","v":0},null,{"$f":"UnitsDetails46[[#This Row],[Rate]]*UnitsDetails46[[#This Row],[ODS DMC AB109 Units]]","v":0},null,{"$f":"UnitsDetails46[[#This Row],[Rate]]*UnitsDetails46[[#This Row],[ODS AB109 Units]]","v":0},null,{"$f":"UnitsDetails46[[#This Row],[Rate]]*UnitsDetails46[[#This Row],[SUD Non-Billable Units]]","v":0},null,{"$f":"UnitsDetails46[[#This Row],[Rate]]*UnitsDetails46[[#This Row],[Room & Board Units]]","v":0},null,{"$f":"'[4]Final Recon - Summary'!G309","v":0},{"$f":"UnitsDetails46[[#This Row],[ODS DMC General Units]]+UnitsDetails46[[#This Row],[ODS General Units]]+UnitsDetails46[[#This Row],[ODS DMC AB109 Units]]+UnitsDetails46[[#This Row],[ODS AB109 Units]]+UnitsDetails46[[#This Row],[SUD Non-Billable Units]]+UnitsDetails46[[#This Row],[Room & Board Units]]","v":0},0]
[0,{"$f":"'[4]Final Recon - Summary'!B310","v":"Individual - Registered Pharmacist"},{"$f":"'[4]Final Recon - Summary'!C310","v":"Per Billable Minute"},{"$f":"'[4]Final Recon - Summary'!D310","v":9.23},{"$f":"UnitsDetails46[[#This Row],[ODS DMC General Units]]+UnitsDetails46[[#This Row],[ODS General Units]]+UnitsDetails46[[#This Row],[ODS DMC AB109 Units]]+UnitsDetails46[[#This Row],[ODS AB109 Units]]+UnitsDetails46[[#This Row],[Room & Board Units]]+UnitsDetails46[[#This Row],[SUD Non-Billable Units]]","v":0},0,null,0,null,{"$f":"UnitsDetails46[[#This Row],[ODS General Units]]*UnitsDetails46[[#This Row],[Rate]]","v":0},null,{"$f":"UnitsDetails46[[#This Row],[Rate]]*UnitsDetails46[[#This Row],[ODS DMC AB109 Units]]","v":0},null,{"$f":"UnitsDetails46[[#This Row],[Rate]]*UnitsDetails46[[#This Row],[ODS AB109 Units]]","v":0},null,{"$f":"UnitsDetails46[[#This Row],[Rate]]*UnitsDetails46[[#This Row],[SUD Non-Billable Units]]","v":0},null,{"$f":"UnitsDetails46[[#This Row],[Rate]]*UnitsDetails46[[#This Row],[Room & Board Units]]","v":0},null,{"$f":"'[4]Final Recon - Summary'!G310","v":0},{"$f":"UnitsDetails46[[#This Row],[ODS DMC General Units]]+UnitsDetails46[[#This Row],[ODS General Units]]+UnitsDetails46[[#This Row],[ODS DMC AB109 Units]]+UnitsDetails46[[#This Row],[ODS AB109 Units]]+UnitsDetails46[[#This Row],[SUD Non-Billable Units]]+UnitsDetails46[[#This Row],[Room & Board Units]]","v":0},0]
[0,{"$f":"'[4]Final Recon - Summary'!B311","v":"Individual - Interpreter Services"},{"$f":"'[4]Final Recon - Summary'!C311","v":"Per Billable Minute"},{"$f":"'[4]Final Recon - Summary'!D311","v":2.19},{"$f":"UnitsDetails46[[#This Row],[ODS DMC General Units]]+UnitsDetails46[[#This Row],[ODS General Units]]+UnitsDetails46[[#This Row],[ODS DMC AB109 Units]]+UnitsDetails46[[#This Row],[ODS AB109 Units]]+UnitsDetails46[[#This Row],[Room & Board Units]]+UnitsDetails46[[#This Row],[SUD Non-Billable Units]]","v":0},0,null,0,null,{"$f":"UnitsDetails46[[#This Row],[ODS General Units]]*UnitsDetails46[[#This Row],[Rate]]","v":0},null,{"$f":"UnitsDetails46[[#This Row],[Rate]]*UnitsDetails46[[#This Row],[ODS DMC AB109 Units]]","v":0},null,{"$f":"UnitsDetails46[[#This Row],[Rate]]*UnitsDetails46[[#This Row],[ODS AB109 Units]]","v":0},null,{"$f":"UnitsDetails46[[#This Row],[Rate]]*UnitsDetails46[[#This Row],[SUD Non-Billable Units]]","v":0},null,{"$f":"UnitsDetails46[[#This Row],[Rate]]*UnitsDetails46[[#This Row],[Room & Board Units]]","v":0},null,{"$f":"'[4]Final Recon - Summary'!G311","v":0},{"$f":"UnitsDetails46[[#This Row],[ODS DMC General Units]]+UnitsDetails46[[#This Row],[ODS General Units]]+UnitsDetails46[[#This Row],[ODS DMC AB109 Units]]+UnitsDetails46[[#This Row],[ODS AB109 Units]]+UnitsDetails46[[#This Row],[SUD Non-Billable Units]]+UnitsDetails46[[#This Row],[Room & Board Units]]","v":0},0]
[0,{"$f":"'[4]Final Recon - Summary'!B312","v":"Interactive Complexity"},{"$f":"'[4]Final Recon - Summary'!C312","v":"Per Occurrence"},{"$f":"'[4]Final Recon - Summary'!D312","v":14.61},{"$f":"UnitsDetails46[[#This Row],[ODS DMC General Units]]+UnitsDetails46[[#This Row],[ODS General Units]]+UnitsDetails46[[#This Row],[ODS DMC AB109 Units]]+UnitsDetails46[[#This Row],[ODS AB109 Units]]+UnitsDetails46[[#This Row],[Room & Board Units]]+UnitsDetails46[[#This Row],[SUD Non-Billable Units]]","v":0},0,null,0,null,{"$f":"UnitsDetails46[[#This Row],[ODS General Units]]*UnitsDetails46[[#This Row],[Rate]]","v":0},null,{"$f":"UnitsDetails46[[#This Row],[Rate]]*UnitsDetails46[[#This Row],[ODS DMC AB109 Units]]","v":0},null,{"$f":"UnitsDetails46[[#This Row],[Rate]]*UnitsDetails46[[#This Row],[ODS AB109 Units]]","v":0},null,{"$f":"UnitsDetails46[[#This Row],[Rate]]*UnitsDetails46[[#This Row],[SUD Non-Billable Units]]","v":0},null,{"$f":"UnitsDetails46[[#This Row],[Rate]]*UnitsDetails46[[#This Row],[Room & Board Units]]","v":0},null,{"$f":"'[4]Final Recon - Summary'!G312","v":0},{"$f":"UnitsDetails46[[#This Row],[ODS DMC General Units]]+UnitsDetails46[[#This Row],[ODS General Units]]+UnitsDetails46[[#This Row],[ODS DMC AB109 Units]]+UnitsDetails46[[#This Row],[ODS AB109 Units]]+UnitsDetails46[[#This Row],[SUD Non-Billable Units]]+UnitsDetails46[[#This Row],[Room & Board Units]]","v":0},0]
[0,{"$f":"'[4]Final Recon - Summary'!B313","v":"Parent-Child Interaction Therapy (PCIT Modifier 22)"},{"$f":"'[4]Final Recon - Summary'!C313","v":"Per Occurrence"},{"$f":"'[4]Final Recon - Summary'!D313","v":2.4},{"$f":"UnitsDetails46[[#This Row],[ODS DMC General Units]]+UnitsDetails46[[#This Row],[ODS General Units]]+UnitsDetails46[[#This Row],[ODS DMC AB109 Units]]+UnitsDetails46[[#This Row],[ODS AB109 Units]]+UnitsDetails46[[#This Row],[Room & Board Units]]+UnitsDetails46[[#This Row],[SUD Non-Billable Units]]","v":0},0,null,0,null,{"$f":"UnitsDetails46[[#This Row],[ODS General Units]]*UnitsDetails46[[#This Row],[Rate]]","v":0},null,{"$f":"UnitsDetails46[[#This Row],[Rate]]*UnitsDetails46[[#This Row],[ODS DMC AB109 Units]]","v":0},null,{"$f":"UnitsDetails46[[#This Row],[Rate]]*UnitsDetails46[[#This Row],[ODS AB109 Units]]","v":0},null,{"$f":"UnitsDetails46[[#This Row],[Rate]]*UnitsDetails46[[#This Row],[SUD Non-Billable Units]]","v":0},null,{"$f":"UnitsDetails46[[#This Row],[Rate]]*UnitsDetails46[[#This Row],[Room & Board Units]]","v":0},null,{"$f":"'[4]Final Recon - Summary'!G313","v":0},{"$f":"UnitsDetails46[[#This Row],[ODS DMC General Units]]+UnitsDetails46[[#This Row],[ODS General Units]]+UnitsDetails46[[#This Row],[ODS DMC AB109 Units]]+UnitsDetails46[[#This Row],[ODS AB109 Units]]+UnitsDetails46[[#This Row],[SUD Non-Billable Units]]+UnitsDetails46[[#This Row],[Room & Board Units]]","v":0},0]
[0,{"$f":"'[4]Final Recon - Summary'!B314","v":"Group - Alcohol and Drug Counselor"},{"$f":"'[4]Final Recon - Summary'!C314","v":"Per Billable Minute"},{"$f":"'[4]Final Recon - Summary'!D314","v":0.92},{"$f":"UnitsDetails46[[#This Row],[ODS DMC General Units]]+UnitsDetails46[[#This Row],[ODS General Units]]+UnitsDetails46[[#This Row],[ODS DMC AB109 Units]]+UnitsDetails46[[#This Row],[ODS AB109 Units]]+UnitsDetails46[[#This Row],[Room & Board Units]]+UnitsDetails46[[#This Row],[SUD Non-Billable Units]]","v":0},0,null,0,null,{"$f":"UnitsDetails46[[#This Row],[ODS General Units]]*UnitsDetails46[[#This Row],[Rate]]","v":0},null,{"$f":"UnitsDetails46[[#This Row],[Rate]]*UnitsDetails46[[#This Row],[ODS DMC AB109 Units]]","v":0},null,{"$f":"UnitsDetails46[[#This Row],[Rate]]*UnitsDetails46[[#This Row],[ODS AB109 Units]]","v":0},null,{"$f":"UnitsDetails46[[#This Row],[Rate]]*UnitsDetails46[[#This Row],[SUD Non-Billable Units]]","v":0},null,{"$f":"UnitsDetails46[[#This Row],[Rate]]*UnitsDetails46[[#This Row],[Room & Board Units]]","v":0},null,{"$f":"'[4]Final Recon - Summary'!G314","v":0},{"$f":"UnitsDetails46[[#This Row],[ODS DMC General Units]]+UnitsDetails46[[#This Row],[ODS General Units]]+UnitsDetails46[[#This Row],[ODS DMC AB109 Units]]+UnitsDetails46[[#This Row],[ODS AB109 Units]]+UnitsDetails46[[#This Row],[SUD Non-Billable Units]]+UnitsDetails46[[#This Row],[Room & Board Units]]","v":0},0]
[0,{"$f":"'[4]Final Recon - Summary'!B315","v":"Group - Clinical Nurse Specialist"},{"$f":"'[4]Final Recon - Summary'!C315","v":"Per Billable Minute"},{"$f":"'[4]Final Recon - Summary'!D315","v":2.13},{"$f":"UnitsDetails46[[#This Row],[ODS DMC General Units]]+UnitsDetails46[[#This Row],[ODS General Units]]+UnitsDetails46[[#This Row],[ODS DMC AB109 Units]]+UnitsDetails46[[#This Row],[ODS AB109 Units]]+UnitsDetails46[[#This Row],[Room & Board Units]]+UnitsDetails46[[#This Row],[SUD Non-Billable Units]]","v":0},0,null,0,null,{"$f":"UnitsDetails46[[#This Row],[ODS General Units]]*UnitsDetails46[[#This Row],[Rate]]","v":0},null,{"$f":"UnitsDetails46[[#This Row],[Rate]]*UnitsDetails46[[#This Row],[ODS DMC AB109 Units]]","v":0},null,{"$f":"UnitsDetails46[[#This Row],[Rate]]*UnitsDetails46[[#This Row],[ODS AB109 Units]]","v":0},null,{"$f":"UnitsDetails46[[#This Row],[Rate]]*UnitsDetails46[[#This Row],[SUD Non-Billable Units]]","v":0},null,{"$f":"UnitsDetails46[[#This Row],[Rate]]*UnitsDetails46[[#This Row],[Room & Board Units]]","v":0},null,{"$f":"'[4]Final Recon - Summary'!G315","v":0},{"$f":"UnitsDetails46[[#This Row],[ODS DMC General Units]]+UnitsDetails46[[#This Row],[ODS General Units]]+UnitsDetails46[[#This Row],[ODS DMC AB109 Units]]+UnitsDetails46[[#This Row],[ODS AB109 Units]]+UnitsDetails46[[#This Row],[SUD Non-Billable Units]]+UnitsDetails46[[#This Row],[Room & Board Units]]","v":0},0]
[0,{"$f":"'[4]Final Recon - Summary'!B316","v":"Group - Community Health Worker (CPT 98961)"},{"$f":"'[4]Final Recon - Summary'!C316","v":"Per Billable Minute"},{"$f":"'[4]Final Recon - Summary'!D316","v":1.29},{"$f":"UnitsDetails46[[#This Row],[ODS DMC General Units]]+UnitsDetails46[[#This Row],[ODS General Units]]+UnitsDetails46[[#This Row],[ODS DMC AB109 Units]]+UnitsDetails46[[#This Row],[ODS AB109 Units]]+UnitsDetails46[[#This Row],[Room & Board Units]]+UnitsDetails46[[#This Row],[SUD Non-Billable Units]]","v":0},0,null,0,null,{"$f":"UnitsDetails46[[#This Row],[ODS General Units]]*UnitsDetails46[[#This Row],[Rate]]","v":0},null,{"$f":"UnitsDetails46[[#This Row],[Rate]]*UnitsDetails46[[#This Row],[ODS DMC AB109 Units]]","v":0},null,{"$f":"UnitsDetails46[[#This Row],[Rate]]*UnitsDetails46[[#This Row],[ODS AB109 Units]]","v":0},null,{"$f":"UnitsDetails46[[#This Row],[Rate]]*UnitsDetails46[[#This Row],[SUD Non-Billable Units]]","v":0},null,{"$f":"UnitsDetails46[[#This Row],[Rate]]*UnitsDetails46[[#This Row],[Room & Board Units]]","v":0},null,{"$f":"'[4]Final Recon - Summary'!G316","v":0},{"$f":"UnitsDetails46[[#This Row],[ODS DMC General Units]]+UnitsDetails46[[#This Row],[ODS General Units]]+UnitsDetails46[[#This Row],[ODS DMC AB109 Units]]+UnitsDetails46[[#This Row],[ODS AB109 Units]]+UnitsDetails46[[#This Row],[SUD Non-Billable Units]]+UnitsDetails46[[#This Row],[Room & Board Units]]","v":0},0]
[0,{"$f":"'[4]Final Recon - Summary'!B317","v":"Group - Community Health Worker (CPT 98962)"},{"$f":"'[4]Final Recon - Summary'!C317","v":"Per Billable Minute"},{"$f":"'[4]Final Recon - Summary'!D317","v":0.59},{"$f":"UnitsDetails46[[#This Row],[ODS DMC General Units]]+UnitsDetails46[[#This Row],[ODS General Units]]+UnitsDetails46[[#This Row],[ODS DMC AB109 Units]]+UnitsDetails46[[#This Row],[ODS AB109 Units]]+UnitsDetails46[[#This Row],[Room & Board Units]]+UnitsDetails46[[#This Row],[SUD Non-Billable Units]]","v":0},0,null,0,null,{"$f":"UnitsDetails46[[#This Row],[ODS General Units]]*UnitsDetails46[[#This Row],[Rate]]","v":0},null,{"$f":"UnitsDetails46[[#This Row],[Rate]]*UnitsDetails46[[#This Row],[ODS DMC AB109 Units]]","v":0},null,{"$f":"UnitsDetails46[[#This Row],[Rate]]*UnitsDetails46[[#This Row],[ODS AB109 Units]]","v":0},null,{"$f":"UnitsDetails46[[#This Row],[Rate]]*UnitsDetails46[[#This Row],[SUD Non-Billable Units]]","v":0},null,{"$f":"UnitsDetails46[[#This Row],[Rate]]*UnitsDetails46[[#This Row],[Room & Board Units]]","v":0},null,{"$f":"'[4]Final Recon - Summary'!G317","v":0},{"$f":"UnitsDetails46[[#This Row],[ODS DMC General Units]]+UnitsDetails46[[#This Row],[ODS General Units]]+UnitsDetails46[[#This Row],[ODS DMC AB109 Units]]+UnitsDetails46[[#This Row],[ODS AB109 Units]]+UnitsDetails46[[#This Row],[SUD Non-Billable Units]]+UnitsDetails46[[#This Row],[Room & Board Units]]","v":0},0]
[0,{"$f":"'[4]Final Recon - Summary'!B318","v":"Group - Licensed Psychiatric Technician"},{"$f":"'[4]Final Recon - Summary'!C318","v":"Per Billable Minute"},{"$f":"'[4]Final Recon - Summary'!D318","v":0.78},{"$f":"UnitsDetails46[[#This Row],[ODS DMC General Units]]+UnitsDetails46[[#This Row],[ODS General Units]]+UnitsDetails46[[#This Row],[ODS DMC AB109 Units]]+UnitsDetails46[[#This Row],[ODS AB109 Units]]+UnitsDetails46[[#This Row],[Room & Board Units]]+UnitsDetails46[[#This Row],[SUD Non-Billable Units]]","v":0},0,null,0,null,{"$f":"UnitsDetails46[[#This Row],[ODS General Units]]*UnitsDetails46[[#This Row],[Rate]]","v":0},null,{"$f":"UnitsDetails46[[#This Row],[Rate]]*UnitsDetails46[[#This Row],[ODS DMC AB109 Units]]","v":0},null,{"$f":"UnitsDetails46[[#This Row],[Rate]]*UnitsDetails46[[#This Row],[ODS AB109 Units]]","v":0},null,{"$f":"UnitsDetails46[[#This Row],[Rate]]*UnitsDetails46[[#This Row],[SUD Non-Billable Units]]","v":0},null,{"$f":"UnitsDetails46[[#This Row],[Rate]]*UnitsDetails46[[#This Row],[Room & Board Units]]","v":0},null,{"$f":"'[4]Final Recon - Summary'!G318","v":0},{"$f":"UnitsDetails46[[#This Row],[ODS DMC General Units]]+UnitsDetails46[[#This Row],[ODS General Units]]+UnitsDetails46[[#This Row],[ODS DMC AB109 Units]]+UnitsDetails46[[#This Row],[ODS AB109 Units]]+UnitsDetails46[[#This Row],[SUD Non-Billable Units]]+UnitsDetails46[[#This Row],[Room & Board Units]]","v":0},0]
[0,{"$f":"'[4]Final Recon - Summary'!B319","v":"Group - LPHA (MFT  LCSW  LPCC)/Intern or Waivered LPHA (MFT  LCSW  LPCC)"},{"$f":"'[4]Final Recon - Summary'!C319","v":"Per Billable Minute"},{"$f":"'[4]Final Recon - Summary'!D319","v":1.1200000000000001},{"$f":"UnitsDetails46[[#This Row],[ODS DMC General Units]]+UnitsDetails46[[#This Row],[ODS General Units]]+UnitsDetails46[[#This Row],[ODS DMC AB109 Units]]+UnitsDetails46[[#This Row],[ODS AB109 Units]]+UnitsDetails46[[#This Row],[Room & Board Units]]+UnitsDetails46[[#This Row],[SUD Non-Billable Units]]","v":0},0,null,0,null,{"$f":"UnitsDetails46[[#This Row],[ODS General Units]]*UnitsDetails46[[#This Row],[Rate]]","v":0},null,{"$f":"UnitsDetails46[[#This Row],[Rate]]*UnitsDetails46[[#This Row],[ODS DMC AB109 Units]]","v":0},null,{"$f":"UnitsDetails46[[#This Row],[Rate]]*UnitsDetails46[[#This Row],[ODS AB109 Units]]","v":0},null,{"$f":"UnitsDetails46[[#This Row],[Rate]]*UnitsDetails46[[#This Row],[SUD Non-Billable Units]]","v":0},null,{"$f":"UnitsDetails46[[#This Row],[Rate]]*UnitsDetails46[[#This Row],[Room & Board Units]]","v":0},null,{"$f":"'[4]Final Recon - Summary'!G319","v":0},{"$f":"UnitsDetails46[[#This Row],[ODS DMC General Units]]+UnitsDetails46[[#This Row],[ODS General Units]]+UnitsDetails46[[#This Row],[ODS DMC AB109 Units]]+UnitsDetails46[[#This Row],[ODS AB109 Units]]+UnitsDetails46[[#This Row],[SUD Non-Billable Units]]+UnitsDetails46[[#This Row],[Room & Board Units]]","v":0},0]
[0,{"$f":"'[4]Final Recon - Summary'!B320","v":"Group - Licensed Vocational Nurse (LVN)"},{"$f":"'[4]Final Recon - Summary'!C320","v":"Per Billable Minute"},{"$f":"'[4]Final Recon - Summary'!D320","v":0.92},{"$f":"UnitsDetails46[[#This Row],[ODS DMC General Units]]+UnitsDetails46[[#This Row],[ODS General Units]]+UnitsDetails46[[#This Row],[ODS DMC AB109 Units]]+UnitsDetails46[[#This Row],[ODS AB109 Units]]+UnitsDetails46[[#This Row],[Room & Board Units]]+UnitsDetails46[[#This Row],[SUD Non-Billable Units]]","v":0},0,null,0,null,{"$f":"UnitsDetails46[[#This Row],[ODS General Units]]*UnitsDetails46[[#This Row],[Rate]]","v":0},null,{"$f":"UnitsDetails46[[#This Row],[Rate]]*UnitsDetails46[[#This Row],[ODS DMC AB109 Units]]","v":0},null,{"$f":"UnitsDetails46[[#This Row],[Rate]]*UnitsDetails46[[#This Row],[ODS AB109 Units]]","v":0},null,{"$f":"UnitsDetails46[[#This Row],[Rate]]*UnitsDetails46[[#This Row],[SUD Non-Billable Units]]","v":0},null,{"$f":"UnitsDetails46[[#This Row],[Rate]]*UnitsDetails46[[#This Row],[Room & Board Units]]","v":0},null,{"$f":"'[4]Final Recon - Summary'!G320","v":0},{"$f":"UnitsDetails46[[#This Row],[ODS DMC General Units]]+UnitsDetails46[[#This Row],[ODS General Units]]+UnitsDetails46[[#This Row],[ODS DMC AB109 Units]]+UnitsDetails46[[#This Row],[ODS AB109 Units]]+UnitsDetails46[[#This Row],[SUD Non-Billable Units]]+UnitsDetails46[[#This Row],[Room & Board Units]]","v":0},0]
[0,{"$f":"'[4]Final Recon - Summary'!B321","v":"Group - Medical Assistant"},{"$f":"'[4]Final Recon - Summary'!C321","v":"Per Billable Minute"},{"$f":"'[4]Final Recon - Summary'!D321","v":0.63},{"$f":"UnitsDetails46[[#This Row],[ODS DMC General Units]]+UnitsDetails46[[#This Row],[ODS General Units]]+UnitsDetails46[[#This Row],[ODS DMC AB109 Units]]+UnitsDetails46[[#This Row],[ODS AB109 Units]]+UnitsDetails46[[#This Row],[Room & Board Units]]+UnitsDetails46[[#This Row],[SUD Non-Billable Units]]","v":0},0,null,0,null,{"$f":"UnitsDetails46[[#This Row],[ODS General Units]]*UnitsDetails46[[#This Row],[Rate]]","v":0},null,{"$f":"UnitsDetails46[[#This Row],[Rate]]*UnitsDetails46[[#This Row],[ODS DMC AB109 Units]]","v":0},null,{"$f":"UnitsDetails46[[#This Row],[Rate]]*UnitsDetails46[[#This Row],[ODS AB109 Units]]","v":0},null,{"$f":"UnitsDetails46[[#This Row],[Rate]]*UnitsDetails46[[#This Row],[SUD Non-Billable Units]]","v":0},null,{"$f":"UnitsDetails46[[#This Row],[Rate]]*UnitsDetails46[[#This Row],[Room & Board Units]]","v":0},null,{"$f":"'[4]Final Recon - Summary'!G321","v":0},{"$f":"UnitsDetails46[[#This Row],[ODS DMC General Units]]+UnitsDetails46[[#This Row],[ODS General Units]]+UnitsDetails46[[#This Row],[ODS DMC AB109 Units]]+UnitsDetails46[[#This Row],[ODS AB109 Units]]+UnitsDetails46[[#This Row],[SUD Non-Billable Units]]+UnitsDetails46[[#This Row],[Room & Board Units]]","v":0},0]
[0,{"$f":"'[4]Final Recon - Summary'!B322","v":"Group - Mental Health Rehabilitation Specialist"},{"$f":"'[4]Final Recon - Summary'!C322","v":"Per Billable Minute"},{"$f":"'[4]Final Recon - Summary'!D322","v":0.84},{"$f":"UnitsDetails46[[#This Row],[ODS DMC General Units]]+UnitsDetails46[[#This Row],[ODS General Units]]+UnitsDetails46[[#This Row],[ODS DMC AB109 Units]]+UnitsDetails46[[#This Row],[ODS AB109 Units]]+UnitsDetails46[[#This Row],[Room & Board Units]]+UnitsDetails46[[#This Row],[SUD Non-Billable Units]]","v":0},0,null,0,null,{"$f":"UnitsDetails46[[#This Row],[ODS General Units]]*UnitsDetails46[[#This Row],[Rate]]","v":0},null,{"$f":"UnitsDetails46[[#This Row],[Rate]]*UnitsDetails46[[#This Row],[ODS DMC AB109 Units]]","v":0},null,{"$f":"UnitsDetails46[[#This Row],[Rate]]*UnitsDetails46[[#This Row],[ODS AB109 Units]]","v":0},null,{"$f":"UnitsDetails46[[#This Row],[Rate]]*UnitsDetails46[[#This Row],[SUD Non-Billable Units]]","v":0},null,{"$f":"UnitsDetails46[[#This Row],[Rate]]*UnitsDetails46[[#This Row],[Room & Board Units]]","v":0},null,{"$f":"'[4]Final Recon - Summary'!G322","v":0},{"$f":"UnitsDetails46[[#This Row],[ODS DMC General Units]]+UnitsDetails46[[#This Row],[ODS General Units]]+UnitsDetails46[[#This Row],[ODS DMC AB109 Units]]+UnitsDetails46[[#This Row],[ODS AB109 Units]]+UnitsDetails46[[#This Row],[SUD Non-Billable Units]]+UnitsDetails46[[#This Row],[Room & Board Units]]","v":0},0]
[0,{"$f":"'[4]Final Recon - Summary'!B323","v":"Group - Nurse Practitioner"},{"$f":"'[4]Final Recon - Summary'!C323","v":"Per Billable Minute"},{"$f":"'[4]Final Recon - Summary'!D323","v":2.13},{"$f":"UnitsDetails46[[#This Row],[ODS DMC General Units]]+UnitsDetails46[[#This Row],[ODS General Units]]+UnitsDetails46[[#This Row],[ODS DMC AB109 Units]]+UnitsDetails46[[#This Row],[ODS AB109 Units]]+UnitsDetails46[[#This Row],[Room & Board Units]]+UnitsDetails46[[#This Row],[SUD Non-Billable Units]]","v":0},0,null,0,null,{"$f":"UnitsDetails46[[#This Row],[ODS General Units]]*UnitsDetails46[[#This Row],[Rate]]","v":0},null,{"$f":"UnitsDetails46[[#This Row],[Rate]]*UnitsDetails46[[#This Row],[ODS DMC AB109 Units]]","v":0},null,{"$f":"UnitsDetails46[[#This Row],[Rate]]*UnitsDetails46[[#This Row],[ODS AB109 Units]]","v":0},null,{"$f":"UnitsDetails46[[#This Row],[Rate]]*UnitsDetails46[[#This Row],[SUD Non-Billable Units]]","v":0},null,{"$f":"UnitsDetails46[[#This Row],[Rate]]*UnitsDetails46[[#This Row],[Room & Board Units]]","v":0},null,{"$f":"'[4]Final Recon - Summary'!G323","v":0},{"$f":"UnitsDetails46[[#This Row],[ODS DMC General Units]]+UnitsDetails46[[#This Row],[ODS General Units]]+UnitsDetails46[[#This Row],[ODS DMC AB109 Units]]+UnitsDetails46[[#This Row],[ODS AB109 Units]]+UnitsDetails46[[#This Row],[SUD Non-Billable Units]]+UnitsDetails46[[#This Row],[Room & Board Units]]","v":0},0]
[0,{"$f":"'[4]Final Recon - Summary'!B324","v":"Group - Occupational Therapist"},{"$f":"'[4]Final Recon - Summary'!C324","v":"Per Billable Minute"},{"$f":"'[4]Final Recon - Summary'!D324","v":1.49},{"$f":"UnitsDetails46[[#This Row],[ODS DMC General Units]]+UnitsDetails46[[#This Row],[ODS General Units]]+UnitsDetails46[[#This Row],[ODS DMC AB109 Units]]+UnitsDetails46[[#This Row],[ODS AB109 Units]]+UnitsDetails46[[#This Row],[Room & Board Units]]+UnitsDetails46[[#This Row],[SUD Non-Billable Units]]","v":0},0,null,0,null,{"$f":"UnitsDetails46[[#This Row],[ODS General Units]]*UnitsDetails46[[#This Row],[Rate]]","v":0},null,{"$f":"UnitsDetails46[[#This Row],[Rate]]*UnitsDetails46[[#This Row],[ODS DMC AB109 Units]]","v":0},null,{"$f":"UnitsDetails46[[#This Row],[Rate]]*UnitsDetails46[[#This Row],[ODS AB109 Units]]","v":0},null,{"$f":"UnitsDetails46[[#This Row],[Rate]]*UnitsDetails46[[#This Row],[SUD Non-Billable Units]]","v":0},null,{"$f":"UnitsDetails46[[#This Row],[Rate]]*UnitsDetails46[[#This Row],[Room & Board Units]]","v":0},null,{"$f":"'[4]Final Recon - Summary'!G324","v":0},{"$f":"UnitsDetails46[[#This Row],[ODS DMC General Units]]+UnitsDetails46[[#This Row],[ODS General Units]]+UnitsDetails46[[#This Row],[ODS DMC AB109 Units]]+UnitsDetails46[[#This Row],[ODS AB109 Units]]+UnitsDetails46[[#This Row],[SUD Non-Billable Units]]+UnitsDetails46[[#This Row],[Room & Board Units]]","v":0},0]
[0,{"$f":"'[4]Final Recon - Summary'!B325","v":"Group - Other Qualified Providers - Other Designated MH staff that bill medical"},{"$f":"'[4]Final Recon - Summary'!C325","v":"Per Billable Minute"},{"$f":"'[4]Final Recon - Summary'!D325","v":0.84},{"$f":"UnitsDetails46[[#This Row],[ODS DMC General Units]]+UnitsDetails46[[#This Row],[ODS General Units]]+UnitsDetails46[[#This Row],[ODS DMC AB109 Units]]+UnitsDetails46[[#This Row],[ODS AB109 Units]]+UnitsDetails46[[#This Row],[Room & Board Units]]+UnitsDetails46[[#This Row],[SUD Non-Billable Units]]","v":0},0,null,0,null,{"$f":"UnitsDetails46[[#This Row],[ODS General Units]]*UnitsDetails46[[#This Row],[Rate]]","v":0},null,{"$f":"UnitsDetails46[[#This Row],[Rate]]*UnitsDetails46[[#This Row],[ODS DMC AB109 Units]]","v":0},null,{"$f":"UnitsDetails46[[#This Row],[Rate]]*UnitsDetails46[[#This Row],[ODS AB109 Units]]","v":0},null,{"$f":"UnitsDetails46[[#This Row],[Rate]]*UnitsDetails46[[#This Row],[SUD Non-Billable Units]]","v":0},null,{"$f":"UnitsDetails46[[#This Row],[Rate]]*UnitsDetails46[[#This Row],[Room & Board Units]]","v":0},null,{"$f":"'[4]Final Recon - Summary'!G325","v":0},{"$f":"UnitsDetails46[[#This Row],[ODS DMC General Units]]+UnitsDetails46[[#This Row],[ODS General Units]]+UnitsDetails46[[#This Row],[ODS DMC AB109 Units]]+UnitsDetails46[[#This Row],[ODS AB109 Units]]+UnitsDetails46[[#This Row],[SUD Non-Billable Units]]+UnitsDetails46[[#This Row],[Room & Board Units]]","v":0},0]
[{"$f":"$C$5","v":0},{"$f":"'[4]Final Recon - Summary'!B326","v":"Group - Peer Support Specialist"},{"$f":"'[4]Final Recon - Summary'!C326","v":"Per Billable Minute"},{"$f":"'[4]Final Recon - Summary'!D326","v":0.88},{"$f":"UnitsDetails46[[#This Row],[ODS DMC General Units]]+UnitsDetails46[[#This Row],[ODS General Units]]+UnitsDetails46[[#This Row],[ODS DMC AB109 Units]]+UnitsDetails46[[#This Row],[ODS AB109 Units]]+UnitsDetails46[[#This Row],[Room & Board Units]]+UnitsDetails46[[#This Row],[SUD Non-Billable Units]]","v":0},0,null,0,null,{"$f":"UnitsDetails46[[#This Row],[ODS General Units]]*UnitsDetails46[[#This Row],[Rate]]","v":0},null,{"$f":"UnitsDetails46[[#This Row],[Rate]]*UnitsDetails46[[#This Row],[ODS DMC AB109 Units]]","v":0},null,{"$f":"UnitsDetails46[[#This Row],[Rate]]*UnitsDetails46[[#This Row],[ODS AB109 Units]]","v":0},null,{"$f":"UnitsDetails46[[#This Row],[Rate]]*UnitsDetails46[[#This Row],[SUD Non-Billable Units]]","v":0},null,{"$f":"UnitsDetails46[[#This Row],[Rate]]*UnitsDetails46[[#This Row],[Room & Board Units]]","v":0},null,{"$f":"'[4]Final Recon - Summary'!G326","v":0},{"$f":"UnitsDetails46[[#This Row],[ODS DMC General Units]]+UnitsDetails46[[#This Row],[ODS General Units]]+UnitsDetails46[[#This Row],[ODS DMC AB109 Units]]+UnitsDetails46[[#This Row],[ODS AB109 Units]]+UnitsDetails46[[#This Row],[SUD Non-Billable Units]]+UnitsDetails46[[#This Row],[Room & Board Units]]","v":0},0]
[0,{"$f":"'[4]Final Recon - Summary'!B327","v":"Group - Physician Assistant"},{"$f":"'[4]Final Recon - Summary'!C327","v":"Per Billable Minute"},{"$f":"'[4]Final Recon - Summary'!D327","v":1.92},{"$f":"UnitsDetails46[[#This Row],[ODS DMC General Units]]+UnitsDetails46[[#This Row],[ODS General Units]]+UnitsDetails46[[#This Row],[ODS DMC AB109 Units]]+UnitsDetails46[[#This Row],[ODS AB109 Units]]+UnitsDetails46[[#This Row],[Room & Board Units]]+UnitsDetails46[[#This Row],[SUD Non-Billable Units]]","v":0},0,null,0,null,{"$f":"UnitsDetails46[[#This Row],[ODS General Units]]*UnitsDetails46[[#This Row],[Rate]]","v":0},null,{"$f":"UnitsDetails46[[#This Row],[Rate]]*UnitsDetails46[[#This Row],[ODS DMC AB109 Units]]","v":0},null,{"$f":"UnitsDetails46[[#This Row],[Rate]]*UnitsDetails46[[#This Row],[ODS AB109 Units]]","v":0},null,{"$f":"UnitsDetails46[[#This Row],[Rate]]*UnitsDetails46[[#This Row],[SUD Non-Billable Units]]","v":0},null,{"$f":"UnitsDetails46[[#This Row],[Rate]]*UnitsDetails46[[#This Row],[Room & Board Units]]","v":0},null,{"$f":"'[4]Final Recon - Summary'!G327","v":0},{"$f":"UnitsDetails46[[#This Row],[ODS DMC General Units]]+UnitsDetails46[[#This Row],[ODS General Units]]+UnitsDetails46[[#This Row],[ODS DMC AB109 Units]]+UnitsDetails46[[#This Row],[ODS AB109 Units]]+UnitsDetails46[[#This Row],[SUD Non-Billable Units]]+UnitsDetails46[[#This Row],[Room & Board Units]]","v":0},0]
[0,{"$f":"'[4]Final Recon - Summary'!B328","v":"Group - Psychologist/Pre-licensed Psychologist"},{"$f":"'[4]Final Recon - Summary'!C328","v":"Per Billable Minute"},{"$f":"'[4]Final Recon - Summary'!D328","v":1.73},{"$f":"UnitsDetails46[[#This Row],[ODS DMC General Units]]+UnitsDetails46[[#This Row],[ODS General Units]]+UnitsDetails46[[#This Row],[ODS DMC AB109 Units]]+UnitsDetails46[[#This Row],[ODS AB109 Units]]+UnitsDetails46[[#This Row],[Room & Board Units]]+UnitsDetails46[[#This Row],[SUD Non-Billable Units]]","v":0},0,null,0,null,{"$f":"UnitsDetails46[[#This Row],[ODS General Units]]*UnitsDetails46[[#This Row],[Rate]]","v":0},null,{"$f":"UnitsDetails46[[#This Row],[Rate]]*UnitsDetails46[[#This Row],[ODS DMC AB109 Units]]","v":0},null,{"$f":"UnitsDetails46[[#This Row],[Rate]]*UnitsDetails46[[#This Row],[ODS AB109 Units]]","v":0},null,{"$f":"UnitsDetails46[[#This Row],[Rate]]*UnitsDetails46[[#This Row],[SUD Non-Billable Units]]","v":0},null,{"$f":"UnitsDetails46[[#This Row],[Rate]]*UnitsDetails46[[#This Row],[Room & Board Units]]","v":0},null,{"$f":"'[4]Final Recon - Summary'!G328","v":0},{"$f":"UnitsDetails46[[#This Row],[ODS DMC General Units]]+UnitsDetails46[[#This Row],[ODS General Units]]+UnitsDetails46[[#This Row],[ODS DMC AB109 Units]]+UnitsDetails46[[#This Row],[ODS AB109 Units]]+UnitsDetails46[[#This Row],[SUD Non-Billable Units]]+UnitsDetails46[[#This Row],[Room & Board Units]]","v":0},0]
[0,{"$f":"'[4]Final Recon - Summary'!B329","v":"Group - Psychiatrist/ Contracted Psychiatrist/Licensed Physician (MD)"},{"$f":"'[4]Final Recon - Summary'!C329","v":"Per Billable Minute"},{"$f":"'[4]Final Recon - Summary'!D329","v":2.57},{"$f":"UnitsDetails46[[#This Row],[ODS DMC General Units]]+UnitsDetails46[[#This Row],[ODS General Units]]+UnitsDetails46[[#This Row],[ODS DMC AB109 Units]]+UnitsDetails46[[#This Row],[ODS AB109 Units]]+UnitsDetails46[[#This Row],[Room & Board Units]]+UnitsDetails46[[#This Row],[SUD Non-Billable Units]]","v":0},0,null,0,null,{"$f":"UnitsDetails46[[#This Row],[ODS General Units]]*UnitsDetails46[[#This Row],[Rate]]","v":0},null,{"$f":"UnitsDetails46[[#This Row],[Rate]]*UnitsDetails46[[#This Row],[ODS DMC AB109 Units]]","v":0},null,{"$f":"UnitsDetails46[[#This Row],[Rate]]*UnitsDetails46[[#This Row],[ODS AB109 Units]]","v":0},null,{"$f":"UnitsDetails46[[#This Row],[Rate]]*UnitsDetails46[[#This Row],[SUD Non-Billable Units]]","v":0},null,{"$f":"UnitsDetails46[[#This Row],[Rate]]*UnitsDetails46[[#This Row],[Room & Board Units]]","v":0},null,{"$f":"'[4]Final Recon - Summary'!G329","v":0},{"$f":"UnitsDetails46[[#This Row],[ODS DMC General Units]]+UnitsDetails46[[#This Row],[ODS General Units]]+UnitsDetails46[[#This Row],[ODS DMC AB109 Units]]+UnitsDetails46[[#This Row],[ODS AB109 Units]]+UnitsDetails46[[#This Row],[SUD Non-Billable Units]]+UnitsDetails46[[#This Row],[Room & Board Units]]","v":0},0]
[0,{"$f":"'[4]Final Recon - Summary'!B330","v":"Group - Registered Nurse (RN)"},{"$f":"'[4]Final Recon - Summary'!C330","v":"Per Billable Minute"},{"$f":"'[4]Final Recon - Summary'!D330","v":1.74},{"$f":"UnitsDetails46[[#This Row],[ODS DMC General Units]]+UnitsDetails46[[#This Row],[ODS General Units]]+UnitsDetails46[[#This Row],[ODS DMC AB109 Units]]+UnitsDetails46[[#This Row],[ODS AB109 Units]]+UnitsDetails46[[#This Row],[Room & Board Units]]+UnitsDetails46[[#This Row],[SUD Non-Billable Units]]","v":0},0,null,0,null,{"$f":"UnitsDetails46[[#This Row],[ODS General Units]]*UnitsDetails46[[#This Row],[Rate]]","v":0},null,{"$f":"UnitsDetails46[[#This Row],[Rate]]*UnitsDetails46[[#This Row],[ODS DMC AB109 Units]]","v":0},null,{"$f":"UnitsDetails46[[#This Row],[Rate]]*UnitsDetails46[[#This Row],[ODS AB109 Units]]","v":0},null,{"$f":"UnitsDetails46[[#This Row],[Rate]]*UnitsDetails46[[#This Row],[SUD Non-Billable Units]]","v":0},null,{"$f":"UnitsDetails46[[#This Row],[Rate]]*UnitsDetails46[[#This Row],[Room & Board Units]]","v":0},null,{"$f":"'[4]Final Recon - Summary'!G330","v":0},{"$f":"UnitsDetails46[[#This Row],[ODS DMC General Units]]+UnitsDetails46[[#This Row],[ODS General Units]]+UnitsDetails46[[#This Row],[ODS DMC AB109 Units]]+UnitsDetails46[[#This Row],[ODS AB109 Units]]+UnitsDetails46[[#This Row],[SUD Non-Billable Units]]+UnitsDetails46[[#This Row],[Room & Board Units]]","v":0},0]
[0,{"$f":"'[4]Final Recon - Summary'!B331","v":"Group - Registered Pharmacist"},{"$f":"'[4]Final Recon - Summary'!C331","v":"Per Billable Minute"},{"$f":"'[4]Final Recon - Summary'!D331","v":2.0499999999999998},{"$f":"UnitsDetails46[[#This Row],[ODS DMC General Units]]+UnitsDetails46[[#This Row],[ODS General Units]]+UnitsDetails46[[#This Row],[ODS DMC AB109 Units]]+UnitsDetails46[[#This Row],[ODS AB109 Units]]+UnitsDetails46[[#This Row],[Room & Board Units]]+UnitsDetails46[[#This Row],[SUD Non-Billable Units]]","v":0},0,null,0,null,{"$f":"UnitsDetails46[[#This Row],[ODS General Units]]*UnitsDetails46[[#This Row],[Rate]]","v":0},null,{"$f":"UnitsDetails46[[#This Row],[Rate]]*UnitsDetails46[[#This Row],[ODS DMC AB109 Units]]","v":0},null,{"$f":"UnitsDetails46[[#This Row],[Rate]]*UnitsDetails46[[#This Row],[ODS AB109 Units]]","v":0},null,{"$f":"UnitsDetails46[[#This Row],[Rate]]*UnitsDetails46[[#This Row],[SUD Non-Billable Units]]","v":0},null,{"$f":"UnitsDetails46[[#This Row],[Rate]]*UnitsDetails46[[#This Row],[Room & Board Units]]","v":0},null,{"$f":"'[4]Final Recon - Summary'!G331","v":0},{"$f":"UnitsDetails46[[#This Row],[ODS DMC General Units]]+UnitsDetails46[[#This Row],[ODS General Units]]+UnitsDetails46[[#This Row],[ODS DMC AB109 Units]]+UnitsDetails46[[#This Row],[ODS AB109 Units]]+UnitsDetails46[[#This Row],[SUD Non-Billable Units]]+UnitsDetails46[[#This Row],[Room & Board Units]]","v":0},0]
[0,{"$f":"'[4]Final Recon - Summary'!B332","v":"Group - Interpreter Services"},{"$f":"'[4]Final Recon - Summary'!C332","v":"Per Billable Minute"},{"$f":"'[4]Final Recon - Summary'!D332","v":0.49},{"$f":"UnitsDetails46[[#This Row],[ODS DMC General Units]]+UnitsDetails46[[#This Row],[ODS General Units]]+UnitsDetails46[[#This Row],[ODS DMC AB109 Units]]+UnitsDetails46[[#This Row],[ODS AB109 Units]]+UnitsDetails46[[#This Row],[Room & Board Units]]+UnitsDetails46[[#This Row],[SUD Non-Billable Units]]","v":0},0,null,0,null,{"$f":"UnitsDetails46[[#This Row],[ODS General Units]]*UnitsDetails46[[#This Row],[Rate]]","v":0},null,{"$f":"UnitsDetails46[[#This Row],[Rate]]*UnitsDetails46[[#This Row],[ODS DMC AB109 Units]]","v":0},null,{"$f":"UnitsDetails46[[#This Row],[Rate]]*UnitsDetails46[[#This Row],[ODS AB109 Units]]","v":0},null,{"$f":"UnitsDetails46[[#This Row],[Rate]]*UnitsDetails46[[#This Row],[SUD Non-Billable Units]]","v":0},null,{"$f":"UnitsDetails46[[#This Row],[Rate]]*UnitsDetails46[[#This Row],[Room & Board Units]]","v":0},null,{"$f":"'[4]Final Recon - Summary'!G332","v":0},{"$f":"UnitsDetails46[[#This Row],[ODS DMC General Units]]+UnitsDetails46[[#This Row],[ODS General Units]]+UnitsDetails46[[#This Row],[ODS DMC AB109 Units]]+UnitsDetails46[[#This Row],[ODS AB109 Units]]+UnitsDetails46[[#This Row],[SUD Non-Billable Units]]+UnitsDetails46[[#This Row],[Room & Board Units]]","v":0},0]
[0,{"$f":"'[4]Final Recon - Summary'!B333","v":"Bundled Rates"}]
[0,{"$f":"'[4]Final Recon - Summary'!B334","v":"Supported Employment"},{"$f":"'[4]Final Recon - Summary'!C334","v":"Bundled Full Month"},{"$f":"'[4]Final Recon - Summary'!D334","v":1209.1699999999998},{"$f":"UnitsDetails46[[#This Row],[ODS DMC General Units]]+UnitsDetails46[[#This Row],[ODS General Units]]+UnitsDetails46[[#This Row],[ODS DMC AB109 Units]]+UnitsDetails46[[#This Row],[ODS AB109 Units]]+UnitsDetails46[[#This Row],[Room & Board Units]]+UnitsDetails46[[#This Row],[SUD Non-Billable Units]]","v":0},{"$f":"+D284*E284","v":0},null,{"$f":"+D284*G284","v":0},null,{"$f":"UnitsDetails46[[#This Row],[ODS General Units]]*UnitsDetails46[[#This Row],[Rate]]","v":0},null,{"$f":"UnitsDetails46[[#This Row],[Rate]]*UnitsDetails46[[#This Row],[ODS DMC AB109 Units]]","v":0},null,{"$f":"UnitsDetails46[[#This Row],[Rate]]*UnitsDetails46[[#This Row],[ODS AB109 Units]]","v":0},null,{"$f":"UnitsDetails46[[#This Row],[Rate]]*UnitsDetails46[[#This Row],[SUD Non-Billable Units]]","v":0},null,{"$f":"UnitsDetails46[[#This Row],[Rate]]*UnitsDetails46[[#This Row],[Room & Board Units]]","v":0},null,{"$f":"'[4]Final Recon - Summary'!G334","v":0},{"$f":"UnitsDetails46[[#This Row],[ODS DMC General Units]]+UnitsDetails46[[#This Row],[ODS General Units]]+UnitsDetails46[[#This Row],[ODS DMC AB109 Units]]+UnitsDetails46[[#This Row],[ODS AB109 Units]]+UnitsDetails46[[#This Row],[SUD Non-Billable Units]]+UnitsDetails46[[#This Row],[Room & Board Units]]","v":0},{"$f":"T284-U284","v":0}]
[0,{"$f":"'[4]Final Recon - Summary'!B335","v":"Supported Employment"},{"$f":"'[4]Final Recon - Summary'!C335","v":"Bundled Partial Month"},{"$f":"'[4]Final Recon - Summary'!D335","v":604.58999999999992},{"$f":"UnitsDetails46[[#This Row],[ODS DMC General Units]]+UnitsDetails46[[#This Row],[ODS General Units]]+UnitsDetails46[[#This Row],[ODS DMC AB109 Units]]+UnitsDetails46[[#This Row],[ODS AB109 Units]]+UnitsDetails46[[#This Row],[Room & Board Units]]+UnitsDetails46[[#This Row],[SUD Non-Billable Units]]","v":0},{"$f":"+D285*E285","v":0},null,{"$f":"+D285*G285","v":0},null,{"$f":"UnitsDetails46[[#This Row],[ODS General Units]]*UnitsDetails46[[#This Row],[Rate]]","v":0},null,{"$f":"UnitsDetails46[[#This Row],[Rate]]*UnitsDetails46[[#This Row],[ODS DMC AB109 Units]]","v":0},null,{"$f":"UnitsDetails46[[#This Row],[Rate]]*UnitsDetails46[[#This Row],[ODS AB109 Units]]","v":0},null,{"$f":"UnitsDetails46[[#This Row],[Rate]]*UnitsDetails46[[#This Row],[SUD Non-Billable Units]]","v":0},null,{"$f":"UnitsDetails46[[#This Row],[Rate]]*UnitsDetails46[[#This Row],[Room & Board Units]]","v":0},null,{"$f":"'[4]Final Recon - Summary'!G335","v":0},{"$f":"UnitsDetails46[[#This Row],[ODS DMC General Units]]+UnitsDetails46[[#This Row],[ODS General Units]]+UnitsDetails46[[#This Row],[ODS DMC AB109 Units]]+UnitsDetails46[[#This Row],[ODS AB109 Units]]+UnitsDetails46[[#This Row],[SUD Non-Billable Units]]+UnitsDetails46[[#This Row],[Room & Board Units]]","v":0},{"$f":"T285-U285","v":0}]
[0]
[0]
[0]
[0]
[0]
[0]
[0]
[0]
[0]
[0,{"$f":"'[4]Final Recon - Summary'!B345","v":"Total"},null,null,{"$f":"UnitsDetails46[[#This Row],[ODS DMC General Units]]+UnitsDetails46[[#This Row],[ODS General Units]]+UnitsDetails46[[#This Row],[ODS DMC AB109 Units]]+UnitsDetails46[[#This Row],[ODS AB109 Units]]+UnitsDetails46[[#This Row],[Room & Board Units]]+UnitsDetails46[[#This Row],[SUD Non-Billable Units]]","v":0},{"$f":"SUM(F244:F294)","v":0},null,{"$f":"SUM(H244:H294)","v":0},null,{"$f":"SUM(J244:J294)","v":0},null,{"$f":"SUM(L244:L294)","v":0},null,{"$f":"SUM(N244:N294)","v":0},null,{"$f":"SUM(P244:P294)","v":0},null,{"$f":"SUM(R244:R294)","v":0}]
[]
["BEHAVIORAL HEALTH SERVICES"]
["Fical Year-End Units Details"]
[]
[null,"Contractor:",{"$f":"C239","v":0}]
[null,"Contract #:",{"$f":"C240","v":0}]
[null,"Program Name:",{"$f":"'[4]Final Recon - Summary'!C361","v":"Program 6"}]
[]
["Column1","Service Modalities","Unit","Rate","Final TUOS Units Reconciliation","Final Amount Reconciliation","ODS DMC General Units","ODS DMC General Amount","ODS General Units","ODS General Amount","ODS DMC AB109 Units","ODS DMC AB109 Amount","ODS AB109 Units","ODS AB109 Amount","SUD Non-Billable Units","SUD Non-Billable Amount","Room & Board Units","Room & Board Amount",null,"Total Units (Summary)","Total Units (Details)","Checkpoint"]
[{"$f":"$C$5","v":0},{"$f":"'[4]Final Recon - Summary'!B365","v":"Individual - Alcohol and Drug Counselor"},{"$f":"'[4]Final Recon - Summary'!C365","v":"Per Billable Minute"},{"$f":"'[4]Final Recon - Summary'!D365","v":4.4400000000000004},{"$f":"UnitsDetails47[[#This Row],[ODS DMC General Units]]+UnitsDetails47[[#This Row],[ODS General Units]]+UnitsDetails47[[#This Row],[ODS DMC AB109 Units]]+UnitsDetails47[[#This Row],[ODS AB109 Units]]+UnitsDetails47[[#This Row],[Room & Board Units]]+UnitsDetails47[[#This Row],[SUD Non-Billable Units]]","v":0},{"$f":"+D305*E305","v":0},null,{"$f":"+D305*G305","v":0},null,{"$f":"UnitsDetails47[[#This Row],[ODS General Units]]*UnitsDetails47[[#This Row],[Rate]]","v":0},null,{"$f":"UnitsDetails47[[#This Row],[Rate]]*UnitsDetails47[[#This Row],[ODS DMC AB109 Units]]","v":0},null,{"$f":"UnitsDetails47[[#This Row],[Rate]]*UnitsDetails47[[#This Row],[ODS AB109 Units]]","v":0},null,{"$f":"UnitsDetails47[[#This Row],[Rate]]*UnitsDetails47[[#This Row],[SUD Non-Billable Units]]","v":0},null,{"$f":"UnitsDetails47[[#This Row],[Rate]]*UnitsDetails47[[#This Row],[Room & Board Units]]","v":0},null,{"$f":"'[4]Final Recon - Summary'!G365","v":0},{"$f":"UnitsDetails47[[#This Row],[ODS DMC General Units]]+UnitsDetails47[[#This Row],[ODS General Units]]+UnitsDetails47[[#This Row],[ODS DMC AB109 Units]]+UnitsDetails47[[#This Row],[ODS AB109 Units]]+UnitsDetails47[[#This Row],[SUD Non-Billable Units]]+UnitsDetails47[[#This Row],[Room & Board Units]]","v":0},{"$f":"T305-U305","v":0}]
[0,{"$f":"'[4]Final Recon - Summary'!B366","v":"Individual - Clinical Nurse Specialist"},{"$f":"'[4]Final Recon - Summary'!C366","v":"Per Billable Minute"},{"$f":"'[4]Final Recon - Summary'!D366","v":10.23},{"$f":"UnitsDetails47[[#This Row],[ODS DMC General Units]]+UnitsDetails47[[#This Row],[ODS General Units]]+UnitsDetails47[[#This Row],[ODS DMC AB109 Units]]+UnitsDetails47[[#This Row],[ODS AB109 Units]]+UnitsDetails47[[#This Row],[Room & Board Units]]+UnitsDetails47[[#This Row],[SUD Non-Billable Units]]","v":0},0,null,0,null,{"$f":"UnitsDetails47[[#This Row],[ODS General Units]]*UnitsDetails47[[#This Row],[Rate]]","v":0},null,{"$f":"UnitsDetails47[[#This Row],[Rate]]*UnitsDetails47[[#This Row],[ODS DMC AB109 Units]]","v":0},null,{"$f":"UnitsDetails47[[#This Row],[Rate]]*UnitsDetails47[[#This Row],[ODS AB109 Units]]","v":0},null,{"$f":"UnitsDetails47[[#This Row],[Rate]]*UnitsDetails47[[#This Row],[SUD Non-Billable Units]]","v":0},null,{"$f":"UnitsDetails47[[#This Row],[Rate]]*UnitsDetails47[[#This Row],[Room & Board Units]]","v":0},null,{"$f":"'[4]Final Recon - Summary'!G366","v":0},{"$f":"UnitsDetails47[[#This Row],[ODS DMC General Units]]+UnitsDetails47[[#This Row],[ODS General Units]]+UnitsDetails47[[#This Row],[ODS DMC AB109 Units]]+UnitsDetails47[[#This Row],[ODS AB109 Units]]+UnitsDetails47[[#This Row],[SUD Non-Billable Units]]+UnitsDetails47[[#This Row],[Room & Board Units]]","v":0},0]
[0,{"$f":"'[4]Final Recon - Summary'!B367","v":"Individual - Community Health Worker"},{"$f":"'[4]Final Recon - Summary'!C367","v":"Per Billable Minute"},{"$f":"'[4]Final Recon - Summary'!D367","v":4.12},{"$f":"UnitsDetails47[[#This Row],[ODS DMC General Units]]+UnitsDetails47[[#This Row],[ODS General Units]]+UnitsDetails47[[#This Row],[ODS DMC AB109 Units]]+UnitsDetails47[[#This Row],[ODS AB109 Units]]+UnitsDetails47[[#This Row],[Room & Board Units]]+UnitsDetails47[[#This Row],[SUD Non-Billable Units]]","v":0},0,null,0,null,{"$f":"UnitsDetails47[[#This Row],[ODS General Units]]*UnitsDetails47[[#This Row],[Rate]]","v":0},null,{"$f":"UnitsDetails47[[#This Row],[Rate]]*UnitsDetails47[[#This Row],[ODS DMC AB109 Units]]","v":0},null,{"$f":"UnitsDetails47[[#This Row],[Rate]]*UnitsDetails47[[#This Row],[ODS AB109 Units]]","v":0},null,{"$f":"UnitsDetails47[[#This Row],[Rate]]*UnitsDetails47[[#This Row],[SUD Non-Billable Units]]","v":0},null,{"$f":"UnitsDetails47[[#This Row],[Rate]]*UnitsDetails47[[#This Row],[Room & Board Units]]","v":0},null,{"$f":"'[4]Final Recon - Summary'!G367","v":0},{"$f":"UnitsDetails47[[#This Row],[ODS DMC General Units]]+UnitsDetails47[[#This Row],[ODS General Units]]+UnitsDetails47[[#This Row],[ODS DMC AB109 Units]]+UnitsDetails47[[#This Row],[ODS AB109 Units]]+UnitsDetails47[[#This Row],[SUD Non-Billable Units]]+UnitsDetails47[[#This Row],[Room & Board Units]]","v":0},0]
[0,{"$f":"'[4]Final Recon - Summary'!B368","v":"Individual - Licensed Psychiatric Technician"},{"$f":"'[4]Final Recon - Summary'!C368","v":"Per Billable Minute"},{"$f":"'[4]Final Recon - Summary'!D368","v":3.76},{"$f":"UnitsDetails47[[#This Row],[ODS DMC General Units]]+UnitsDetails47[[#This Row],[ODS General Units]]+UnitsDetails47[[#This Row],[ODS DMC AB109 Units]]+UnitsDetails47[[#This Row],[ODS AB109 Units]]+UnitsDetails47[[#This Row],[Room & Board Units]]+UnitsDetails47[[#This Row],[SUD Non-Billable Units]]","v":0},0,null,0,null,{"$f":"UnitsDetails47[[#This Row],[ODS General Units]]*UnitsDetails47[[#This Row],[Rate]]","v":0},null,{"$f":"UnitsDetails47[[#This Row],[Rate]]*UnitsDetails47[[#This Row],[ODS DMC AB109 Units]]","v":0},null,{"$f":"UnitsDetails47[[#This Row],[Rate]]*UnitsDetails47[[#This Row],[ODS AB109 Units]]","v":0},null,{"$f":"UnitsDetails47[[#This Row],[Rate]]*UnitsDetails47[[#This Row],[SUD Non-Billable Units]]","v":0},null,{"$f":"UnitsDetails47[[#This Row],[Rate]]*UnitsDetails47[[#This Row],[Room & Board Units]]","v":0},null,{"$f":"'[4]Final Recon - Summary'!G368","v":0},{"$f":"UnitsDetails47[[#This Row],[ODS DMC General Units]]+UnitsDetails47[[#This Row],[ODS General Units]]+UnitsDetails47[[#This Row],[ODS DMC AB109 Units]]+UnitsDetails47[[#This Row],[ODS AB109 Units]]+UnitsDetails47[[#This Row],[SUD Non-Billable Units]]+UnitsDetails47[[#This Row],[Room & Board Units]]","v":0},0]
[0,{"$f":"'[4]Final Recon - Summary'!B369","v":"Individual - LPHA (MFT  LCSW  LPCC)/Intern or Waivered LPHA (MFT  LCSW  LPCC)"},{"$f":"'[4]Final Recon - Summary'!C369","v":"Per Billable Minute"},{"$f":"'[4]Final Recon - Summary'!D369","v":5.35},{"$f":"UnitsDetails47[[#This Row],[ODS DMC General Units]]+UnitsDetails47[[#This Row],[ODS General Units]]+UnitsDetails47[[#This Row],[ODS DMC AB109 Units]]+UnitsDetails47[[#This Row],[ODS AB109 Units]]+UnitsDetails47[[#This Row],[Room & Board Units]]+UnitsDetails47[[#This Row],[SUD Non-Billable Units]]","v":0},0,null,0,null,{"$f":"UnitsDetails47[[#This Row],[ODS General Units]]*UnitsDetails47[[#This Row],[Rate]]","v":0},null,{"$f":"UnitsDetails47[[#This Row],[Rate]]*UnitsDetails47[[#This Row],[ODS DMC AB109 Units]]","v":0},null,{"$f":"UnitsDetails47[[#This Row],[Rate]]*UnitsDetails47[[#This Row],[ODS AB109 Units]]","v":0},null,{"$f":"UnitsDetails47[[#This Row],[Rate]]*UnitsDetails47[[#This Row],[SUD Non-Billable Units]]","v":0},null,{"$f":"UnitsDetails47[[#This Row],[Rate]]*UnitsDetails47[[#This Row],[Room & Board Units]]","v":0},null,{"$f":"'[4]Final Recon - Summary'!G369","v":0},{"$f":"UnitsDetails47[[#This Row],[ODS DMC General Units]]+UnitsDetails47[[#This Row],[ODS General Units]]+UnitsDetails47[[#This Row],[ODS DMC AB109 Units]]+UnitsDetails47[[#This Row],[ODS AB109 Units]]+UnitsDetails47[[#This Row],[SUD Non-Billable Units]]+UnitsDetails47[[#This Row],[Room & Board Units]]","v":0},0]
[0,{"$f":"'[4]Final Recon - Summary'!B370","v":"Individual - Licensed Vocational Nurse (LVN)"},{"$f":"'[4]Final Recon - Summary'!C370","v":"Per Billable Minute"},{"$f":"'[4]Final Recon - Summary'!D370","v":4.3800000000000008},{"$f":"UnitsDetails47[[#This Row],[ODS DMC General Units]]+UnitsDetails47[[#This Row],[ODS General Units]]+UnitsDetails47[[#This Row],[ODS DMC AB109 Units]]+UnitsDetails47[[#This Row],[ODS AB109 Units]]+UnitsDetails47[[#This Row],[Room & Board Units]]+UnitsDetails47[[#This Row],[SUD Non-Billable Units]]","v":0},0,null,0,null,{"$f":"UnitsDetails47[[#This Row],[ODS General Units]]*UnitsDetails47[[#This Row],[Rate]]","v":0},null,{"$f":"UnitsDetails47[[#This Row],[Rate]]*UnitsDetails47[[#This Row],[ODS DMC AB109 Units]]","v":0},null,{"$f":"UnitsDetails47[[#This Row],[Rate]]*UnitsDetails47[[#This Row],[ODS AB109 Units]]","v":0},null,{"$f":"UnitsDetails47[[#This Row],[Rate]]*UnitsDetails47[[#This Row],[SUD Non-Billable Units]]","v":0},null,{"$f":"UnitsDetails47[[#This Row],[Rate]]*UnitsDetails47[[#This Row],[Room & Board Units]]","v":0},null,{"$f":"'[4]Final Recon - Summary'!G370","v":0},{"$f":"UnitsDetails47[[#This Row],[ODS DMC General Units]]+UnitsDetails47[[#This Row],[ODS General Units]]+UnitsDetails47[[#This Row],[ODS DMC AB109 Units]]+UnitsDetails47[[#This Row],[ODS AB109 Units]]+UnitsDetails47[[#This Row],[SUD Non-Billable Units]]+UnitsDetails47[[#This Row],[Room & Board Units]]","v":0},0]
[0,{"$f":"'[4]Final Recon - Summary'!B371","v":"Individual - Medical Assistant"},{"$f":"'[4]Final Recon - Summary'!C371","v":"Per Billable Minute"},{"$f":"'[4]Final Recon - Summary'!D371","v":3.02},{"$f":"UnitsDetails47[[#This Row],[ODS DMC General Units]]+UnitsDetails47[[#This Row],[ODS General Units]]+UnitsDetails47[[#This Row],[ODS DMC AB109 Units]]+UnitsDetails47[[#This Row],[ODS AB109 Units]]+UnitsDetails47[[#This Row],[Room & Board Units]]+UnitsDetails47[[#This Row],[SUD Non-Billable Units]]","v":0},0,null,0,null,{"$f":"UnitsDetails47[[#This Row],[ODS General Units]]*UnitsDetails47[[#This Row],[Rate]]","v":0},null,{"$f":"UnitsDetails47[[#This Row],[Rate]]*UnitsDetails47[[#This Row],[ODS DMC AB109 Units]]","v":0},null,{"$f":"UnitsDetails47[[#This Row],[Rate]]*UnitsDetails47[[#This Row],[ODS AB109 Units]]","v":0},null,{"$f":"UnitsDetails47[[#This Row],[Rate]]*UnitsDetails47[[#This Row],[SUD Non-Billable Units]]","v":0},null,{"$f":"UnitsDetails47[[#This Row],[Rate]]*UnitsDetails47[[#This Row],[Room & Board Units]]","v":0},null,{"$f":"'[4]Final Recon - Summary'!G371","v":0},{"$f":"UnitsDetails47[[#This Row],[ODS DMC General Units]]+UnitsDetails47[[#This Row],[ODS General Units]]+UnitsDetails47[[#This Row],[ODS DMC AB109 Units]]+UnitsDetails47[[#This Row],[ODS AB109 Units]]+UnitsDetails47[[#This Row],[SUD Non-Billable Units]]+UnitsDetails47[[#This Row],[Room & Board Units]]","v":0},0]
[0,{"$f":"'[4]Final Recon - Summary'!B372","v":"Individual - Mental Health Rehabilitation Specialist"},{"$f":"'[4]Final Recon - Summary'!C372","v":"Per Billable Minute"},{"$f":"'[4]Final Recon - Summary'!D372","v":4.0199999999999996},{"$f":"UnitsDetails47[[#This Row],[ODS DMC General Units]]+UnitsDetails47[[#This Row],[ODS General Units]]+UnitsDetails47[[#This Row],[ODS DMC AB109 Units]]+UnitsDetails47[[#This Row],[ODS AB109 Units]]+UnitsDetails47[[#This Row],[Room & Board Units]]+UnitsDetails47[[#This Row],[SUD Non-Billable Units]]","v":0},0,null,0,null,{"$f":"UnitsDetails47[[#This Row],[ODS General Units]]*UnitsDetails47[[#This Row],[Rate]]","v":0},null,{"$f":"UnitsDetails47[[#This Row],[Rate]]*UnitsDetails47[[#This Row],[ODS DMC AB109 Units]]","v":0},null,{"$f":"UnitsDetails47[[#This Row],[Rate]]*UnitsDetails47[[#This Row],[ODS AB109 Units]]","v":0},null,{"$f":"UnitsDetails47[[#This Row],[Rate]]*UnitsDetails47[[#This Row],[SUD Non-Billable Units]]","v":0},null,{"$f":"UnitsDetails47[[#This Row],[Rate]]*UnitsDetails47[[#This Row],[Room & Board Units]]","v":0},null,{"$f":"'[4]Final Recon - Summary'!G372","v":0},{"$f":"UnitsDetails47[[#This Row],[ODS DMC General Units]]+UnitsDetails47[[#This Row],[ODS General Units]]+UnitsDetails47[[#This Row],[ODS DMC AB109 Units]]+UnitsDetails47[[#This Row],[ODS AB109 Units]]+UnitsDetails47[[#This Row],[SUD Non-Billable Units]]+UnitsDetails47[[#This Row],[Room & Board Units]]","v":0},0]
[0,{"$f":"'[4]Final Recon - Summary'!B373","v":"Individual - Nurse Practitioner"},{"$f":"'[4]Final Recon - Summary'!C373","v":"Per Billable Minute"},{"$f":"'[4]Final Recon - Summary'!D373","v":10.23},{"$f":"UnitsDetails47[[#This Row],[ODS DMC General Units]]+UnitsDetails47[[#This Row],[ODS General Units]]+UnitsDetails47[[#This Row],[ODS DMC AB109 Units]]+UnitsDetails47[[#This Row],[ODS AB109 Units]]+UnitsDetails47[[#This Row],[Room & Board Units]]+UnitsDetails47[[#This Row],[SUD Non-Billable Units]]","v":0},0,null,0,null,{"$f":"UnitsDetails47[[#This Row],[ODS General Units]]*UnitsDetails47[[#This Row],[Rate]]","v":0},null,{"$f":"UnitsDetails47[[#This Row],[Rate]]*UnitsDetails47[[#This Row],[ODS DMC AB109 Units]]","v":0},null,{"$f":"UnitsDetails47[[#This Row],[Rate]]*UnitsDetails47[[#This Row],[ODS AB109 Units]]","v":0},null,{"$f":"UnitsDetails47[[#This Row],[Rate]]*UnitsDetails47[[#This Row],[SUD Non-Billable Units]]","v":0},null,{"$f":"UnitsDetails47[[#This Row],[Rate]]*UnitsDetails47[[#This Row],[Room & Board Units]]","v":0},null,{"$f":"'[4]Final Recon - Summary'!G373","v":0},{"$f":"UnitsDetails47[[#This Row],[ODS DMC General Units]]+UnitsDetails47[[#This Row],[ODS General Units]]+UnitsDetails47[[#This Row],[ODS DMC AB109 Units]]+UnitsDetails47[[#This Row],[ODS AB109 Units]]+UnitsDetails47[[#This Row],[SUD Non-Billable Units]]+UnitsDetails47[[#This Row],[Room & Board Units]]","v":0},0]
[0,{"$f":"'[4]Final Recon - Summary'!B374","v":"Individual - Occupational Therapist"},{"$f":"'[4]Final Recon - Summary'!C374","v":"Per Billable Minute"},{"$f":"'[4]Final Recon - Summary'!D374","v":7.13},{"$f":"UnitsDetails47[[#This Row],[ODS DMC General Units]]+UnitsDetails47[[#This Row],[ODS General Units]]+UnitsDetails47[[#This Row],[ODS DMC AB109 Units]]+UnitsDetails47[[#This Row],[ODS AB109 Units]]+UnitsDetails47[[#This Row],[Room & Board Units]]+UnitsDetails47[[#This Row],[SUD Non-Billable Units]]","v":0},0,null,0,null,{"$f":"UnitsDetails47[[#This Row],[ODS General Units]]*UnitsDetails47[[#This Row],[Rate]]","v":0},null,{"$f":"UnitsDetails47[[#This Row],[Rate]]*UnitsDetails47[[#This Row],[ODS DMC AB109 Units]]","v":0},null,{"$f":"UnitsDetails47[[#This Row],[Rate]]*UnitsDetails47[[#This Row],[ODS AB109 Units]]","v":0},null,{"$f":"UnitsDetails47[[#This Row],[Rate]]*UnitsDetails47[[#This Row],[SUD Non-Billable Units]]","v":0},null,{"$f":"UnitsDetails47[[#This Row],[Rate]]*UnitsDetails47[[#This Row],[Room & Board Units]]","v":0},null,{"$f":"'[4]Final Recon - Summary'!G374","v":0},{"$f":"UnitsDetails47[[#This Row],[ODS DMC General Units]]+UnitsDetails47[[#This Row],[ODS General Units]]+UnitsDetails47[[#This Row],[ODS DMC AB109 Units]]+UnitsDetails47[[#This Row],[ODS AB109 Units]]+UnitsDetails47[[#This Row],[SUD Non-Billable Units]]+UnitsDetails47[[#This Row],[Room & Board Units]]","v":0},0]
[0,{"$f":"'[4]Final Recon - Summary'!B375","v":"Individual - Other Qualified Providers - Other Designated MH staff that bill medical"},{"$f":"'[4]Final Recon - Summary'!C375","v":"Per Billable Minute"},{"$f":"'[4]Final Recon - Summary'!D375","v":4.0199999999999996},{"$f":"UnitsDetails47[[#This Row],[ODS DMC General Units]]+UnitsDetails47[[#This Row],[ODS General Units]]+UnitsDetails47[[#This Row],[ODS DMC AB109 Units]]+UnitsDetails47[[#This Row],[ODS AB109 Units]]+UnitsDetails47[[#This Row],[Room & Board Units]]+UnitsDetails47[[#This Row],[SUD Non-Billable Units]]","v":0},0,null,0,null,{"$f":"UnitsDetails47[[#This Row],[ODS General Units]]*UnitsDetails47[[#This Row],[Rate]]","v":0},null,{"$f":"UnitsDetails47[[#This Row],[Rate]]*UnitsDetails47[[#This Row],[ODS DMC AB109 Units]]","v":0},null,{"$f":"UnitsDetails47[[#This Row],[Rate]]*UnitsDetails47[[#This Row],[ODS AB109 Units]]","v":0},null,{"$f":"UnitsDetails47[[#This Row],[Rate]]*UnitsDetails47[[#This Row],[SUD Non-Billable Units]]","v":0},null,{"$f":"UnitsDetails47[[#This Row],[Rate]]*UnitsDetails47[[#This Row],[Room & Board Units]]","v":0},null,{"$f":"'[4]Final Recon - Summary'!G375","v":0},{"$f":"UnitsDetails47[[#This Row],[ODS DMC General Units]]+UnitsDetails47[[#This Row],[ODS General Units]]+UnitsDetails47[[#This Row],[ODS DMC AB109 Units]]+UnitsDetails47[[#This Row],[ODS AB109 Units]]+UnitsDetails47[[#This Row],[SUD Non-Billable Units]]+UnitsDetails47[[#This Row],[Room & Board Units]]","v":0},0]
[0,{"$f":"'[4]Final Recon - Summary'!B376","v":"Individual - Peer Support Specialist"},{"$f":"'[4]Final Recon - Summary'!C376","v":"Per Billable Minute"},{"$f":"'[4]Final Recon - Summary'!D376","v":4.22},{"$f":"UnitsDetails47[[#This Row],[ODS DMC General Units]]+UnitsDetails47[[#This Row],[ODS General Units]]+UnitsDetails47[[#This Row],[ODS DMC AB109 Units]]+UnitsDetails47[[#This Row],[ODS AB109 Units]]+UnitsDetails47[[#This Row],[Room & Board Units]]+UnitsDetails47[[#This Row],[SUD Non-Billable Units]]","v":0},0,null,0,null,{"$f":"UnitsDetails47[[#This Row],[ODS General Units]]*UnitsDetails47[[#This Row],[Rate]]","v":0},null,{"$f":"UnitsDetails47[[#This Row],[Rate]]*UnitsDetails47[[#This Row],[ODS DMC AB109 Units]]","v":0},null,{"$f":"UnitsDetails47[[#This Row],[Rate]]*UnitsDetails47[[#This Row],[ODS AB109 Units]]","v":0},null,{"$f":"UnitsDetails47[[#This Row],[Rate]]*UnitsDetails47[[#This Row],[SUD Non-Billable Units]]","v":0},null,{"$f":"UnitsDetails47[[#This Row],[Rate]]*UnitsDetails47[[#This Row],[Room & Board Units]]","v":0},null,{"$f":"'[4]Final Recon - Summary'!G376","v":0},{"$f":"UnitsDetails47[[#This Row],[ODS DMC General Units]]+UnitsDetails47[[#This Row],[ODS General Units]]+UnitsDetails47[[#This Row],[ODS DMC AB109 Units]]+UnitsDetails47[[#This Row],[ODS AB109 Units]]+UnitsDetails47[[#This Row],[SUD Non-Billable Units]]+UnitsDetails47[[#This Row],[Room & Board Units]]","v":0},0]
[0,{"$f":"'[4]Final Recon - Summary'!B377","v":"Individual - Physician Assistant"},{"$f":"'[4]Final Recon - Summary'!C377","v":"Per Billable Minute"},{"$f":"'[4]Final Recon - Summary'!D377","v":9.23},{"$f":"UnitsDetails47[[#This Row],[ODS DMC General Units]]+UnitsDetails47[[#This Row],[ODS General Units]]+UnitsDetails47[[#This Row],[ODS DMC AB109 Units]]+UnitsDetails47[[#This Row],[ODS AB109 Units]]+UnitsDetails47[[#This Row],[Room & Board Units]]+UnitsDetails47[[#This Row],[SUD Non-Billable Units]]","v":0},0,null,0,null,{"$f":"UnitsDetails47[[#This Row],[ODS General Units]]*UnitsDetails47[[#This Row],[Rate]]","v":0},null,{"$f":"UnitsDetails47[[#This Row],[Rate]]*UnitsDetails47[[#This Row],[ODS DMC AB109 Units]]","v":0},null,{"$f":"UnitsDetails47[[#This Row],[Rate]]*UnitsDetails47[[#This Row],[ODS AB109 Units]]","v":0},null,{"$f":"UnitsDetails47[[#This Row],[Rate]]*UnitsDetails47[[#This Row],[SUD Non-Billable Units]]","v":0},null,{"$f":"UnitsDetails47[[#This Row],[Rate]]*UnitsDetails47[[#This Row],[Room & Board Units]]","v":0},null,{"$f":"'[4]Final Recon - Summary'!G377","v":0},{"$f":"UnitsDetails47[[#This Row],[ODS DMC General Units]]+UnitsDetails47[[#This Row],[ODS General Units]]+UnitsDetails47[[#This Row],[ODS DMC AB109 Units]]+UnitsDetails47[[#This Row],[ODS AB109 Units]]+UnitsDetails47[[#This Row],[SUD Non-Billable Units]]+UnitsDetails47[[#This Row],[Room & Board Units]]","v":0},0]
[0,{"$f":"'[4]Final Recon - Summary'!B378","v":"Individual - Psychologist/Pre-licensed Psychologist"},{"$f":"'[4]Final Recon - Summary'!C378","v":"Per Billable Minute"},{"$f":"'[4]Final Recon - Summary'!D378","v":8.2799999999999994},{"$f":"UnitsDetails47[[#This Row],[ODS DMC General Units]]+UnitsDetails47[[#This Row],[ODS General Units]]+UnitsDetails47[[#This Row],[ODS DMC AB109 Units]]+UnitsDetails47[[#This Row],[ODS AB109 Units]]+UnitsDetails47[[#This Row],[Room & Board Units]]+UnitsDetails47[[#This Row],[SUD Non-Billable Units]]","v":0},0,null,0,null,{"$f":"UnitsDetails47[[#This Row],[ODS General Units]]*UnitsDetails47[[#This Row],[Rate]]","v":0},null,{"$f":"UnitsDetails47[[#This Row],[Rate]]*UnitsDetails47[[#This Row],[ODS DMC AB109 Units]]","v":0},null,{"$f":"UnitsDetails47[[#This Row],[Rate]]*UnitsDetails47[[#This Row],[ODS AB109 Units]]","v":0},null,{"$f":"UnitsDetails47[[#This Row],[Rate]]*UnitsDetails47[[#This Row],[SUD Non-Billable Units]]","v":0},null,{"$f":"UnitsDetails47[[#This Row],[Rate]]*UnitsDetails47[[#This Row],[Room & Board Units]]","v":0},null,{"$f":"'[4]Final Recon - Summary'!G378","v":0},{"$f":"UnitsDetails47[[#This Row],[ODS DMC General Units]]+UnitsDetails47[[#This Row],[ODS General Units]]+UnitsDetails47[[#This Row],[ODS DMC AB109 Units]]+UnitsDetails47[[#This Row],[ODS AB109 Units]]+UnitsDetails47[[#This Row],[SUD Non-Billable Units]]+UnitsDetails47[[#This Row],[Room & Board Units]]","v":0},0]
[0,{"$f":"'[4]Final Recon - Summary'!B379","v":"Individual - Psychiatrist/ Contracted Psychiatrist/Licensed Physician (MD)"},{"$f":"'[4]Final Recon - Summary'!C379","v":"Per Billable Minute"},{"$f":"'[4]Final Recon - Summary'!D379","v":11.57},{"$f":"UnitsDetails47[[#This Row],[ODS DMC General Units]]+UnitsDetails47[[#This Row],[ODS General Units]]+UnitsDetails47[[#This Row],[ODS DMC AB109 Units]]+UnitsDetails47[[#This Row],[ODS AB109 Units]]+UnitsDetails47[[#This Row],[Room & Board Units]]+UnitsDetails47[[#This Row],[SUD Non-Billable Units]]","v":0},0,null,0,null,{"$f":"UnitsDetails47[[#This Row],[ODS General Units]]*UnitsDetails47[[#This Row],[Rate]]","v":0},null,{"$f":"UnitsDetails47[[#This Row],[Rate]]*UnitsDetails47[[#This Row],[ODS DMC AB109 Units]]","v":0},null,{"$f":"UnitsDetails47[[#This Row],[Rate]]*UnitsDetails47[[#This Row],[ODS AB109 Units]]","v":0},null,{"$f":"UnitsDetails47[[#This Row],[Rate]]*UnitsDetails47[[#This Row],[SUD Non-Billable Units]]","v":0},null,{"$f":"UnitsDetails47[[#This Row],[Rate]]*UnitsDetails47[[#This Row],[Room & Board Units]]","v":0},null,{"$f":"'[4]Final Recon - Summary'!G379","v":0},{"$f":"UnitsDetails47[[#This Row],[ODS DMC General Units]]+UnitsDetails47[[#This Row],[ODS General Units]]+UnitsDetails47[[#This Row],[ODS DMC AB109 Units]]+UnitsDetails47[[#This Row],[ODS AB109 Units]]+UnitsDetails47[[#This Row],[SUD Non-Billable Units]]+UnitsDetails47[[#This Row],[Room & Board Units]]","v":0},0]
[0,{"$f":"'[4]Final Recon - Summary'!B380","v":"Individual - Registered Nurse (RN)"},{"$f":"'[4]Final Recon - Summary'!C380","v":"Per Billable Minute"},{"$f":"'[4]Final Recon - Summary'!D380","v":8.36},{"$f":"UnitsDetails47[[#This Row],[ODS DMC General Units]]+UnitsDetails47[[#This Row],[ODS General Units]]+UnitsDetails47[[#This Row],[ODS DMC AB109 Units]]+UnitsDetails47[[#This Row],[ODS AB109 Units]]+UnitsDetails47[[#This Row],[Room & Board Units]]+UnitsDetails47[[#This Row],[SUD Non-Billable Units]]","v":0},0,null,0,null,{"$f":"UnitsDetails47[[#This Row],[ODS General Units]]*UnitsDetails47[[#This Row],[Rate]]","v":0},null,{"$f":"UnitsDetails47[[#This Row],[Rate]]*UnitsDetails47[[#This Row],[ODS DMC AB109 Units]]","v":0},null,{"$f":"UnitsDetails47[[#This Row],[Rate]]*UnitsDetails47[[#This Row],[ODS AB109 Units]]","v":0},null,{"$f":"UnitsDetails47[[#This Row],[Rate]]*UnitsDetails47[[#This Row],[SUD Non-Billable Units]]","v":0},null,{"$f":"UnitsDetails47[[#This Row],[Rate]]*UnitsDetails47[[#This Row],[Room & Board Units]]","v":0},null,{"$f":"'[4]Final Recon - Summary'!G380","v":0},{"$f":"UnitsDetails47[[#This Row],[ODS DMC General Units]]+UnitsDetails47[[#This Row],[ODS General Units]]+UnitsDetails47[[#This Row],[ODS DMC AB109 Units]]+UnitsDetails47[[#This Row],[ODS AB109 Units]]+UnitsDetails47[[#This Row],[SUD Non-Billable Units]]+UnitsDetails47[[#This Row],[Room & Board Units]]","v":0},0]
[0,{"$f":"'[4]Final Recon - Summary'!B381","v":"Individual - Registered Pharmacist"},{"$f":"'[4]Final Recon - Summary'!C381","v":"Per Billable Minute"},{"$f":"'[4]Final Recon - Summary'!D381","v":9.84},{"$f":"UnitsDetails47[[#This Row],[ODS DMC General Units]]+UnitsDetails47[[#This Row],[ODS General Units]]+UnitsDetails47[[#This Row],[ODS DMC AB109 Units]]+UnitsDetails47[[#This Row],[ODS AB109 Units]]+UnitsDetails47[[#This Row],[Room & Board Units]]+UnitsDetails47[[#This Row],[SUD Non-Billable Units]]","v":0},0,null,0,null,{"$f":"UnitsDetails47[[#This Row],[ODS General Units]]*UnitsDetails47[[#This Row],[Rate]]","v":0},null,{"$f":"UnitsDetails47[[#This Row],[Rate]]*UnitsDetails47[[#This Row],[ODS DMC AB109 Units]]","v":0},null,{"$f":"UnitsDetails47[[#This Row],[Rate]]*UnitsDetails47[[#This Row],[ODS AB109 Units]]","v":0},null,{"$f":"UnitsDetails47[[#This Row],[Rate]]*UnitsDetails47[[#This Row],[SUD Non-Billable Units]]","v":0},null,{"$f":"UnitsDetails47[[#This Row],[Rate]]*UnitsDetails47[[#This Row],[Room & Board Units]]","v":0},null,{"$f":"'[4]Final Recon - Summary'!G381","v":0},{"$f":"UnitsDetails47[[#This Row],[ODS DMC General Units]]+UnitsDetails47[[#This Row],[ODS General Units]]+UnitsDetails47[[#This Row],[ODS DMC AB109 Units]]+UnitsDetails47[[#This Row],[ODS AB109 Units]]+UnitsDetails47[[#This Row],[SUD Non-Billable Units]]+UnitsDetails47[[#This Row],[Room & Board Units]]","v":0},0]
[0,{"$f":"'[4]Final Recon - Summary'!B382","v":"Individual - Interpreter Services"},{"$f":"'[4]Final Recon - Summary'!C382","v":"Per Billable Minute"},{"$f":"'[4]Final Recon - Summary'!D382","v":2.19},{"$f":"UnitsDetails47[[#This Row],[ODS DMC General Units]]+UnitsDetails47[[#This Row],[ODS General Units]]+UnitsDetails47[[#This Row],[ODS DMC AB109 Units]]+UnitsDetails47[[#This Row],[ODS AB109 Units]]+UnitsDetails47[[#This Row],[Room & Board Units]]+UnitsDetails47[[#This Row],[SUD Non-Billable Units]]","v":0},0,null,0,null,{"$f":"UnitsDetails47[[#This Row],[ODS General Units]]*UnitsDetails47[[#This Row],[Rate]]","v":0},null,{"$f":"UnitsDetails47[[#This Row],[Rate]]*UnitsDetails47[[#This Row],[ODS DMC AB109 Units]]","v":0},null,{"$f":"UnitsDetails47[[#This Row],[Rate]]*UnitsDetails47[[#This Row],[ODS AB109 Units]]","v":0},null,{"$f":"UnitsDetails47[[#This Row],[Rate]]*UnitsDetails47[[#This Row],[SUD Non-Billable Units]]","v":0},null,{"$f":"UnitsDetails47[[#This Row],[Rate]]*UnitsDetails47[[#This Row],[Room & Board Units]]","v":0},null,{"$f":"'[4]Final Recon - Summary'!G382","v":0},{"$f":"UnitsDetails47[[#This Row],[ODS DMC General Units]]+UnitsDetails47[[#This Row],[ODS General Units]]+UnitsDetails47[[#This Row],[ODS DMC AB109 Units]]+UnitsDetails47[[#This Row],[ODS AB109 Units]]+UnitsDetails47[[#This Row],[SUD Non-Billable Units]]+UnitsDetails47[[#This Row],[Room & Board Units]]","v":0},0]
[0,{"$f":"'[4]Final Recon - Summary'!B383","v":"Interactive Complexity"},{"$f":"'[4]Final Recon - Summary'!C383","v":"Per Occurrence"},{"$f":"'[4]Final Recon - Summary'!D383","v":14.61},{"$f":"UnitsDetails47[[#This Row],[ODS DMC General Units]]+UnitsDetails47[[#This Row],[ODS General Units]]+UnitsDetails47[[#This Row],[ODS DMC AB109 Units]]+UnitsDetails47[[#This Row],[ODS AB109 Units]]+UnitsDetails47[[#This Row],[Room & Board Units]]+UnitsDetails47[[#This Row],[SUD Non-Billable Units]]","v":0},0,null,0,null,{"$f":"UnitsDetails47[[#This Row],[ODS General Units]]*UnitsDetails47[[#This Row],[Rate]]","v":0},null,{"$f":"UnitsDetails47[[#This Row],[Rate]]*UnitsDetails47[[#This Row],[ODS DMC AB109 Units]]","v":0},null,{"$f":"UnitsDetails47[[#This Row],[Rate]]*UnitsDetails47[[#This Row],[ODS AB109 Units]]","v":0},null,{"$f":"UnitsDetails47[[#This Row],[Rate]]*UnitsDetails47[[#This Row],[SUD Non-Billable Units]]","v":0},null,{"$f":"UnitsDetails47[[#This Row],[Rate]]*UnitsDetails47[[#This Row],[Room & Board Units]]","v":0},null,{"$f":"'[4]Final Recon - Summary'!G383","v":0},{"$f":"UnitsDetails47[[#This Row],[ODS DMC General Units]]+UnitsDetails47[[#This Row],[ODS General Units]]+UnitsDetails47[[#This Row],[ODS DMC AB109 Units]]+UnitsDetails47[[#This Row],[ODS AB109 Units]]+UnitsDetails47[[#This Row],[SUD Non-Billable Units]]+UnitsDetails47[[#This Row],[Room & Board Units]]","v":0},0]
[0,{"$f":"'[4]Final Recon - Summary'!B384","v":"Parent-Child Interaction Therapy (PCIT Modifier 22)"},{"$f":"'[4]Final Recon - Summary'!C384","v":"Per Occurrence"},{"$f":"'[4]Final Recon - Summary'!D384","v":2.56},{"$f":"UnitsDetails47[[#This Row],[ODS DMC General Units]]+UnitsDetails47[[#This Row],[ODS General Units]]+UnitsDetails47[[#This Row],[ODS DMC AB109 Units]]+UnitsDetails47[[#This Row],[ODS AB109 Units]]+UnitsDetails47[[#This Row],[Room & Board Units]]+UnitsDetails47[[#This Row],[SUD Non-Billable Units]]","v":0},0,null,0,null,{"$f":"UnitsDetails47[[#This Row],[ODS General Units]]*UnitsDetails47[[#This Row],[Rate]]","v":0},null,{"$f":"UnitsDetails47[[#This Row],[Rate]]*UnitsDetails47[[#This Row],[ODS DMC AB109 Units]]","v":0},null,{"$f":"UnitsDetails47[[#This Row],[Rate]]*UnitsDetails47[[#This Row],[ODS AB109 Units]]","v":0},null,{"$f":"UnitsDetails47[[#This Row],[Rate]]*UnitsDetails47[[#This Row],[SUD Non-Billable Units]]","v":0},null,{"$f":"UnitsDetails47[[#This Row],[Rate]]*UnitsDetails47[[#This Row],[Room & Board Units]]","v":0},null,{"$f":"'[4]Final Recon - Summary'!G384","v":0},{"$f":"UnitsDetails47[[#This Row],[ODS DMC General Units]]+UnitsDetails47[[#This Row],[ODS General Units]]+UnitsDetails47[[#This Row],[ODS DMC AB109 Units]]+UnitsDetails47[[#This Row],[ODS AB109 Units]]+UnitsDetails47[[#This Row],[SUD Non-Billable Units]]+UnitsDetails47[[#This Row],[Room & Board Units]]","v":0},0]
[0,{"$f":"'[4]Final Recon - Summary'!B385","v":"Group - Alcohol and Drug Counselor"},{"$f":"'[4]Final Recon - Summary'!C385","v":"Per Billable Minute"},{"$f":"'[4]Final Recon - Summary'!D385","v":0.98},{"$f":"UnitsDetails47[[#This Row],[ODS DMC General Units]]+UnitsDetails47[[#This Row],[ODS General Units]]+UnitsDetails47[[#This Row],[ODS DMC AB109 Units]]+UnitsDetails47[[#This Row],[ODS AB109 Units]]+UnitsDetails47[[#This Row],[Room & Board Units]]+UnitsDetails47[[#This Row],[SUD Non-Billable Units]]","v":0},0,null,0,null,{"$f":"UnitsDetails47[[#This Row],[ODS General Units]]*UnitsDetails47[[#This Row],[Rate]]","v":0},null,{"$f":"UnitsDetails47[[#This Row],[Rate]]*UnitsDetails47[[#This Row],[ODS DMC AB109 Units]]","v":0},null,{"$f":"UnitsDetails47[[#This Row],[Rate]]*UnitsDetails47[[#This Row],[ODS AB109 Units]]","v":0},null,{"$f":"UnitsDetails47[[#This Row],[Rate]]*UnitsDetails47[[#This Row],[SUD Non-Billable Units]]","v":0},null,{"$f":"UnitsDetails47[[#This Row],[Rate]]*UnitsDetails47[[#This Row],[Room & Board Units]]","v":0},null,{"$f":"'[4]Final Recon - Summary'!G385","v":0},{"$f":"UnitsDetails47[[#This Row],[ODS DMC General Units]]+UnitsDetails47[[#This Row],[ODS General Units]]+UnitsDetails47[[#This Row],[ODS DMC AB109 Units]]+UnitsDetails47[[#This Row],[ODS AB109 Units]]+UnitsDetails47[[#This Row],[SUD Non-Billable Units]]+UnitsDetails47[[#This Row],[Room & Board Units]]","v":0},0]
[0,{"$f":"'[4]Final Recon - Summary'!B386","v":"Group - Clinical Nurse Specialist"},{"$f":"'[4]Final Recon - Summary'!C386","v":"Per Billable Minute"},{"$f":"'[4]Final Recon - Summary'!D386","v":2.2799999999999998},{"$f":"UnitsDetails47[[#This Row],[ODS DMC General Units]]+UnitsDetails47[[#This Row],[ODS General Units]]+UnitsDetails47[[#This Row],[ODS DMC AB109 Units]]+UnitsDetails47[[#This Row],[ODS AB109 Units]]+UnitsDetails47[[#This Row],[Room & Board Units]]+UnitsDetails47[[#This Row],[SUD Non-Billable Units]]","v":0},0,null,0,null,{"$f":"UnitsDetails47[[#This Row],[ODS General Units]]*UnitsDetails47[[#This Row],[Rate]]","v":0},null,{"$f":"UnitsDetails47[[#This Row],[Rate]]*UnitsDetails47[[#This Row],[ODS DMC AB109 Units]]","v":0},null,{"$f":"UnitsDetails47[[#This Row],[Rate]]*UnitsDetails47[[#This Row],[ODS AB109 Units]]","v":0},null,{"$f":"UnitsDetails47[[#This Row],[Rate]]*UnitsDetails47[[#This Row],[SUD Non-Billable Units]]","v":0},null,{"$f":"UnitsDetails47[[#This Row],[Rate]]*UnitsDetails47[[#This Row],[Room & Board Units]]","v":0},null,{"$f":"'[4]Final Recon - Summary'!G386","v":0},{"$f":"UnitsDetails47[[#This Row],[ODS DMC General Units]]+UnitsDetails47[[#This Row],[ODS General Units]]+UnitsDetails47[[#This Row],[ODS DMC AB109 Units]]+UnitsDetails47[[#This Row],[ODS AB109 Units]]+UnitsDetails47[[#This Row],[SUD Non-Billable Units]]+UnitsDetails47[[#This Row],[Room & Board Units]]","v":0},0]
[0,{"$f":"'[4]Final Recon - Summary'!B387","v":"Group - Community Health Worker (CPT 98961)"},{"$f":"'[4]Final Recon - Summary'!C387","v":"Per Billable Minute"},{"$f":"'[4]Final Recon - Summary'!D387","v":1.3800000000000001},{"$f":"UnitsDetails47[[#This Row],[ODS DMC General Units]]+UnitsDetails47[[#This Row],[ODS General Units]]+UnitsDetails47[[#This Row],[ODS DMC AB109 Units]]+UnitsDetails47[[#This Row],[ODS AB109 Units]]+UnitsDetails47[[#This Row],[Room & Board Units]]+UnitsDetails47[[#This Row],[SUD Non-Billable Units]]","v":0},0,null,0,null,{"$f":"UnitsDetails47[[#This Row],[ODS General Units]]*UnitsDetails47[[#This Row],[Rate]]","v":0},null,{"$f":"UnitsDetails47[[#This Row],[Rate]]*UnitsDetails47[[#This Row],[ODS DMC AB109 Units]]","v":0},null,{"$f":"UnitsDetails47[[#This Row],[Rate]]*UnitsDetails47[[#This Row],[ODS AB109 Units]]","v":0},null,{"$f":"UnitsDetails47[[#This Row],[Rate]]*UnitsDetails47[[#This Row],[SUD Non-Billable Units]]","v":0},null,{"$f":"UnitsDetails47[[#This Row],[Rate]]*UnitsDetails47[[#This Row],[Room & Board Units]]","v":0},null,{"$f":"'[4]Final Recon - Summary'!G387","v":0},{"$f":"UnitsDetails47[[#This Row],[ODS DMC General Units]]+UnitsDetails47[[#This Row],[ODS General Units]]+UnitsDetails47[[#This Row],[ODS DMC AB109 Units]]+UnitsDetails47[[#This Row],[ODS AB109 Units]]+UnitsDetails47[[#This Row],[SUD Non-Billable Units]]+UnitsDetails47[[#This Row],[Room & Board Units]]","v":0},0]
[0,{"$f":"'[4]Final Recon - Summary'!B388","v":"Group - Community Health Worker (CPT 98962)"},{"$f":"'[4]Final Recon - Summary'!C388","v":"Per Billable Minute"},{"$f":"'[4]Final Recon - Summary'!D388","v":0.63},{"$f":"UnitsDetails47[[#This Row],[ODS DMC General Units]]+UnitsDetails47[[#This Row],[ODS General Units]]+UnitsDetails47[[#This Row],[ODS DMC AB109 Units]]+UnitsDetails47[[#This Row],[ODS AB109 Units]]+UnitsDetails47[[#This Row],[Room & Board Units]]+UnitsDetails47[[#This Row],[SUD Non-Billable Units]]","v":0},0,null,0,null,{"$f":"UnitsDetails47[[#This Row],[ODS General Units]]*UnitsDetails47[[#This Row],[Rate]]","v":0},null,{"$f":"UnitsDetails47[[#This Row],[Rate]]*UnitsDetails47[[#This Row],[ODS DMC AB109 Units]]","v":0},null,{"$f":"UnitsDetails47[[#This Row],[Rate]]*UnitsDetails47[[#This Row],[ODS AB109 Units]]","v":0},null,{"$f":"UnitsDetails47[[#This Row],[Rate]]*UnitsDetails47[[#This Row],[SUD Non-Billable Units]]","v":0},null,{"$f":"UnitsDetails47[[#This Row],[Rate]]*UnitsDetails47[[#This Row],[Room & Board Units]]","v":0},null,{"$f":"'[4]Final Recon - Summary'!G388","v":0},{"$f":"UnitsDetails47[[#This Row],[ODS DMC General Units]]+UnitsDetails47[[#This Row],[ODS General Units]]+UnitsDetails47[[#This Row],[ODS DMC AB109 Units]]+UnitsDetails47[[#This Row],[ODS AB109 Units]]+UnitsDetails47[[#This Row],[SUD Non-Billable Units]]+UnitsDetails47[[#This Row],[Room & Board Units]]","v":0},0]
[0,{"$f":"'[4]Final Recon - Summary'!B389","v":"Group - Licensed Psychiatric Technician"},{"$f":"'[4]Final Recon - Summary'!C389","v":"Per Billable Minute"},{"$f":"'[4]Final Recon - Summary'!D389","v":0.84000000000000008},{"$f":"UnitsDetails47[[#This Row],[ODS DMC General Units]]+UnitsDetails47[[#This Row],[ODS General Units]]+UnitsDetails47[[#This Row],[ODS DMC AB109 Units]]+UnitsDetails47[[#This Row],[ODS AB109 Units]]+UnitsDetails47[[#This Row],[Room & Board Units]]+UnitsDetails47[[#This Row],[SUD Non-Billable Units]]","v":0},0,null,0,null,{"$f":"UnitsDetails47[[#This Row],[ODS General Units]]*UnitsDetails47[[#This Row],[Rate]]","v":0},null,{"$f":"UnitsDetails47[[#This Row],[Rate]]*UnitsDetails47[[#This Row],[ODS DMC AB109 Units]]","v":0},null,{"$f":"UnitsDetails47[[#This Row],[Rate]]*UnitsDetails47[[#This Row],[ODS AB109 Units]]","v":0},null,{"$f":"UnitsDetails47[[#This Row],[Rate]]*UnitsDetails47[[#This Row],[SUD Non-Billable Units]]","v":0},null,{"$f":"UnitsDetails47[[#This Row],[Rate]]*UnitsDetails47[[#This Row],[Room & Board Units]]","v":0},null,{"$f":"'[4]Final Recon - Summary'!G389","v":0},{"$f":"UnitsDetails47[[#This Row],[ODS DMC General Units]]+UnitsDetails47[[#This Row],[ODS General Units]]+UnitsDetails47[[#This Row],[ODS DMC AB109 Units]]+UnitsDetails47[[#This Row],[ODS AB109 Units]]+UnitsDetails47[[#This Row],[SUD Non-Billable Units]]+UnitsDetails47[[#This Row],[Room & Board Units]]","v":0},0]
[0,{"$f":"'[4]Final Recon - Summary'!B390","v":"Group - LPHA (MFT  LCSW  LPCC)/Intern or Waivered LPHA (MFT  LCSW  LPCC)"},{"$f":"'[4]Final Recon - Summary'!C390","v":"Per Billable Minute"},{"$f":"'[4]Final Recon - Summary'!D390","v":1.1900000000000002},{"$f":"UnitsDetails47[[#This Row],[ODS DMC General Units]]+UnitsDetails47[[#This Row],[ODS General Units]]+UnitsDetails47[[#This Row],[ODS DMC AB109 Units]]+UnitsDetails47[[#This Row],[ODS AB109 Units]]+UnitsDetails47[[#This Row],[Room & Board Units]]+UnitsDetails47[[#This Row],[SUD Non-Billable Units]]","v":0},0,null,0,null,{"$f":"UnitsDetails47[[#This Row],[ODS General Units]]*UnitsDetails47[[#This Row],[Rate]]","v":0},null,{"$f":"UnitsDetails47[[#This Row],[Rate]]*UnitsDetails47[[#This Row],[ODS DMC AB109 Units]]","v":0},null,{"$f":"UnitsDetails47[[#This Row],[Rate]]*UnitsDetails47[[#This Row],[ODS AB109 Units]]","v":0},null,{"$f":"UnitsDetails47[[#This Row],[Rate]]*UnitsDetails47[[#This Row],[SUD Non-Billable Units]]","v":0},null,{"$f":"UnitsDetails47[[#This Row],[Rate]]*UnitsDetails47[[#This Row],[Room & Board Units]]","v":0},null,{"$f":"'[4]Final Recon - Summary'!G390","v":0},{"$f":"UnitsDetails47[[#This Row],[ODS DMC General Units]]+UnitsDetails47[[#This Row],[ODS General Units]]+UnitsDetails47[[#This Row],[ODS DMC AB109 Units]]+UnitsDetails47[[#This Row],[ODS AB109 Units]]+UnitsDetails47[[#This Row],[SUD Non-Billable Units]]+UnitsDetails47[[#This Row],[Room & Board Units]]","v":0},0]
[0,{"$f":"'[4]Final Recon - Summary'!B391","v":"Group - Licensed Vocational Nurse (LVN)"},{"$f":"'[4]Final Recon - Summary'!C391","v":"Per Billable Minute"},{"$f":"'[4]Final Recon - Summary'!D391","v":0.98},{"$f":"UnitsDetails47[[#This Row],[ODS DMC General Units]]+UnitsDetails47[[#This Row],[ODS General Units]]+UnitsDetails47[[#This Row],[ODS DMC AB109 Units]]+UnitsDetails47[[#This Row],[ODS AB109 Units]]+UnitsDetails47[[#This Row],[Room & Board Units]]+UnitsDetails47[[#This Row],[SUD Non-Billable Units]]","v":0},0,null,0,null,{"$f":"UnitsDetails47[[#This Row],[ODS General Units]]*UnitsDetails47[[#This Row],[Rate]]","v":0},null,{"$f":"UnitsDetails47[[#This Row],[Rate]]*UnitsDetails47[[#This Row],[ODS DMC AB109 Units]]","v":0},null,{"$f":"UnitsDetails47[[#This Row],[Rate]]*UnitsDetails47[[#This Row],[ODS AB109 Units]]","v":0},null,{"$f":"UnitsDetails47[[#This Row],[Rate]]*UnitsDetails47[[#This Row],[SUD Non-Billable Units]]","v":0},null,{"$f":"UnitsDetails47[[#This Row],[Rate]]*UnitsDetails47[[#This Row],[Room & Board Units]]","v":0},null,{"$f":"'[4]Final Recon - Summary'!G391","v":0},{"$f":"UnitsDetails47[[#This Row],[ODS DMC General Units]]+UnitsDetails47[[#This Row],[ODS General Units]]+UnitsDetails47[[#This Row],[ODS DMC AB109 Units]]+UnitsDetails47[[#This Row],[ODS AB109 Units]]+UnitsDetails47[[#This Row],[SUD Non-Billable Units]]+UnitsDetails47[[#This Row],[Room & Board Units]]","v":0},0]
[0,{"$f":"'[4]Final Recon - Summary'!B392","v":"Group - Medical Assistant"},{"$f":"'[4]Final Recon - Summary'!C392","v":"Per Billable Minute"},{"$f":"'[4]Final Recon - Summary'!D392","v":0.68},{"$f":"UnitsDetails47[[#This Row],[ODS DMC General Units]]+UnitsDetails47[[#This Row],[ODS General Units]]+UnitsDetails47[[#This Row],[ODS DMC AB109 Units]]+UnitsDetails47[[#This Row],[ODS AB109 Units]]+UnitsDetails47[[#This Row],[Room & Board Units]]+UnitsDetails47[[#This Row],[SUD Non-Billable Units]]","v":0},0,null,0,null,{"$f":"UnitsDetails47[[#This Row],[ODS General Units]]*UnitsDetails47[[#This Row],[Rate]]","v":0},null,{"$f":"UnitsDetails47[[#This Row],[Rate]]*UnitsDetails47[[#This Row],[ODS DMC AB109 Units]]","v":0},null,{"$f":"UnitsDetails47[[#This Row],[Rate]]*UnitsDetails47[[#This Row],[ODS AB109 Units]]","v":0},null,{"$f":"UnitsDetails47[[#This Row],[Rate]]*UnitsDetails47[[#This Row],[SUD Non-Billable Units]]","v":0},null,{"$f":"UnitsDetails47[[#This Row],[Rate]]*UnitsDetails47[[#This Row],[Room & Board Units]]","v":0},null,{"$f":"'[4]Final Recon - Summary'!G392","v":0},{"$f":"UnitsDetails47[[#This Row],[ODS DMC General Units]]+UnitsDetails47[[#This Row],[ODS General Units]]+UnitsDetails47[[#This Row],[ODS DMC AB109 Units]]+UnitsDetails47[[#This Row],[ODS AB109 Units]]+UnitsDetails47[[#This Row],[SUD Non-Billable Units]]+UnitsDetails47[[#This Row],[Room & Board Units]]","v":0},0]
[0,{"$f":"'[4]Final Recon - Summary'!B393","v":"Group - Mental Health Rehabilitation Specialist"},{"$f":"'[4]Final Recon - Summary'!C393","v":"Per Billable Minute"},{"$f":"'[4]Final Recon - Summary'!D393","v":0.89999999999999991},{"$f":"UnitsDetails47[[#This Row],[ODS DMC General Units]]+UnitsDetails47[[#This Row],[ODS General Units]]+UnitsDetails47[[#This Row],[ODS DMC AB109 Units]]+UnitsDetails47[[#This Row],[ODS AB109 Units]]+UnitsDetails47[[#This Row],[Room & Board Units]]+UnitsDetails47[[#This Row],[SUD Non-Billable Units]]","v":0},0,null,0,null,{"$f":"UnitsDetails47[[#This Row],[ODS General Units]]*UnitsDetails47[[#This Row],[Rate]]","v":0},null,{"$f":"UnitsDetails47[[#This Row],[Rate]]*UnitsDetails47[[#This Row],[ODS DMC AB109 Units]]","v":0},null,{"$f":"UnitsDetails47[[#This Row],[Rate]]*UnitsDetails47[[#This Row],[ODS AB109 Units]]","v":0},null,{"$f":"UnitsDetails47[[#This Row],[Rate]]*UnitsDetails47[[#This Row],[SUD Non-Billable Units]]","v":0},null,{"$f":"UnitsDetails47[[#This Row],[Rate]]*UnitsDetails47[[#This Row],[Room & Board Units]]","v":0},null,{"$f":"'[4]Final Recon - Summary'!G393","v":0},{"$f":"UnitsDetails47[[#This Row],[ODS DMC General Units]]+UnitsDetails47[[#This Row],[ODS General Units]]+UnitsDetails47[[#This Row],[ODS DMC AB109 Units]]+UnitsDetails47[[#This Row],[ODS AB109 Units]]+UnitsDetails47[[#This Row],[SUD Non-Billable Units]]+UnitsDetails47[[#This Row],[Room & Board Units]]","v":0},0]
[0,{"$f":"'[4]Final Recon - Summary'!B394","v":"Group - Nurse Practitioner"},{"$f":"'[4]Final Recon - Summary'!C394","v":"Per Billable Minute"},{"$f":"'[4]Final Recon - Summary'!D394","v":2.2799999999999998},{"$f":"UnitsDetails47[[#This Row],[ODS DMC General Units]]+UnitsDetails47[[#This Row],[ODS General Units]]+UnitsDetails47[[#This Row],[ODS DMC AB109 Units]]+UnitsDetails47[[#This Row],[ODS AB109 Units]]+UnitsDetails47[[#This Row],[Room & Board Units]]+UnitsDetails47[[#This Row],[SUD Non-Billable Units]]","v":0},0,null,0,null,{"$f":"UnitsDetails47[[#This Row],[ODS General Units]]*UnitsDetails47[[#This Row],[Rate]]","v":0},null,{"$f":"UnitsDetails47[[#This Row],[Rate]]*UnitsDetails47[[#This Row],[ODS DMC AB109 Units]]","v":0},null,{"$f":"UnitsDetails47[[#This Row],[Rate]]*UnitsDetails47[[#This Row],[ODS AB109 Units]]","v":0},null,{"$f":"UnitsDetails47[[#This Row],[Rate]]*UnitsDetails47[[#This Row],[SUD Non-Billable Units]]","v":0},null,{"$f":"UnitsDetails47[[#This Row],[Rate]]*UnitsDetails47[[#This Row],[Room & Board Units]]","v":0},null,{"$f":"'[4]Final Recon - Summary'!G394","v":0},{"$f":"UnitsDetails47[[#This Row],[ODS DMC General Units]]+UnitsDetails47[[#This Row],[ODS General Units]]+UnitsDetails47[[#This Row],[ODS DMC AB109 Units]]+UnitsDetails47[[#This Row],[ODS AB109 Units]]+UnitsDetails47[[#This Row],[SUD Non-Billable Units]]+UnitsDetails47[[#This Row],[Room & Board Units]]","v":0},0]
[0,{"$f":"'[4]Final Recon - Summary'!B395","v":"Group - Occupational Therapist"},{"$f":"'[4]Final Recon - Summary'!C395","v":"Per Billable Minute"},{"$f":"'[4]Final Recon - Summary'!D395","v":1.59},{"$f":"UnitsDetails47[[#This Row],[ODS DMC General Units]]+UnitsDetails47[[#This Row],[ODS General Units]]+UnitsDetails47[[#This Row],[ODS DMC AB109 Units]]+UnitsDetails47[[#This Row],[ODS AB109 Units]]+UnitsDetails47[[#This Row],[Room & Board Units]]+UnitsDetails47[[#This Row],[SUD Non-Billable Units]]","v":0},0,null,0,null,{"$f":"UnitsDetails47[[#This Row],[ODS General Units]]*UnitsDetails47[[#This Row],[Rate]]","v":0},null,{"$f":"UnitsDetails47[[#This Row],[Rate]]*UnitsDetails47[[#This Row],[ODS DMC AB109 Units]]","v":0},null,{"$f":"UnitsDetails47[[#This Row],[Rate]]*UnitsDetails47[[#This Row],[ODS AB109 Units]]","v":0},null,{"$f":"UnitsDetails47[[#This Row],[Rate]]*UnitsDetails47[[#This Row],[SUD Non-Billable Units]]","v":0},null,{"$f":"UnitsDetails47[[#This Row],[Rate]]*UnitsDetails47[[#This Row],[Room & Board Units]]","v":0},null,{"$f":"'[4]Final Recon - Summary'!G395","v":0},{"$f":"UnitsDetails47[[#This Row],[ODS DMC General Units]]+UnitsDetails47[[#This Row],[ODS General Units]]+UnitsDetails47[[#This Row],[ODS DMC AB109 Units]]+UnitsDetails47[[#This Row],[ODS AB109 Units]]+UnitsDetails47[[#This Row],[SUD Non-Billable Units]]+UnitsDetails47[[#This Row],[Room & Board Units]]","v":0},0]
[0,{"$f":"'[4]Final Recon - Summary'!B396","v":"Group - Other Qualified Providers - Other Designated MH staff that bill medical"},{"$f":"'[4]Final Recon - Summary'!C396","v":"Per Billable Minute"},{"$f":"'[4]Final Recon - Summary'!D396","v":0.89999999999999991},{"$f":"UnitsDetails47[[#This Row],[ODS DMC General Units]]+UnitsDetails47[[#This Row],[ODS General Units]]+UnitsDetails47[[#This Row],[ODS DMC AB109 Units]]+UnitsDetails47[[#This Row],[ODS AB109 Units]]+UnitsDetails47[[#This Row],[Room & Board Units]]+UnitsDetails47[[#This Row],[SUD Non-Billable Units]]","v":0},0,null,0,null,{"$f":"UnitsDetails47[[#This Row],[ODS General Units]]*UnitsDetails47[[#This Row],[Rate]]","v":0},null,{"$f":"UnitsDetails47[[#This Row],[Rate]]*UnitsDetails47[[#This Row],[ODS DMC AB109 Units]]","v":0},null,{"$f":"UnitsDetails47[[#This Row],[Rate]]*UnitsDetails47[[#This Row],[ODS AB109 Units]]","v":0},null,{"$f":"UnitsDetails47[[#This Row],[Rate]]*UnitsDetails47[[#This Row],[SUD Non-Billable Units]]","v":0},null,{"$f":"UnitsDetails47[[#This Row],[Rate]]*UnitsDetails47[[#This Row],[Room & Board Units]]","v":0},null,{"$f":"'[4]Final Recon - Summary'!G396","v":0},{"$f":"UnitsDetails47[[#This Row],[ODS DMC General Units]]+UnitsDetails47[[#This Row],[ODS General Units]]+UnitsDetails47[[#This Row],[ODS DMC AB109 Units]]+UnitsDetails47[[#This Row],[ODS AB109 Units]]+UnitsDetails47[[#This Row],[SUD Non-Billable Units]]+UnitsDetails47[[#This Row],[Room & Board Units]]","v":0},0]
[{"$f":"$C$5","v":0},{"$f":"'[4]Final Recon - Summary'!B397","v":"Group - Peer Support Specialist"},{"$f":"'[4]Final Recon - Summary'!C397","v":"Per Billable Minute"},{"$f":"'[4]Final Recon - Summary'!D397","v":0.94},{"$f":"UnitsDetails47[[#This Row],[ODS DMC General Units]]+UnitsDetails47[[#This Row],[ODS General Units]]+UnitsDetails47[[#This Row],[ODS DMC AB109 Units]]+UnitsDetails47[[#This Row],[ODS AB109 Units]]+UnitsDetails47[[#This Row],[Room & Board Units]]+UnitsDetails47[[#This Row],[SUD Non-Billable Units]]","v":0},0,null,0,null,{"$f":"UnitsDetails47[[#This Row],[ODS General Units]]*UnitsDetails47[[#This Row],[Rate]]","v":0},null,{"$f":"UnitsDetails47[[#This Row],[Rate]]*UnitsDetails47[[#This Row],[ODS DMC AB109 Units]]","v":0},null,{"$f":"UnitsDetails47[[#This Row],[Rate]]*UnitsDetails47[[#This Row],[ODS AB109 Units]]","v":0},null,{"$f":"UnitsDetails47[[#This Row],[Rate]]*UnitsDetails47[[#This Row],[SUD Non-Billable Units]]","v":0},null,{"$f":"UnitsDetails47[[#This Row],[Rate]]*UnitsDetails47[[#This Row],[Room & Board Units]]","v":0},null,{"$f":"'[4]Final Recon - Summary'!G397","v":0},{"$f":"UnitsDetails47[[#This Row],[ODS DMC General Units]]+UnitsDetails47[[#This Row],[ODS General Units]]+UnitsDetails47[[#This Row],[ODS DMC AB109 Units]]+UnitsDetails47[[#This Row],[ODS AB109 Units]]+UnitsDetails47[[#This Row],[SUD Non-Billable Units]]+UnitsDetails47[[#This Row],[Room & Board Units]]","v":0},0]
[0,{"$f":"'[4]Final Recon - Summary'!B398","v":"Group - Physician Assistant"},{"$f":"'[4]Final Recon - Summary'!C398","v":"Per Billable Minute"},{"$f":"'[4]Final Recon - Summary'!D398","v":2.04},{"$f":"UnitsDetails47[[#This Row],[ODS DMC General Units]]+UnitsDetails47[[#This Row],[ODS General Units]]+UnitsDetails47[[#This Row],[ODS DMC AB109 Units]]+UnitsDetails47[[#This Row],[ODS AB109 Units]]+UnitsDetails47[[#This Row],[Room & Board Units]]+UnitsDetails47[[#This Row],[SUD Non-Billable Units]]","v":0},0,null,0,null,{"$f":"UnitsDetails47[[#This Row],[ODS General Units]]*UnitsDetails47[[#This Row],[Rate]]","v":0},null,{"$f":"UnitsDetails47[[#This Row],[Rate]]*UnitsDetails47[[#This Row],[ODS DMC AB109 Units]]","v":0},null,{"$f":"UnitsDetails47[[#This Row],[Rate]]*UnitsDetails47[[#This Row],[ODS AB109 Units]]","v":0},null,{"$f":"UnitsDetails47[[#This Row],[Rate]]*UnitsDetails47[[#This Row],[SUD Non-Billable Units]]","v":0},null,{"$f":"UnitsDetails47[[#This Row],[Rate]]*UnitsDetails47[[#This Row],[Room & Board Units]]","v":0},null,{"$f":"'[4]Final Recon - Summary'!G398","v":0},{"$f":"UnitsDetails47[[#This Row],[ODS DMC General Units]]+UnitsDetails47[[#This Row],[ODS General Units]]+UnitsDetails47[[#This Row],[ODS DMC AB109 Units]]+UnitsDetails47[[#This Row],[ODS AB109 Units]]+UnitsDetails47[[#This Row],[SUD Non-Billable Units]]+UnitsDetails47[[#This Row],[Room & Board Units]]","v":0},0]
[0,{"$f":"'[4]Final Recon - Summary'!B399","v":"Group - Psychologist/Pre-licensed Psychologist"},{"$f":"'[4]Final Recon - Summary'!C399","v":"Per Billable Minute"},{"$f":"'[4]Final Recon - Summary'!D399","v":1.84},{"$f":"UnitsDetails47[[#This Row],[ODS DMC General Units]]+UnitsDetails47[[#This Row],[ODS General Units]]+UnitsDetails47[[#This Row],[ODS DMC AB109 Units]]+UnitsDetails47[[#This Row],[ODS AB109 Units]]+UnitsDetails47[[#This Row],[Room & Board Units]]+UnitsDetails47[[#This Row],[SUD Non-Billable Units]]","v":0},0,null,0,null,{"$f":"UnitsDetails47[[#This Row],[ODS General Units]]*UnitsDetails47[[#This Row],[Rate]]","v":0},null,{"$f":"UnitsDetails47[[#This Row],[Rate]]*UnitsDetails47[[#This Row],[ODS DMC AB109 Units]]","v":0},null,{"$f":"UnitsDetails47[[#This Row],[Rate]]*UnitsDetails47[[#This Row],[ODS AB109 Units]]","v":0},null,{"$f":"UnitsDetails47[[#This Row],[Rate]]*UnitsDetails47[[#This Row],[SUD Non-Billable Units]]","v":0},null,{"$f":"UnitsDetails47[[#This Row],[Rate]]*UnitsDetails47[[#This Row],[Room & Board Units]]","v":0},null,{"$f":"'[4]Final Recon - Summary'!G399","v":0},{"$f":"UnitsDetails47[[#This Row],[ODS DMC General Units]]+UnitsDetails47[[#This Row],[ODS General Units]]+UnitsDetails47[[#This Row],[ODS DMC AB109 Units]]+UnitsDetails47[[#This Row],[ODS AB109 Units]]+UnitsDetails47[[#This Row],[SUD Non-Billable Units]]+UnitsDetails47[[#This Row],[Room & Board Units]]","v":0},0]
[0,{"$f":"'[4]Final Recon - Summary'!B400","v":"Group - Psychiatrist/ Contracted Psychiatrist/Licensed Physician (MD)"},{"$f":"'[4]Final Recon - Summary'!C400","v":"Per Billable Minute"},{"$f":"'[4]Final Recon - Summary'!D400","v":2.57},{"$f":"UnitsDetails47[[#This Row],[ODS DMC General Units]]+UnitsDetails47[[#This Row],[ODS General Units]]+UnitsDetails47[[#This Row],[ODS DMC AB109 Units]]+UnitsDetails47[[#This Row],[ODS AB109 Units]]+UnitsDetails47[[#This Row],[Room & Board Units]]+UnitsDetails47[[#This Row],[SUD Non-Billable Units]]","v":0},0,null,0,null,{"$f":"UnitsDetails47[[#This Row],[ODS General Units]]*UnitsDetails47[[#This Row],[Rate]]","v":0},null,{"$f":"UnitsDetails47[[#This Row],[Rate]]*UnitsDetails47[[#This Row],[ODS DMC AB109 Units]]","v":0},null,{"$f":"UnitsDetails47[[#This Row],[Rate]]*UnitsDetails47[[#This Row],[ODS AB109 Units]]","v":0},null,{"$f":"UnitsDetails47[[#This Row],[Rate]]*UnitsDetails47[[#This Row],[SUD Non-Billable Units]]","v":0},null,{"$f":"UnitsDetails47[[#This Row],[Rate]]*UnitsDetails47[[#This Row],[Room & Board Units]]","v":0},null,{"$f":"'[4]Final Recon - Summary'!G400","v":0},{"$f":"UnitsDetails47[[#This Row],[ODS DMC General Units]]+UnitsDetails47[[#This Row],[ODS General Units]]+UnitsDetails47[[#This Row],[ODS DMC AB109 Units]]+UnitsDetails47[[#This Row],[ODS AB109 Units]]+UnitsDetails47[[#This Row],[SUD Non-Billable Units]]+UnitsDetails47[[#This Row],[Room & Board Units]]","v":0},0]
[0,{"$f":"'[4]Final Recon - Summary'!B401","v":"Group - Registered Nurse (RN)"},{"$f":"'[4]Final Recon - Summary'!C401","v":"Per Billable Minute"},{"$f":"'[4]Final Recon - Summary'!D401","v":1.8599999999999999},{"$f":"UnitsDetails47[[#This Row],[ODS DMC General Units]]+UnitsDetails47[[#This Row],[ODS General Units]]+UnitsDetails47[[#This Row],[ODS DMC AB109 Units]]+UnitsDetails47[[#This Row],[ODS AB109 Units]]+UnitsDetails47[[#This Row],[Room & Board Units]]+UnitsDetails47[[#This Row],[SUD Non-Billable Units]]","v":0},0,null,0,null,{"$f":"UnitsDetails47[[#This Row],[ODS General Units]]*UnitsDetails47[[#This Row],[Rate]]","v":0},null,{"$f":"UnitsDetails47[[#This Row],[Rate]]*UnitsDetails47[[#This Row],[ODS DMC AB109 Units]]","v":0},null,{"$f":"UnitsDetails47[[#This Row],[Rate]]*UnitsDetails47[[#This Row],[ODS AB109 Units]]","v":0},null,{"$f":"UnitsDetails47[[#This Row],[Rate]]*UnitsDetails47[[#This Row],[SUD Non-Billable Units]]","v":0},null,{"$f":"UnitsDetails47[[#This Row],[Rate]]*UnitsDetails47[[#This Row],[Room & Board Units]]","v":0},null,{"$f":"'[4]Final Recon - Summary'!G401","v":0},{"$f":"UnitsDetails47[[#This Row],[ODS DMC General Units]]+UnitsDetails47[[#This Row],[ODS General Units]]+UnitsDetails47[[#This Row],[ODS DMC AB109 Units]]+UnitsDetails47[[#This Row],[ODS AB109 Units]]+UnitsDetails47[[#This Row],[SUD Non-Billable Units]]+UnitsDetails47[[#This Row],[Room & Board Units]]","v":0},0]
[0,{"$f":"'[4]Final Recon - Summary'!B402","v":"Group - Registered Pharmacist"},{"$f":"'[4]Final Recon - Summary'!C402","v":"Per Billable Minute"},{"$f":"'[4]Final Recon - Summary'!D402","v":2.19},{"$f":"UnitsDetails47[[#This Row],[ODS DMC General Units]]+UnitsDetails47[[#This Row],[ODS General Units]]+UnitsDetails47[[#This Row],[ODS DMC AB109 Units]]+UnitsDetails47[[#This Row],[ODS AB109 Units]]+UnitsDetails47[[#This Row],[Room & Board Units]]+UnitsDetails47[[#This Row],[SUD Non-Billable Units]]","v":0},0,null,0,null,{"$f":"UnitsDetails47[[#This Row],[ODS General Units]]*UnitsDetails47[[#This Row],[Rate]]","v":0},null,{"$f":"UnitsDetails47[[#This Row],[Rate]]*UnitsDetails47[[#This Row],[ODS DMC AB109 Units]]","v":0},null,{"$f":"UnitsDetails47[[#This Row],[Rate]]*UnitsDetails47[[#This Row],[ODS AB109 Units]]","v":0},null,{"$f":"UnitsDetails47[[#This Row],[Rate]]*UnitsDetails47[[#This Row],[SUD Non-Billable Units]]","v":0},null,{"$f":"UnitsDetails47[[#This Row],[Rate]]*UnitsDetails47[[#This Row],[Room & Board Units]]","v":0},null,{"$f":"'[4]Final Recon - Summary'!G402","v":0},{"$f":"UnitsDetails47[[#This Row],[ODS DMC General Units]]+UnitsDetails47[[#This Row],[ODS General Units]]+UnitsDetails47[[#This Row],[ODS DMC AB109 Units]]+UnitsDetails47[[#This Row],[ODS AB109 Units]]+UnitsDetails47[[#This Row],[SUD Non-Billable Units]]+UnitsDetails47[[#This Row],[Room & Board Units]]","v":0},0]
[0,{"$f":"'[4]Final Recon - Summary'!B403","v":"Group - Interpreter Services"},{"$f":"'[4]Final Recon - Summary'!C403","v":"Per Billable Minute"},{"$f":"'[4]Final Recon - Summary'!D403","v":0.49},{"$f":"UnitsDetails47[[#This Row],[ODS DMC General Units]]+UnitsDetails47[[#This Row],[ODS General Units]]+UnitsDetails47[[#This Row],[ODS DMC AB109 Units]]+UnitsDetails47[[#This Row],[ODS AB109 Units]]+UnitsDetails47[[#This Row],[Room & Board Units]]+UnitsDetails47[[#This Row],[SUD Non-Billable Units]]","v":0},0,null,0,null,{"$f":"UnitsDetails47[[#This Row],[ODS General Units]]*UnitsDetails47[[#This Row],[Rate]]","v":0},null,{"$f":"UnitsDetails47[[#This Row],[Rate]]*UnitsDetails47[[#This Row],[ODS DMC AB109 Units]]","v":0},null,{"$f":"UnitsDetails47[[#This Row],[Rate]]*UnitsDetails47[[#This Row],[ODS AB109 Units]]","v":0},null,{"$f":"UnitsDetails47[[#This Row],[Rate]]*UnitsDetails47[[#This Row],[SUD Non-Billable Units]]","v":0},null,{"$f":"UnitsDetails47[[#This Row],[Rate]]*UnitsDetails47[[#This Row],[Room & Board Units]]","v":0},null,{"$f":"'[4]Final Recon - Summary'!G403","v":0},{"$f":"UnitsDetails47[[#This Row],[ODS DMC General Units]]+UnitsDetails47[[#This Row],[ODS General Units]]+UnitsDetails47[[#This Row],[ODS DMC AB109 Units]]+UnitsDetails47[[#This Row],[ODS AB109 Units]]+UnitsDetails47[[#This Row],[SUD Non-Billable Units]]+UnitsDetails47[[#This Row],[Room & Board Units]]","v":0},0]
[0,{"$f":"'[4]Final Recon - Summary'!B404","v":"Bundled Rates"}]
[0,{"$f":"'[4]Final Recon - Summary'!B405","v":"200 FACT/FSP Caseload"},{"$f":"'[4]Final Recon - Summary'!C405","v":"Bundled Full Month"},{"$f":"'[4]Final Recon - Summary'!D405","v":3319},{"$f":"UnitsDetails47[[#This Row],[ODS DMC General Units]]+UnitsDetails47[[#This Row],[ODS General Units]]+UnitsDetails47[[#This Row],[ODS DMC AB109 Units]]+UnitsDetails47[[#This Row],[ODS AB109 Units]]+UnitsDetails47[[#This Row],[Room & Board Units]]+UnitsDetails47[[#This Row],[SUD Non-Billable Units]]","v":0},{"$f":"+D345*E345","v":0},null,{"$f":"+D345*G345","v":0},null,{"$f":"UnitsDetails47[[#This Row],[ODS General Units]]*UnitsDetails47[[#This Row],[Rate]]","v":0},null,{"$f":"UnitsDetails47[[#This Row],[Rate]]*UnitsDetails47[[#This Row],[ODS DMC AB109 Units]]","v":0},null,{"$f":"UnitsDetails47[[#This Row],[Rate]]*UnitsDetails47[[#This Row],[ODS AB109 Units]]","v":0},null,{"$f":"UnitsDetails47[[#This Row],[Rate]]*UnitsDetails47[[#This Row],[SUD Non-Billable Units]]","v":0},null,{"$f":"UnitsDetails47[[#This Row],[Rate]]*UnitsDetails47[[#This Row],[Room & Board Units]]","v":0},null,{"$f":"'[4]Final Recon - Summary'!G405","v":0},{"$f":"UnitsDetails47[[#This Row],[ODS DMC General Units]]+UnitsDetails47[[#This Row],[ODS General Units]]+UnitsDetails47[[#This Row],[ODS DMC AB109 Units]]+UnitsDetails47[[#This Row],[ODS AB109 Units]]+UnitsDetails47[[#This Row],[SUD Non-Billable Units]]+UnitsDetails47[[#This Row],[Room & Board Units]]","v":0},{"$f":"T345-U345","v":0}]
[0,{"$f":"'[4]Final Recon - Summary'!B406","v":"200 FACT/FSP Caseload"},{"$f":"'[4]Final Recon - Summary'!C406","v":"Bundled Partial Month"},{"$f":"'[4]Final Recon - Summary'!D406","v":2212.6600000000003},{"$f":"UnitsDetails47[[#This Row],[ODS DMC General Units]]+UnitsDetails47[[#This Row],[ODS General Units]]+UnitsDetails47[[#This Row],[ODS DMC AB109 Units]]+UnitsDetails47[[#This Row],[ODS AB109 Units]]+UnitsDetails47[[#This Row],[Room & Board Units]]+UnitsDetails47[[#This Row],[SUD Non-Billable Units]]","v":0},{"$f":"+D346*E346","v":0},null,{"$f":"+D346*G346","v":0},null,{"$f":"UnitsDetails47[[#This Row],[ODS General Units]]*UnitsDetails47[[#This Row],[Rate]]","v":0},null,{"$f":"UnitsDetails47[[#This Row],[Rate]]*UnitsDetails47[[#This Row],[ODS DMC AB109 Units]]","v":0},null,{"$f":"UnitsDetails47[[#This Row],[Rate]]*UnitsDetails47[[#This Row],[ODS AB109 Units]]","v":0},null,{"$f":"UnitsDetails47[[#This Row],[Rate]]*UnitsDetails47[[#This Row],[SUD Non-Billable Units]]","v":0},null,{"$f":"UnitsDetails47[[#This Row],[Rate]]*UnitsDetails47[[#This Row],[Room & Board Units]]","v":0},null,{"$f":"'[4]Final Recon - Summary'!G406","v":0},{"$f":"UnitsDetails47[[#This Row],[ODS DMC General Units]]+UnitsDetails47[[#This Row],[ODS General Units]]+UnitsDetails47[[#This Row],[ODS DMC AB109 Units]]+UnitsDetails47[[#This Row],[ODS AB109 Units]]+UnitsDetails47[[#This Row],[SUD Non-Billable Units]]+UnitsDetails47[[#This Row],[Room & Board Units]]","v":0},{"$f":"T346-U346","v":0}]
[0]
[0]
[0]
[0]
[0]
[0]
[0]
[0]
[0]
[0,{"$f":"'[4]Final Recon - Summary'!B416","v":"Total"},null,null,{"$f":"UnitsDetails47[[#This Row],[ODS DMC General Units]]+UnitsDetails47[[#This Row],[ODS General Units]]+UnitsDetails47[[#This Row],[ODS DMC AB109 Units]]+UnitsDetails47[[#This Row],[ODS AB109 Units]]+UnitsDetails47[[#This Row],[Room & Board Units]]+UnitsDetails47[[#This Row],[SUD Non-Billable Units]]","v":0},{"$f":"SUM(F305:F355)","v":0},null,{"$f":"SUM(H305:H355)","v":0},null,{"$f":"SUM(J305:J355)","v":0},null,{"$f":"SUM(L305:L355)","v":0},null,{"$f":"SUM(N305:N355)","v":0},null,{"$f":"SUM(P305:P355)","v":0},null,{"$f":"SUM(R305:R355)","v":0}]
[]
["BEHAVIORAL HEALTH SERVICES"]
["Fical Year-End Units Details"]
[]
[null,"Contractor:",{"$f":"C300","v":0}]
[null,"Contract #:",{"$f":"C301","v":0}]
[null,"Program Name:",{"$f":"'[4]Final Recon - Summary'!C432","v":"Program 7"}]
[]
["Column1","Service Modalities","Unit","Rate","Final TUOS Units Reconciliation","Final Amount Reconciliation","ODS DMC General Units","ODS DMC General Amount","ODS General Units","ODS General Amount","ODS DMC AB109 Units","ODS DMC AB109 Amount","ODS AB109 Units","ODS AB109 Amount","SUD Non-Billable Units","SUD Non-Billable Amount","Room & Board Units","Room & Board Amount",null,"Total Units (Summary)","Total Units (Details)","Checkpoint"]
[{"$f":"$C$5","v":0},{"$f":"'[4]Final Recon - Summary'!B436","v":"Individual - Alcohol and Drug Counselor"},{"$f":"'[4]Final Recon - Summary'!C436","v":"Per Billable Minute"},{"$f":"'[4]Final Recon - Summary'!D436","v":4.4400000000000004},{"$f":"UnitsDetails48[[#This Row],[ODS DMC General Units]]+UnitsDetails48[[#This Row],[ODS General Units]]+UnitsDetails48[[#This Row],[ODS DMC AB109 Units]]+UnitsDetails48[[#This Row],[ODS AB109 Units]]+UnitsDetails48[[#This Row],[Room & Board Units]]+UnitsDetails48[[#This Row],[SUD Non-Billable Units]]","v":0},{"$f":"+D366*E366","v":0},null,{"$f":"+D366*G366","v":0},null,{"$f":"UnitsDetails48[[#This Row],[ODS General Units]]*UnitsDetails48[[#This Row],[Rate]]","v":0},null,{"$f":"UnitsDetails48[[#This Row],[Rate]]*UnitsDetails48[[#This Row],[ODS DMC AB109 Units]]","v":0},null,{"$f":"UnitsDetails48[[#This Row],[Rate]]*UnitsDetails48[[#This Row],[ODS AB109 Units]]","v":0},null,{"$f":"UnitsDetails48[[#This Row],[Rate]]*UnitsDetails48[[#This Row],[SUD Non-Billable Units]]","v":0},null,{"$f":"UnitsDetails48[[#This Row],[Rate]]*UnitsDetails48[[#This Row],[Room & Board Units]]","v":0},null,{"$f":"'[4]Final Recon - Summary'!G436","v":0},{"$f":"UnitsDetails48[[#This Row],[ODS DMC General Units]]+UnitsDetails48[[#This Row],[ODS General Units]]+UnitsDetails48[[#This Row],[ODS DMC AB109 Units]]+UnitsDetails48[[#This Row],[ODS AB109 Units]]+UnitsDetails48[[#This Row],[SUD Non-Billable Units]]+UnitsDetails48[[#This Row],[Room & Board Units]]","v":0},{"$f":"T366-U366","v":0}]
[0,{"$f":"'[4]Final Recon - Summary'!B437","v":"Individual - Clinical Nurse Specialist"},{"$f":"'[4]Final Recon - Summary'!C437","v":"Per Billable Minute"},{"$f":"'[4]Final Recon - Summary'!D437","v":10.23},{"$f":"UnitsDetails48[[#This Row],[ODS DMC General Units]]+UnitsDetails48[[#This Row],[ODS General Units]]+UnitsDetails48[[#This Row],[ODS DMC AB109 Units]]+UnitsDetails48[[#This Row],[ODS AB109 Units]]+UnitsDetails48[[#This Row],[Room & Board Units]]+UnitsDetails48[[#This Row],[SUD Non-Billable Units]]","v":0},0,null,0,null,{"$f":"UnitsDetails48[[#This Row],[ODS General Units]]*UnitsDetails48[[#This Row],[Rate]]","v":0},null,{"$f":"UnitsDetails48[[#This Row],[Rate]]*UnitsDetails48[[#This Row],[ODS DMC AB109 Units]]","v":0},null,{"$f":"UnitsDetails48[[#This Row],[Rate]]*UnitsDetails48[[#This Row],[ODS AB109 Units]]","v":0},null,{"$f":"UnitsDetails48[[#This Row],[Rate]]*UnitsDetails48[[#This Row],[SUD Non-Billable Units]]","v":0},null,{"$f":"UnitsDetails48[[#This Row],[Rate]]*UnitsDetails48[[#This Row],[Room & Board Units]]","v":0},null,{"$f":"'[4]Final Recon - Summary'!G437","v":0},{"$f":"UnitsDetails48[[#This Row],[ODS DMC General Units]]+UnitsDetails48[[#This Row],[ODS General Units]]+UnitsDetails48[[#This Row],[ODS DMC AB109 Units]]+UnitsDetails48[[#This Row],[ODS AB109 Units]]+UnitsDetails48[[#This Row],[SUD Non-Billable Units]]+UnitsDetails48[[#This Row],[Room & Board Units]]","v":0},0]
[0,{"$f":"'[4]Final Recon - Summary'!B438","v":"Individual - Community Health Worker"},{"$f":"'[4]Final Recon - Summary'!C438","v":"Per Billable Minute"},{"$f":"'[4]Final Recon - Summary'!D438","v":4.12},{"$f":"UnitsDetails48[[#This Row],[ODS DMC General Units]]+UnitsDetails48[[#This Row],[ODS General Units]]+UnitsDetails48[[#This Row],[ODS DMC AB109 Units]]+UnitsDetails48[[#This Row],[ODS AB109 Units]]+UnitsDetails48[[#This Row],[Room & Board Units]]+UnitsDetails48[[#This Row],[SUD Non-Billable Units]]","v":0},0,null,0,null,{"$f":"UnitsDetails48[[#This Row],[ODS General Units]]*UnitsDetails48[[#This Row],[Rate]]","v":0},null,{"$f":"UnitsDetails48[[#This Row],[Rate]]*UnitsDetails48[[#This Row],[ODS DMC AB109 Units]]","v":0},null,{"$f":"UnitsDetails48[[#This Row],[Rate]]*UnitsDetails48[[#This Row],[ODS AB109 Units]]","v":0},null,{"$f":"UnitsDetails48[[#This Row],[Rate]]*UnitsDetails48[[#This Row],[SUD Non-Billable Units]]","v":0},null,{"$f":"UnitsDetails48[[#This Row],[Rate]]*UnitsDetails48[[#This Row],[Room & Board Units]]","v":0},null,{"$f":"'[4]Final Recon - Summary'!G438","v":0},{"$f":"UnitsDetails48[[#This Row],[ODS DMC General Units]]+UnitsDetails48[[#This Row],[ODS General Units]]+UnitsDetails48[[#This Row],[ODS DMC AB109 Units]]+UnitsDetails48[[#This Row],[ODS AB109 Units]]+UnitsDetails48[[#This Row],[SUD Non-Billable Units]]+UnitsDetails48[[#This Row],[Room & Board Units]]","v":0},0]
[0,{"$f":"'[4]Final Recon - Summary'!B439","v":"Individual - Licensed Psychiatric Technician"},{"$f":"'[4]Final Recon - Summary'!C439","v":"Per Billable Minute"},{"$f":"'[4]Final Recon - Summary'!D439","v":3.76},{"$f":"UnitsDetails48[[#This Row],[ODS DMC General Units]]+UnitsDetails48[[#This Row],[ODS General Units]]+UnitsDetails48[[#This Row],[ODS DMC AB109 Units]]+UnitsDetails48[[#This Row],[ODS AB109 Units]]+UnitsDetails48[[#This Row],[Room & Board Units]]+UnitsDetails48[[#This Row],[SUD Non-Billable Units]]","v":0},0,null,0,null,{"$f":"UnitsDetails48[[#This Row],[ODS General Units]]*UnitsDetails48[[#This Row],[Rate]]","v":0},null,{"$f":"UnitsDetails48[[#This Row],[Rate]]*UnitsDetails48[[#This Row],[ODS DMC AB109 Units]]","v":0},null,{"$f":"UnitsDetails48[[#This Row],[Rate]]*UnitsDetails48[[#This Row],[ODS AB109 Units]]","v":0},null,{"$f":"UnitsDetails48[[#This Row],[Rate]]*UnitsDetails48[[#This Row],[SUD Non-Billable Units]]","v":0},null,{"$f":"UnitsDetails48[[#This Row],[Rate]]*UnitsDetails48[[#This Row],[Room & Board Units]]","v":0},null,{"$f":"'[4]Final Recon - Summary'!G439","v":0},{"$f":"UnitsDetails48[[#This Row],[ODS DMC General Units]]+UnitsDetails48[[#This Row],[ODS General Units]]+UnitsDetails48[[#This Row],[ODS DMC AB109 Units]]+UnitsDetails48[[#This Row],[ODS AB109 Units]]+UnitsDetails48[[#This Row],[SUD Non-Billable Units]]+UnitsDetails48[[#This Row],[Room & Board Units]]","v":0},0]
[0,{"$f":"'[4]Final Recon - Summary'!B440","v":"Individual - LPHA (MFT  LCSW  LPCC)/Intern or Waivered LPHA (MFT  LCSW  LPCC)"},{"$f":"'[4]Final Recon - Summary'!C440","v":"Per Billable Minute"},{"$f":"'[4]Final Recon - Summary'!D440","v":5.35},{"$f":"UnitsDetails48[[#This Row],[ODS DMC General Units]]+UnitsDetails48[[#This Row],[ODS General Units]]+UnitsDetails48[[#This Row],[ODS DMC AB109 Units]]+UnitsDetails48[[#This Row],[ODS AB109 Units]]+UnitsDetails48[[#This Row],[Room & Board Units]]+UnitsDetails48[[#This Row],[SUD Non-Billable Units]]","v":0},0,null,0,null,{"$f":"UnitsDetails48[[#This Row],[ODS General Units]]*UnitsDetails48[[#This Row],[Rate]]","v":0},null,{"$f":"UnitsDetails48[[#This Row],[Rate]]*UnitsDetails48[[#This Row],[ODS DMC AB109 Units]]","v":0},null,{"$f":"UnitsDetails48[[#This Row],[Rate]]*UnitsDetails48[[#This Row],[ODS AB109 Units]]","v":0},null,{"$f":"UnitsDetails48[[#This Row],[Rate]]*UnitsDetails48[[#This Row],[SUD Non-Billable Units]]","v":0},null,{"$f":"UnitsDetails48[[#This Row],[Rate]]*UnitsDetails48[[#This Row],[Room & Board Units]]","v":0},null,{"$f":"'[4]Final Recon - Summary'!G440","v":0},{"$f":"UnitsDetails48[[#This Row],[ODS DMC General Units]]+UnitsDetails48[[#This Row],[ODS General Units]]+UnitsDetails48[[#This Row],[ODS DMC AB109 Units]]+UnitsDetails48[[#This Row],[ODS AB109 Units]]+UnitsDetails48[[#This Row],[SUD Non-Billable Units]]+UnitsDetails48[[#This Row],[Room & Board Units]]","v":0},0]
[0,{"$f":"'[4]Final Recon - Summary'!B441","v":"Individual - Licensed Vocational Nurse (LVN)"},{"$f":"'[4]Final Recon - Summary'!C441","v":"Per Billable Minute"},{"$f":"'[4]Final Recon - Summary'!D441","v":4.3800000000000008},{"$f":"UnitsDetails48[[#This Row],[ODS DMC General Units]]+UnitsDetails48[[#This Row],[ODS General Units]]+UnitsDetails48[[#This Row],[ODS DMC AB109 Units]]+UnitsDetails48[[#This Row],[ODS AB109 Units]]+UnitsDetails48[[#This Row],[Room & Board Units]]+UnitsDetails48[[#This Row],[SUD Non-Billable Units]]","v":0},0,null,0,null,{"$f":"UnitsDetails48[[#This Row],[ODS General Units]]*UnitsDetails48[[#This Row],[Rate]]","v":0},null,{"$f":"UnitsDetails48[[#This Row],[Rate]]*UnitsDetails48[[#This Row],[ODS DMC AB109 Units]]","v":0},null,{"$f":"UnitsDetails48[[#This Row],[Rate]]*UnitsDetails48[[#This Row],[ODS AB109 Units]]","v":0},null,{"$f":"UnitsDetails48[[#This Row],[Rate]]*UnitsDetails48[[#This Row],[SUD Non-Billable Units]]","v":0},null,{"$f":"UnitsDetails48[[#This Row],[Rate]]*UnitsDetails48[[#This Row],[Room & Board Units]]","v":0},null,{"$f":"'[4]Final Recon - Summary'!G441","v":0},{"$f":"UnitsDetails48[[#This Row],[ODS DMC General Units]]+UnitsDetails48[[#This Row],[ODS General Units]]+UnitsDetails48[[#This Row],[ODS DMC AB109 Units]]+UnitsDetails48[[#This Row],[ODS AB109 Units]]+UnitsDetails48[[#This Row],[SUD Non-Billable Units]]+UnitsDetails48[[#This Row],[Room & Board Units]]","v":0},0]
[0,{"$f":"'[4]Final Recon - Summary'!B442","v":"Individual - Medical Assistant"},{"$f":"'[4]Final Recon - Summary'!C442","v":"Per Billable Minute"},{"$f":"'[4]Final Recon - Summary'!D442","v":3.02},{"$f":"UnitsDetails48[[#This Row],[ODS DMC General Units]]+UnitsDetails48[[#This Row],[ODS General Units]]+UnitsDetails48[[#This Row],[ODS DMC AB109 Units]]+UnitsDetails48[[#This Row],[ODS AB109 Units]]+UnitsDetails48[[#This Row],[Room & Board Units]]+UnitsDetails48[[#This Row],[SUD Non-Billable Units]]","v":0},0,null,0,null,{"$f":"UnitsDetails48[[#This Row],[ODS General Units]]*UnitsDetails48[[#This Row],[Rate]]","v":0},null,{"$f":"UnitsDetails48[[#This Row],[Rate]]*UnitsDetails48[[#This Row],[ODS DMC AB109 Units]]","v":0},null,{"$f":"UnitsDetails48[[#This Row],[Rate]]*UnitsDetails48[[#This Row],[ODS AB109 Units]]","v":0},null,{"$f":"UnitsDetails48[[#This Row],[Rate]]*UnitsDetails48[[#This Row],[SUD Non-Billable Units]]","v":0},null,{"$f":"UnitsDetails48[[#This Row],[Rate]]*UnitsDetails48[[#This Row],[Room & Board Units]]","v":0},null,{"$f":"'[4]Final Recon - Summary'!G442","v":0},{"$f":"UnitsDetails48[[#This Row],[ODS DMC General Units]]+UnitsDetails48[[#This Row],[ODS General Units]]+UnitsDetails48[[#This Row],[ODS DMC AB109 Units]]+UnitsDetails48[[#This Row],[ODS AB109 Units]]+UnitsDetails48[[#This Row],[SUD Non-Billable Units]]+UnitsDetails48[[#This Row],[Room & Board Units]]","v":0},0]
[0,{"$f":"'[4]Final Recon - Summary'!B443","v":"Individual - Mental Health Rehabilitation Specialist"},{"$f":"'[4]Final Recon - Summary'!C443","v":"Per Billable Minute"},{"$f":"'[4]Final Recon - Summary'!D443","v":4.0199999999999996},{"$f":"UnitsDetails48[[#This Row],[ODS DMC General Units]]+UnitsDetails48[[#This Row],[ODS General Units]]+UnitsDetails48[[#This Row],[ODS DMC AB109 Units]]+UnitsDetails48[[#This Row],[ODS AB109 Units]]+UnitsDetails48[[#This Row],[Room & Board Units]]+UnitsDetails48[[#This Row],[SUD Non-Billable Units]]","v":0},0,null,0,null,{"$f":"UnitsDetails48[[#This Row],[ODS General Units]]*UnitsDetails48[[#This Row],[Rate]]","v":0},null,{"$f":"UnitsDetails48[[#This Row],[Rate]]*UnitsDetails48[[#This Row],[ODS DMC AB109 Units]]","v":0},null,{"$f":"UnitsDetails48[[#This Row],[Rate]]*UnitsDetails48[[#This Row],[ODS AB109 Units]]","v":0},null,{"$f":"UnitsDetails48[[#This Row],[Rate]]*UnitsDetails48[[#This Row],[SUD Non-Billable Units]]","v":0},null,{"$f":"UnitsDetails48[[#This Row],[Rate]]*UnitsDetails48[[#This Row],[Room & Board Units]]","v":0},null,{"$f":"'[4]Final Recon - Summary'!G443","v":0},{"$f":"UnitsDetails48[[#This Row],[ODS DMC General Units]]+UnitsDetails48[[#This Row],[ODS General Units]]+UnitsDetails48[[#This Row],[ODS DMC AB109 Units]]+UnitsDetails48[[#This Row],[ODS AB109 Units]]+UnitsDetails48[[#This Row],[SUD Non-Billable Units]]+UnitsDetails48[[#This Row],[Room & Board Units]]","v":0},0]
[0,{"$f":"'[4]Final Recon - Summary'!B444","v":"Individual - Nurse Practitioner"},{"$f":"'[4]Final Recon - Summary'!C444","v":"Per Billable Minute"},{"$f":"'[4]Final Recon - Summary'!D444","v":10.23},{"$f":"UnitsDetails48[[#This Row],[ODS DMC General Units]]+UnitsDetails48[[#This Row],[ODS General Units]]+UnitsDetails48[[#This Row],[ODS DMC AB109 Units]]+UnitsDetails48[[#This Row],[ODS AB109 Units]]+UnitsDetails48[[#This Row],[Room & Board Units]]+UnitsDetails48[[#This Row],[SUD Non-Billable Units]]","v":0},0,null,0,null,{"$f":"UnitsDetails48[[#This Row],[ODS General Units]]*UnitsDetails48[[#This Row],[Rate]]","v":0},null,{"$f":"UnitsDetails48[[#This Row],[Rate]]*UnitsDetails48[[#This Row],[ODS DMC AB109 Units]]","v":0},null,{"$f":"UnitsDetails48[[#This Row],[Rate]]*UnitsDetails48[[#This Row],[ODS AB109 Units]]","v":0},null,{"$f":"UnitsDetails48[[#This Row],[Rate]]*UnitsDetails48[[#This Row],[SUD Non-Billable Units]]","v":0},null,{"$f":"UnitsDetails48[[#This Row],[Rate]]*UnitsDetails48[[#This Row],[Room & Board Units]]","v":0},null,{"$f":"'[4]Final Recon - Summary'!G444","v":0},{"$f":"UnitsDetails48[[#This Row],[ODS DMC General Units]]+UnitsDetails48[[#This Row],[ODS General Units]]+UnitsDetails48[[#This Row],[ODS DMC AB109 Units]]+UnitsDetails48[[#This Row],[ODS AB109 Units]]+UnitsDetails48[[#This Row],[SUD Non-Billable Units]]+UnitsDetails48[[#This Row],[Room & Board Units]]","v":0},0]
[0,{"$f":"'[4]Final Recon - Summary'!B445","v":"Individual - Occupational Therapist"},{"$f":"'[4]Final Recon - Summary'!C445","v":"Per Billable Minute"},{"$f":"'[4]Final Recon - Summary'!D445","v":7.13},{"$f":"UnitsDetails48[[#This Row],[ODS DMC General Units]]+UnitsDetails48[[#This Row],[ODS General Units]]+UnitsDetails48[[#This Row],[ODS DMC AB109 Units]]+UnitsDetails48[[#This Row],[ODS AB109 Units]]+UnitsDetails48[[#This Row],[Room & Board Units]]+UnitsDetails48[[#This Row],[SUD Non-Billable Units]]","v":0},0,null,0,null,{"$f":"UnitsDetails48[[#This Row],[ODS General Units]]*UnitsDetails48[[#This Row],[Rate]]","v":0},null,{"$f":"UnitsDetails48[[#This Row],[Rate]]*UnitsDetails48[[#This Row],[ODS DMC AB109 Units]]","v":0},null,{"$f":"UnitsDetails48[[#This Row],[Rate]]*UnitsDetails48[[#This Row],[ODS AB109 Units]]","v":0},null,{"$f":"UnitsDetails48[[#This Row],[Rate]]*UnitsDetails48[[#This Row],[SUD Non-Billable Units]]","v":0},null,{"$f":"UnitsDetails48[[#This Row],[Rate]]*UnitsDetails48[[#This Row],[Room & Board Units]]","v":0},null,{"$f":"'[4]Final Recon - Summary'!G445","v":0},{"$f":"UnitsDetails48[[#This Row],[ODS DMC General Units]]+UnitsDetails48[[#This Row],[ODS General Units]]+UnitsDetails48[[#This Row],[ODS DMC AB109 Units]]+UnitsDetails48[[#This Row],[ODS AB109 Units]]+UnitsDetails48[[#This Row],[SUD Non-Billable Units]]+UnitsDetails48[[#This Row],[Room & Board Units]]","v":0},0]
[0,{"$f":"'[4]Final Recon - Summary'!B446","v":"Individual - Other Qualified Providers - Other Designated MH staff that bill medical"},{"$f":"'[4]Final Recon - Summary'!C446","v":"Per Billable Minute"},{"$f":"'[4]Final Recon - Summary'!D446","v":4.0199999999999996},{"$f":"UnitsDetails48[[#This Row],[ODS DMC General Units]]+UnitsDetails48[[#This Row],[ODS General Units]]+UnitsDetails48[[#This Row],[ODS DMC AB109 Units]]+UnitsDetails48[[#This Row],[ODS AB109 Units]]+UnitsDetails48[[#This Row],[Room & Board Units]]+UnitsDetails48[[#This Row],[SUD Non-Billable Units]]","v":0},0,null,0,null,{"$f":"UnitsDetails48[[#This Row],[ODS General Units]]*UnitsDetails48[[#This Row],[Rate]]","v":0},null,{"$f":"UnitsDetails48[[#This Row],[Rate]]*UnitsDetails48[[#This Row],[ODS DMC AB109 Units]]","v":0},null,{"$f":"UnitsDetails48[[#This Row],[Rate]]*UnitsDetails48[[#This Row],[ODS AB109 Units]]","v":0},null,{"$f":"UnitsDetails48[[#This Row],[Rate]]*UnitsDetails48[[#This Row],[SUD Non-Billable Units]]","v":0},null,{"$f":"UnitsDetails48[[#This Row],[Rate]]*UnitsDetails48[[#This Row],[Room & Board Units]]","v":0},null,{"$f":"'[4]Final Recon - Summary'!G446","v":0},{"$f":"UnitsDetails48[[#This Row],[ODS DMC General Units]]+UnitsDetails48[[#This Row],[ODS General Units]]+UnitsDetails48[[#This Row],[ODS DMC AB109 Units]]+UnitsDetails48[[#This Row],[ODS AB109 Units]]+UnitsDetails48[[#This Row],[SUD Non-Billable Units]]+UnitsDetails48[[#This Row],[Room & Board Units]]","v":0},0]
[0,{"$f":"'[4]Final Recon - Summary'!B447","v":"Individual - Peer Support Specialist"},{"$f":"'[4]Final Recon - Summary'!C447","v":"Per Billable Minute"},{"$f":"'[4]Final Recon - Summary'!D447","v":4.22},{"$f":"UnitsDetails48[[#This Row],[ODS DMC General Units]]+UnitsDetails48[[#This Row],[ODS General Units]]+UnitsDetails48[[#This Row],[ODS DMC AB109 Units]]+UnitsDetails48[[#This Row],[ODS AB109 Units]]+UnitsDetails48[[#This Row],[Room & Board Units]]+UnitsDetails48[[#This Row],[SUD Non-Billable Units]]","v":0},0,null,0,null,{"$f":"UnitsDetails48[[#This Row],[ODS General Units]]*UnitsDetails48[[#This Row],[Rate]]","v":0},null,{"$f":"UnitsDetails48[[#This Row],[Rate]]*UnitsDetails48[[#This Row],[ODS DMC AB109 Units]]","v":0},null,{"$f":"UnitsDetails48[[#This Row],[Rate]]*UnitsDetails48[[#This Row],[ODS AB109 Units]]","v":0},null,{"$f":"UnitsDetails48[[#This Row],[Rate]]*UnitsDetails48[[#This Row],[SUD Non-Billable Units]]","v":0},null,{"$f":"UnitsDetails48[[#This Row],[Rate]]*UnitsDetails48[[#This Row],[Room & Board Units]]","v":0},null,{"$f":"'[4]Final Recon - Summary'!G447","v":0},{"$f":"UnitsDetails48[[#This Row],[ODS DMC General Units]]+UnitsDetails48[[#This Row],[ODS General Units]]+UnitsDetails48[[#This Row],[ODS DMC AB109 Units]]+UnitsDetails48[[#This Row],[ODS AB109 Units]]+UnitsDetails48[[#This Row],[SUD Non-Billable Units]]+UnitsDetails48[[#This Row],[Room & Board Units]]","v":0},0]
[0,{"$f":"'[4]Final Recon - Summary'!B448","v":"Individual - Physician Assistant"},{"$f":"'[4]Final Recon - Summary'!C448","v":"Per Billable Minute"},{"$f":"'[4]Final Recon - Summary'!D448","v":9.23},{"$f":"UnitsDetails48[[#This Row],[ODS DMC General Units]]+UnitsDetails48[[#This Row],[ODS General Units]]+UnitsDetails48[[#This Row],[ODS DMC AB109 Units]]+UnitsDetails48[[#This Row],[ODS AB109 Units]]+UnitsDetails48[[#This Row],[Room & Board Units]]+UnitsDetails48[[#This Row],[SUD Non-Billable Units]]","v":0},0,null,0,null,{"$f":"UnitsDetails48[[#This Row],[ODS General Units]]*UnitsDetails48[[#This Row],[Rate]]","v":0},null,{"$f":"UnitsDetails48[[#This Row],[Rate]]*UnitsDetails48[[#This Row],[ODS DMC AB109 Units]]","v":0},null,{"$f":"UnitsDetails48[[#This Row],[Rate]]*UnitsDetails48[[#This Row],[ODS AB109 Units]]","v":0},null,{"$f":"UnitsDetails48[[#This Row],[Rate]]*UnitsDetails48[[#This Row],[SUD Non-Billable Units]]","v":0},null,{"$f":"UnitsDetails48[[#This Row],[Rate]]*UnitsDetails48[[#This Row],[Room & Board Units]]","v":0},null,{"$f":"'[4]Final Recon - Summary'!G448","v":0},{"$f":"UnitsDetails48[[#This Row],[ODS DMC General Units]]+UnitsDetails48[[#This Row],[ODS General Units]]+UnitsDetails48[[#This Row],[ODS DMC AB109 Units]]+UnitsDetails48[[#This Row],[ODS AB109 Units]]+UnitsDetails48[[#This Row],[SUD Non-Billable Units]]+UnitsDetails48[[#This Row],[Room & Board Units]]","v":0},0]
[0,{"$f":"'[4]Final Recon - Summary'!B449","v":"Individual - Psychologist/Pre-licensed Psychologist"},{"$f":"'[4]Final Recon - Summary'!C449","v":"Per Billable Minute"},{"$f":"'[4]Final Recon - Summary'!D449","v":8.2799999999999994},{"$f":"UnitsDetails48[[#This Row],[ODS DMC General Units]]+UnitsDetails48[[#This Row],[ODS General Units]]+UnitsDetails48[[#This Row],[ODS DMC AB109 Units]]+UnitsDetails48[[#This Row],[ODS AB109 Units]]+UnitsDetails48[[#This Row],[Room & Board Units]]+UnitsDetails48[[#This Row],[SUD Non-Billable Units]]","v":0},0,null,0,null,{"$f":"UnitsDetails48[[#This Row],[ODS General Units]]*UnitsDetails48[[#This Row],[Rate]]","v":0},null,{"$f":"UnitsDetails48[[#This Row],[Rate]]*UnitsDetails48[[#This Row],[ODS DMC AB109 Units]]","v":0},null,{"$f":"UnitsDetails48[[#This Row],[Rate]]*UnitsDetails48[[#This Row],[ODS AB109 Units]]","v":0},null,{"$f":"UnitsDetails48[[#This Row],[Rate]]*UnitsDetails48[[#This Row],[SUD Non-Billable Units]]","v":0},null,{"$f":"UnitsDetails48[[#This Row],[Rate]]*UnitsDetails48[[#This Row],[Room & Board Units]]","v":0},null,{"$f":"'[4]Final Recon - Summary'!G449","v":0},{"$f":"UnitsDetails48[[#This Row],[ODS DMC General Units]]+UnitsDetails48[[#This Row],[ODS General Units]]+UnitsDetails48[[#This Row],[ODS DMC AB109 Units]]+UnitsDetails48[[#This Row],[ODS AB109 Units]]+UnitsDetails48[[#This Row],[SUD Non-Billable Units]]+UnitsDetails48[[#This Row],[Room & Board Units]]","v":0},0]
[0,{"$f":"'[4]Final Recon - Summary'!B450","v":"Individual - Psychiatrist/ Contracted Psychiatrist/Licensed Physician (MD)"},{"$f":"'[4]Final Recon - Summary'!C450","v":"Per Billable Minute"},{"$f":"'[4]Final Recon - Summary'!D450","v":11.57},{"$f":"UnitsDetails48[[#This Row],[ODS DMC General Units]]+UnitsDetails48[[#This Row],[ODS General Units]]+UnitsDetails48[[#This Row],[ODS DMC AB109 Units]]+UnitsDetails48[[#This Row],[ODS AB109 Units]]+UnitsDetails48[[#This Row],[Room & Board Units]]+UnitsDetails48[[#This Row],[SUD Non-Billable Units]]","v":0},0,null,0,null,{"$f":"UnitsDetails48[[#This Row],[ODS General Units]]*UnitsDetails48[[#This Row],[Rate]]","v":0},null,{"$f":"UnitsDetails48[[#This Row],[Rate]]*UnitsDetails48[[#This Row],[ODS DMC AB109 Units]]","v":0},null,{"$f":"UnitsDetails48[[#This Row],[Rate]]*UnitsDetails48[[#This Row],[ODS AB109 Units]]","v":0},null,{"$f":"UnitsDetails48[[#This Row],[Rate]]*UnitsDetails48[[#This Row],[SUD Non-Billable Units]]","v":0},null,{"$f":"UnitsDetails48[[#This Row],[Rate]]*UnitsDetails48[[#This Row],[Room & Board Units]]","v":0},null,{"$f":"'[4]Final Recon - Summary'!G450","v":0},{"$f":"UnitsDetails48[[#This Row],[ODS DMC General Units]]+UnitsDetails48[[#This Row],[ODS General Units]]+UnitsDetails48[[#This Row],[ODS DMC AB109 Units]]+UnitsDetails48[[#This Row],[ODS AB109 Units]]+UnitsDetails48[[#This Row],[SUD Non-Billable Units]]+UnitsDetails48[[#This Row],[Room & Board Units]]","v":0},0]
[0,{"$f":"'[4]Final Recon - Summary'!B451","v":"Individual - Registered Nurse (RN)"},{"$f":"'[4]Final Recon - Summary'!C451","v":"Per Billable Minute"},{"$f":"'[4]Final Recon - Summary'!D451","v":8.36},{"$f":"UnitsDetails48[[#This Row],[ODS DMC General Units]]+UnitsDetails48[[#This Row],[ODS General Units]]+UnitsDetails48[[#This Row],[ODS DMC AB109 Units]]+UnitsDetails48[[#This Row],[ODS AB109 Units]]+UnitsDetails48[[#This Row],[Room & Board Units]]+UnitsDetails48[[#This Row],[SUD Non-Billable Units]]","v":0},0,null,0,null,{"$f":"UnitsDetails48[[#This Row],[ODS General Units]]*UnitsDetails48[[#This Row],[Rate]]","v":0},null,{"$f":"UnitsDetails48[[#This Row],[Rate]]*UnitsDetails48[[#This Row],[ODS DMC AB109 Units]]","v":0},null,{"$f":"UnitsDetails48[[#This Row],[Rate]]*UnitsDetails48[[#This Row],[ODS AB109 Units]]","v":0},null,{"$f":"UnitsDetails48[[#This Row],[Rate]]*UnitsDetails48[[#This Row],[SUD Non-Billable Units]]","v":0},null,{"$f":"UnitsDetails48[[#This Row],[Rate]]*UnitsDetails48[[#This Row],[Room & Board Units]]","v":0},null,{"$f":"'[4]Final Recon - Summary'!G451","v":0},{"$f":"UnitsDetails48[[#This Row],[ODS DMC General Units]]+UnitsDetails48[[#This Row],[ODS General Units]]+UnitsDetails48[[#This Row],[ODS DMC AB109 Units]]+UnitsDetails48[[#This Row],[ODS AB109 Units]]+UnitsDetails48[[#This Row],[SUD Non-Billable Units]]+UnitsDetails48[[#This Row],[Room & Board Units]]","v":0},0]
[0,{"$f":"'[4]Final Recon - Summary'!B452","v":"Individual - Registered Pharmacist"},{"$f":"'[4]Final Recon - Summary'!C452","v":"Per Billable Minute"},{"$f":"'[4]Final Recon - Summary'!D452","v":9.84},{"$f":"UnitsDetails48[[#This Row],[ODS DMC General Units]]+UnitsDetails48[[#This Row],[ODS General Units]]+UnitsDetails48[[#This Row],[ODS DMC AB109 Units]]+UnitsDetails48[[#This Row],[ODS AB109 Units]]+UnitsDetails48[[#This Row],[Room & Board Units]]+UnitsDetails48[[#This Row],[SUD Non-Billable Units]]","v":0},0,null,0,null,{"$f":"UnitsDetails48[[#This Row],[ODS General Units]]*UnitsDetails48[[#This Row],[Rate]]","v":0},null,{"$f":"UnitsDetails48[[#This Row],[Rate]]*UnitsDetails48[[#This Row],[ODS DMC AB109 Units]]","v":0},null,{"$f":"UnitsDetails48[[#This Row],[Rate]]*UnitsDetails48[[#This Row],[ODS AB109 Units]]","v":0},null,{"$f":"UnitsDetails48[[#This Row],[Rate]]*UnitsDetails48[[#This Row],[SUD Non-Billable Units]]","v":0},null,{"$f":"UnitsDetails48[[#This Row],[Rate]]*UnitsDetails48[[#This Row],[Room & Board Units]]","v":0},null,{"$f":"'[4]Final Recon - Summary'!G452","v":0},{"$f":"UnitsDetails48[[#This Row],[ODS DMC General Units]]+UnitsDetails48[[#This Row],[ODS General Units]]+UnitsDetails48[[#This Row],[ODS DMC AB109 Units]]+UnitsDetails48[[#This Row],[ODS AB109 Units]]+UnitsDetails48[[#This Row],[SUD Non-Billable Units]]+UnitsDetails48[[#This Row],[Room & Board Units]]","v":0},0]
[0,{"$f":"'[4]Final Recon - Summary'!B453","v":"Individual - Interpreter Services"},{"$f":"'[4]Final Recon - Summary'!C453","v":"Per Billable Minute"},{"$f":"'[4]Final Recon - Summary'!D453","v":2.19},{"$f":"UnitsDetails48[[#This Row],[ODS DMC General Units]]+UnitsDetails48[[#This Row],[ODS General Units]]+UnitsDetails48[[#This Row],[ODS DMC AB109 Units]]+UnitsDetails48[[#This Row],[ODS AB109 Units]]+UnitsDetails48[[#This Row],[Room & Board Units]]+UnitsDetails48[[#This Row],[SUD Non-Billable Units]]","v":0},0,null,0,null,{"$f":"UnitsDetails48[[#This Row],[ODS General Units]]*UnitsDetails48[[#This Row],[Rate]]","v":0},null,{"$f":"UnitsDetails48[[#This Row],[Rate]]*UnitsDetails48[[#This Row],[ODS DMC AB109 Units]]","v":0},null,{"$f":"UnitsDetails48[[#This Row],[Rate]]*UnitsDetails48[[#This Row],[ODS AB109 Units]]","v":0},null,{"$f":"UnitsDetails48[[#This Row],[Rate]]*UnitsDetails48[[#This Row],[SUD Non-Billable Units]]","v":0},null,{"$f":"UnitsDetails48[[#This Row],[Rate]]*UnitsDetails48[[#This Row],[Room & Board Units]]","v":0},null,{"$f":"'[4]Final Recon - Summary'!G453","v":0},{"$f":"UnitsDetails48[[#This Row],[ODS DMC General Units]]+UnitsDetails48[[#This Row],[ODS General Units]]+UnitsDetails48[[#This Row],[ODS DMC AB109 Units]]+UnitsDetails48[[#This Row],[ODS AB109 Units]]+UnitsDetails48[[#This Row],[SUD Non-Billable Units]]+UnitsDetails48[[#This Row],[Room & Board Units]]","v":0},0]
[0,{"$f":"'[4]Final Recon - Summary'!B454","v":"Interactive Complexity"},{"$f":"'[4]Final Recon - Summary'!C454","v":"Per Occurrence"},{"$f":"'[4]Final Recon - Summary'!D454","v":14.61},{"$f":"UnitsDetails48[[#This Row],[ODS DMC General Units]]+UnitsDetails48[[#This Row],[ODS General Units]]+UnitsDetails48[[#This Row],[ODS DMC AB109 Units]]+UnitsDetails48[[#This Row],[ODS AB109 Units]]+UnitsDetails48[[#This Row],[Room & Board Units]]+UnitsDetails48[[#This Row],[SUD Non-Billable Units]]","v":0},0,null,0,null,{"$f":"UnitsDetails48[[#This Row],[ODS General Units]]*UnitsDetails48[[#This Row],[Rate]]","v":0},null,{"$f":"UnitsDetails48[[#This Row],[Rate]]*UnitsDetails48[[#This Row],[ODS DMC AB109 Units]]","v":0},null,{"$f":"UnitsDetails48[[#This Row],[Rate]]*UnitsDetails48[[#This Row],[ODS AB109 Units]]","v":0},null,{"$f":"UnitsDetails48[[#This Row],[Rate]]*UnitsDetails48[[#This Row],[SUD Non-Billable Units]]","v":0},null,{"$f":"UnitsDetails48[[#This Row],[Rate]]*UnitsDetails48[[#This Row],[Room & Board Units]]","v":0},null,{"$f":"'[4]Final Recon - Summary'!G454","v":0},{"$f":"UnitsDetails48[[#This Row],[ODS DMC General Units]]+UnitsDetails48[[#This Row],[ODS General Units]]+UnitsDetails48[[#This Row],[ODS DMC AB109 Units]]+UnitsDetails48[[#This Row],[ODS AB109 Units]]+UnitsDetails48[[#This Row],[SUD Non-Billable Units]]+UnitsDetails48[[#This Row],[Room & Board Units]]","v":0},0]
[0,{"$f":"'[4]Final Recon - Summary'!B455","v":"Parent-Child Interaction Therapy (PCIT Modifier 22)"},{"$f":"'[4]Final Recon - Summary'!C455","v":"Per Occurrence"},{"$f":"'[4]Final Recon - Summary'!D455","v":2.56},{"$f":"UnitsDetails48[[#This Row],[ODS DMC General Units]]+UnitsDetails48[[#This Row],[ODS General Units]]+UnitsDetails48[[#This Row],[ODS DMC AB109 Units]]+UnitsDetails48[[#This Row],[ODS AB109 Units]]+UnitsDetails48[[#This Row],[Room & Board Units]]+UnitsDetails48[[#This Row],[SUD Non-Billable Units]]","v":0},0,null,0,null,{"$f":"UnitsDetails48[[#This Row],[ODS General Units]]*UnitsDetails48[[#This Row],[Rate]]","v":0},null,{"$f":"UnitsDetails48[[#This Row],[Rate]]*UnitsDetails48[[#This Row],[ODS DMC AB109 Units]]","v":0},null,{"$f":"UnitsDetails48[[#This Row],[Rate]]*UnitsDetails48[[#This Row],[ODS AB109 Units]]","v":0},null,{"$f":"UnitsDetails48[[#This Row],[Rate]]*UnitsDetails48[[#This Row],[SUD Non-Billable Units]]","v":0},null,{"$f":"UnitsDetails48[[#This Row],[Rate]]*UnitsDetails48[[#This Row],[Room & Board Units]]","v":0},null,{"$f":"'[4]Final Recon - Summary'!G455","v":0},{"$f":"UnitsDetails48[[#This Row],[ODS DMC General Units]]+UnitsDetails48[[#This Row],[ODS General Units]]+UnitsDetails48[[#This Row],[ODS DMC AB109 Units]]+UnitsDetails48[[#This Row],[ODS AB109 Units]]+UnitsDetails48[[#This Row],[SUD Non-Billable Units]]+UnitsDetails48[[#This Row],[Room & Board Units]]","v":0},0]
[0,{"$f":"'[4]Final Recon - Summary'!B456","v":"Group - Alcohol and Drug Counselor"},{"$f":"'[4]Final Recon - Summary'!C456","v":"Per Billable Minute"},{"$f":"'[4]Final Recon - Summary'!D456","v":0.98},{"$f":"UnitsDetails48[[#This Row],[ODS DMC General Units]]+UnitsDetails48[[#This Row],[ODS General Units]]+UnitsDetails48[[#This Row],[ODS DMC AB109 Units]]+UnitsDetails48[[#This Row],[ODS AB109 Units]]+UnitsDetails48[[#This Row],[Room & Board Units]]+UnitsDetails48[[#This Row],[SUD Non-Billable Units]]","v":0},0,null,0,null,{"$f":"UnitsDetails48[[#This Row],[ODS General Units]]*UnitsDetails48[[#This Row],[Rate]]","v":0},null,{"$f":"UnitsDetails48[[#This Row],[Rate]]*UnitsDetails48[[#This Row],[ODS DMC AB109 Units]]","v":0},null,{"$f":"UnitsDetails48[[#This Row],[Rate]]*UnitsDetails48[[#This Row],[ODS AB109 Units]]","v":0},null,{"$f":"UnitsDetails48[[#This Row],[Rate]]*UnitsDetails48[[#This Row],[SUD Non-Billable Units]]","v":0},null,{"$f":"UnitsDetails48[[#This Row],[Rate]]*UnitsDetails48[[#This Row],[Room & Board Units]]","v":0},null,{"$f":"'[4]Final Recon - Summary'!G456","v":0},{"$f":"UnitsDetails48[[#This Row],[ODS DMC General Units]]+UnitsDetails48[[#This Row],[ODS General Units]]+UnitsDetails48[[#This Row],[ODS DMC AB109 Units]]+UnitsDetails48[[#This Row],[ODS AB109 Units]]+UnitsDetails48[[#This Row],[SUD Non-Billable Units]]+UnitsDetails48[[#This Row],[Room & Board Units]]","v":0},0]
[0,{"$f":"'[4]Final Recon - Summary'!B457","v":"Group - Clinical Nurse Specialist"},{"$f":"'[4]Final Recon - Summary'!C457","v":"Per Billable Minute"},{"$f":"'[4]Final Recon - Summary'!D457","v":2.2799999999999998},{"$f":"UnitsDetails48[[#This Row],[ODS DMC General Units]]+UnitsDetails48[[#This Row],[ODS General Units]]+UnitsDetails48[[#This Row],[ODS DMC AB109 Units]]+UnitsDetails48[[#This Row],[ODS AB109 Units]]+UnitsDetails48[[#This Row],[Room & Board Units]]+UnitsDetails48[[#This Row],[SUD Non-Billable Units]]","v":0},0,null,0,null,{"$f":"UnitsDetails48[[#This Row],[ODS General Units]]*UnitsDetails48[[#This Row],[Rate]]","v":0},null,{"$f":"UnitsDetails48[[#This Row],[Rate]]*UnitsDetails48[[#This Row],[ODS DMC AB109 Units]]","v":0},null,{"$f":"UnitsDetails48[[#This Row],[Rate]]*UnitsDetails48[[#This Row],[ODS AB109 Units]]","v":0},null,{"$f":"UnitsDetails48[[#This Row],[Rate]]*UnitsDetails48[[#This Row],[SUD Non-Billable Units]]","v":0},null,{"$f":"UnitsDetails48[[#This Row],[Rate]]*UnitsDetails48[[#This Row],[Room & Board Units]]","v":0},null,{"$f":"'[4]Final Recon - Summary'!G457","v":0},{"$f":"UnitsDetails48[[#This Row],[ODS DMC General Units]]+UnitsDetails48[[#This Row],[ODS General Units]]+UnitsDetails48[[#This Row],[ODS DMC AB109 Units]]+UnitsDetails48[[#This Row],[ODS AB109 Units]]+UnitsDetails48[[#This Row],[SUD Non-Billable Units]]+UnitsDetails48[[#This Row],[Room & Board Units]]","v":0},0]
[0,{"$f":"'[4]Final Recon - Summary'!B458","v":"Group - Community Health Worker (CPT 98961)"},{"$f":"'[4]Final Recon - Summary'!C458","v":"Per Billable Minute"},{"$f":"'[4]Final Recon - Summary'!D458","v":1.3800000000000001},{"$f":"UnitsDetails48[[#This Row],[ODS DMC General Units]]+UnitsDetails48[[#This Row],[ODS General Units]]+UnitsDetails48[[#This Row],[ODS DMC AB109 Units]]+UnitsDetails48[[#This Row],[ODS AB109 Units]]+UnitsDetails48[[#This Row],[Room & Board Units]]+UnitsDetails48[[#This Row],[SUD Non-Billable Units]]","v":0},0,null,0,null,{"$f":"UnitsDetails48[[#This Row],[ODS General Units]]*UnitsDetails48[[#This Row],[Rate]]","v":0},null,{"$f":"UnitsDetails48[[#This Row],[Rate]]*UnitsDetails48[[#This Row],[ODS DMC AB109 Units]]","v":0},null,{"$f":"UnitsDetails48[[#This Row],[Rate]]*UnitsDetails48[[#This Row],[ODS AB109 Units]]","v":0},null,{"$f":"UnitsDetails48[[#This Row],[Rate]]*UnitsDetails48[[#This Row],[SUD Non-Billable Units]]","v":0},null,{"$f":"UnitsDetails48[[#This Row],[Rate]]*UnitsDetails48[[#This Row],[Room & Board Units]]","v":0},null,{"$f":"'[4]Final Recon - Summary'!G458","v":0},{"$f":"UnitsDetails48[[#This Row],[ODS DMC General Units]]+UnitsDetails48[[#This Row],[ODS General Units]]+UnitsDetails48[[#This Row],[ODS DMC AB109 Units]]+UnitsDetails48[[#This Row],[ODS AB109 Units]]+UnitsDetails48[[#This Row],[SUD Non-Billable Units]]+UnitsDetails48[[#This Row],[Room & Board Units]]","v":0},0]
[0,{"$f":"'[4]Final Recon - Summary'!B459","v":"Group - Community Health Worker (CPT 98962)"},{"$f":"'[4]Final Recon - Summary'!C459","v":"Per Billable Minute"},{"$f":"'[4]Final Recon - Summary'!D459","v":0.63},{"$f":"UnitsDetails48[[#This Row],[ODS DMC General Units]]+UnitsDetails48[[#This Row],[ODS General Units]]+UnitsDetails48[[#This Row],[ODS DMC AB109 Units]]+UnitsDetails48[[#This Row],[ODS AB109 Units]]+UnitsDetails48[[#This Row],[Room & Board Units]]+UnitsDetails48[[#This Row],[SUD Non-Billable Units]]","v":0},0,null,0,null,{"$f":"UnitsDetails48[[#This Row],[ODS General Units]]*UnitsDetails48[[#This Row],[Rate]]","v":0},null,{"$f":"UnitsDetails48[[#This Row],[Rate]]*UnitsDetails48[[#This Row],[ODS DMC AB109 Units]]","v":0},null,{"$f":"UnitsDetails48[[#This Row],[Rate]]*UnitsDetails48[[#This Row],[ODS AB109 Units]]","v":0},null,{"$f":"UnitsDetails48[[#This Row],[Rate]]*UnitsDetails48[[#This Row],[SUD Non-Billable Units]]","v":0},null,{"$f":"UnitsDetails48[[#This Row],[Rate]]*UnitsDetails48[[#This Row],[Room & Board Units]]","v":0},null,{"$f":"'[4]Final Recon - Summary'!G459","v":0},{"$f":"UnitsDetails48[[#This Row],[ODS DMC General Units]]+UnitsDetails48[[#This Row],[ODS General Units]]+UnitsDetails48[[#This Row],[ODS DMC AB109 Units]]+UnitsDetails48[[#This Row],[ODS AB109 Units]]+UnitsDetails48[[#This Row],[SUD Non-Billable Units]]+UnitsDetails48[[#This Row],[Room & Board Units]]","v":0},0]
[0,{"$f":"'[4]Final Recon - Summary'!B460","v":"Group - Licensed Psychiatric Technician"},{"$f":"'[4]Final Recon - Summary'!C460","v":"Per Billable Minute"},{"$f":"'[4]Final Recon - Summary'!D460","v":0.84000000000000008},{"$f":"UnitsDetails48[[#This Row],[ODS DMC General Units]]+UnitsDetails48[[#This Row],[ODS General Units]]+UnitsDetails48[[#This Row],[ODS DMC AB109 Units]]+UnitsDetails48[[#This Row],[ODS AB109 Units]]+UnitsDetails48[[#This Row],[Room & Board Units]]+UnitsDetails48[[#This Row],[SUD Non-Billable Units]]","v":0},0,null,0,null,{"$f":"UnitsDetails48[[#This Row],[ODS General Units]]*UnitsDetails48[[#This Row],[Rate]]","v":0},null,{"$f":"UnitsDetails48[[#This Row],[Rate]]*UnitsDetails48[[#This Row],[ODS DMC AB109 Units]]","v":0},null,{"$f":"UnitsDetails48[[#This Row],[Rate]]*UnitsDetails48[[#This Row],[ODS AB109 Units]]","v":0},null,{"$f":"UnitsDetails48[[#This Row],[Rate]]*UnitsDetails48[[#This Row],[SUD Non-Billable Units]]","v":0},null,{"$f":"UnitsDetails48[[#This Row],[Rate]]*UnitsDetails48[[#This Row],[Room & Board Units]]","v":0},null,{"$f":"'[4]Final Recon - Summary'!G460","v":0},{"$f":"UnitsDetails48[[#This Row],[ODS DMC General Units]]+UnitsDetails48[[#This Row],[ODS General Units]]+UnitsDetails48[[#This Row],[ODS DMC AB109 Units]]+UnitsDetails48[[#This Row],[ODS AB109 Units]]+UnitsDetails48[[#This Row],[SUD Non-Billable Units]]+UnitsDetails48[[#This Row],[Room & Board Units]]","v":0},0]
[0,{"$f":"'[4]Final Recon - Summary'!B461","v":"Group - LPHA (MFT  LCSW  LPCC)/Intern or Waivered LPHA (MFT  LCSW  LPCC)"},{"$f":"'[4]Final Recon - Summary'!C461","v":"Per Billable Minute"},{"$f":"'[4]Final Recon - Summary'!D461","v":1.1900000000000002},{"$f":"UnitsDetails48[[#This Row],[ODS DMC General Units]]+UnitsDetails48[[#This Row],[ODS General Units]]+UnitsDetails48[[#This Row],[ODS DMC AB109 Units]]+UnitsDetails48[[#This Row],[ODS AB109 Units]]+UnitsDetails48[[#This Row],[Room & Board Units]]+UnitsDetails48[[#This Row],[SUD Non-Billable Units]]","v":0},0,null,0,null,{"$f":"UnitsDetails48[[#This Row],[ODS General Units]]*UnitsDetails48[[#This Row],[Rate]]","v":0},null,{"$f":"UnitsDetails48[[#This Row],[Rate]]*UnitsDetails48[[#This Row],[ODS DMC AB109 Units]]","v":0},null,{"$f":"UnitsDetails48[[#This Row],[Rate]]*UnitsDetails48[[#This Row],[ODS AB109 Units]]","v":0},null,{"$f":"UnitsDetails48[[#This Row],[Rate]]*UnitsDetails48[[#This Row],[SUD Non-Billable Units]]","v":0},null,{"$f":"UnitsDetails48[[#This Row],[Rate]]*UnitsDetails48[[#This Row],[Room & Board Units]]","v":0},null,{"$f":"'[4]Final Recon - Summary'!G461","v":0},{"$f":"UnitsDetails48[[#This Row],[ODS DMC General Units]]+UnitsDetails48[[#This Row],[ODS General Units]]+UnitsDetails48[[#This Row],[ODS DMC AB109 Units]]+UnitsDetails48[[#This Row],[ODS AB109 Units]]+UnitsDetails48[[#This Row],[SUD Non-Billable Units]]+UnitsDetails48[[#This Row],[Room & Board Units]]","v":0},0]
[0,{"$f":"'[4]Final Recon - Summary'!B462","v":"Group - Licensed Vocational Nurse (LVN)"},{"$f":"'[4]Final Recon - Summary'!C462","v":"Per Billable Minute"},{"$f":"'[4]Final Recon - Summary'!D462","v":0.98},{"$f":"UnitsDetails48[[#This Row],[ODS DMC General Units]]+UnitsDetails48[[#This Row],[ODS General Units]]+UnitsDetails48[[#This Row],[ODS DMC AB109 Units]]+UnitsDetails48[[#This Row],[ODS AB109 Units]]+UnitsDetails48[[#This Row],[Room & Board Units]]+UnitsDetails48[[#This Row],[SUD Non-Billable Units]]","v":0},0,null,0,null,{"$f":"UnitsDetails48[[#This Row],[ODS General Units]]*UnitsDetails48[[#This Row],[Rate]]","v":0},null,{"$f":"UnitsDetails48[[#This Row],[Rate]]*UnitsDetails48[[#This Row],[ODS DMC AB109 Units]]","v":0},null,{"$f":"UnitsDetails48[[#This Row],[Rate]]*UnitsDetails48[[#This Row],[ODS AB109 Units]]","v":0},null,{"$f":"UnitsDetails48[[#This Row],[Rate]]*UnitsDetails48[[#This Row],[SUD Non-Billable Units]]","v":0},null,{"$f":"UnitsDetails48[[#This Row],[Rate]]*UnitsDetails48[[#This Row],[Room & Board Units]]","v":0},null,{"$f":"'[4]Final Recon - Summary'!G462","v":0},{"$f":"UnitsDetails48[[#This Row],[ODS DMC General Units]]+UnitsDetails48[[#This Row],[ODS General Units]]+UnitsDetails48[[#This Row],[ODS DMC AB109 Units]]+UnitsDetails48[[#This Row],[ODS AB109 Units]]+UnitsDetails48[[#This Row],[SUD Non-Billable Units]]+UnitsDetails48[[#This Row],[Room & Board Units]]","v":0},0]
[0,{"$f":"'[4]Final Recon - Summary'!B463","v":"Group - Medical Assistant"},{"$f":"'[4]Final Recon - Summary'!C463","v":"Per Billable Minute"},{"$f":"'[4]Final Recon - Summary'!D463","v":0.68},{"$f":"UnitsDetails48[[#This Row],[ODS DMC General Units]]+UnitsDetails48[[#This Row],[ODS General Units]]+UnitsDetails48[[#This Row],[ODS DMC AB109 Units]]+UnitsDetails48[[#This Row],[ODS AB109 Units]]+UnitsDetails48[[#This Row],[Room & Board Units]]+UnitsDetails48[[#This Row],[SUD Non-Billable Units]]","v":0},0,null,0,null,{"$f":"UnitsDetails48[[#This Row],[ODS General Units]]*UnitsDetails48[[#This Row],[Rate]]","v":0},null,{"$f":"UnitsDetails48[[#This Row],[Rate]]*UnitsDetails48[[#This Row],[ODS DMC AB109 Units]]","v":0},null,{"$f":"UnitsDetails48[[#This Row],[Rate]]*UnitsDetails48[[#This Row],[ODS AB109 Units]]","v":0},null,{"$f":"UnitsDetails48[[#This Row],[Rate]]*UnitsDetails48[[#This Row],[SUD Non-Billable Units]]","v":0},null,{"$f":"UnitsDetails48[[#This Row],[Rate]]*UnitsDetails48[[#This Row],[Room & Board Units]]","v":0},null,{"$f":"'[4]Final Recon - Summary'!G463","v":0},{"$f":"UnitsDetails48[[#This Row],[ODS DMC General Units]]+UnitsDetails48[[#This Row],[ODS General Units]]+UnitsDetails48[[#This Row],[ODS DMC AB109 Units]]+UnitsDetails48[[#This Row],[ODS AB109 Units]]+UnitsDetails48[[#This Row],[SUD Non-Billable Units]]+UnitsDetails48[[#This Row],[Room & Board Units]]","v":0},0]
[0,{"$f":"'[4]Final Recon - Summary'!B464","v":"Group - Mental Health Rehabilitation Specialist"},{"$f":"'[4]Final Recon - Summary'!C464","v":"Per Billable Minute"},{"$f":"'[4]Final Recon - Summary'!D464","v":0.89999999999999991},{"$f":"UnitsDetails48[[#This Row],[ODS DMC General Units]]+UnitsDetails48[[#This Row],[ODS General Units]]+UnitsDetails48[[#This Row],[ODS DMC AB109 Units]]+UnitsDetails48[[#This Row],[ODS AB109 Units]]+UnitsDetails48[[#This Row],[Room & Board Units]]+UnitsDetails48[[#This Row],[SUD Non-Billable Units]]","v":0},0,null,0,null,{"$f":"UnitsDetails48[[#This Row],[ODS General Units]]*UnitsDetails48[[#This Row],[Rate]]","v":0},null,{"$f":"UnitsDetails48[[#This Row],[Rate]]*UnitsDetails48[[#This Row],[ODS DMC AB109 Units]]","v":0},null,{"$f":"UnitsDetails48[[#This Row],[Rate]]*UnitsDetails48[[#This Row],[ODS AB109 Units]]","v":0},null,{"$f":"UnitsDetails48[[#This Row],[Rate]]*UnitsDetails48[[#This Row],[SUD Non-Billable Units]]","v":0},null,{"$f":"UnitsDetails48[[#This Row],[Rate]]*UnitsDetails48[[#This Row],[Room & Board Units]]","v":0},null,{"$f":"'[4]Final Recon - Summary'!G464","v":0},{"$f":"UnitsDetails48[[#This Row],[ODS DMC General Units]]+UnitsDetails48[[#This Row],[ODS General Units]]+UnitsDetails48[[#This Row],[ODS DMC AB109 Units]]+UnitsDetails48[[#This Row],[ODS AB109 Units]]+UnitsDetails48[[#This Row],[SUD Non-Billable Units]]+UnitsDetails48[[#This Row],[Room & Board Units]]","v":0},0]
[0,{"$f":"'[4]Final Recon - Summary'!B465","v":"Group - Nurse Practitioner"},{"$f":"'[4]Final Recon - Summary'!C465","v":"Per Billable Minute"},{"$f":"'[4]Final Recon - Summary'!D465","v":2.2799999999999998},{"$f":"UnitsDetails48[[#This Row],[ODS DMC General Units]]+UnitsDetails48[[#This Row],[ODS General Units]]+UnitsDetails48[[#This Row],[ODS DMC AB109 Units]]+UnitsDetails48[[#This Row],[ODS AB109 Units]]+UnitsDetails48[[#This Row],[Room & Board Units]]+UnitsDetails48[[#This Row],[SUD Non-Billable Units]]","v":0},0,null,0,null,{"$f":"UnitsDetails48[[#This Row],[ODS General Units]]*UnitsDetails48[[#This Row],[Rate]]","v":0},null,{"$f":"UnitsDetails48[[#This Row],[Rate]]*UnitsDetails48[[#This Row],[ODS DMC AB109 Units]]","v":0},null,{"$f":"UnitsDetails48[[#This Row],[Rate]]*UnitsDetails48[[#This Row],[ODS AB109 Units]]","v":0},null,{"$f":"UnitsDetails48[[#This Row],[Rate]]*UnitsDetails48[[#This Row],[SUD Non-Billable Units]]","v":0},null,{"$f":"UnitsDetails48[[#This Row],[Rate]]*UnitsDetails48[[#This Row],[Room & Board Units]]","v":0},null,{"$f":"'[4]Final Recon - Summary'!G465","v":0},{"$f":"UnitsDetails48[[#This Row],[ODS DMC General Units]]+UnitsDetails48[[#This Row],[ODS General Units]]+UnitsDetails48[[#This Row],[ODS DMC AB109 Units]]+UnitsDetails48[[#This Row],[ODS AB109 Units]]+UnitsDetails48[[#This Row],[SUD Non-Billable Units]]+UnitsDetails48[[#This Row],[Room & Board Units]]","v":0},0]
[0,{"$f":"'[4]Final Recon - Summary'!B466","v":"Group - Occupational Therapist"},{"$f":"'[4]Final Recon - Summary'!C466","v":"Per Billable Minute"},{"$f":"'[4]Final Recon - Summary'!D466","v":1.59},{"$f":"UnitsDetails48[[#This Row],[ODS DMC General Units]]+UnitsDetails48[[#This Row],[ODS General Units]]+UnitsDetails48[[#This Row],[ODS DMC AB109 Units]]+UnitsDetails48[[#This Row],[ODS AB109 Units]]+UnitsDetails48[[#This Row],[Room & Board Units]]+UnitsDetails48[[#This Row],[SUD Non-Billable Units]]","v":0},0,null,0,null,{"$f":"UnitsDetails48[[#This Row],[ODS General Units]]*UnitsDetails48[[#This Row],[Rate]]","v":0},null,{"$f":"UnitsDetails48[[#This Row],[Rate]]*UnitsDetails48[[#This Row],[ODS DMC AB109 Units]]","v":0},null,{"$f":"UnitsDetails48[[#This Row],[Rate]]*UnitsDetails48[[#This Row],[ODS AB109 Units]]","v":0},null,{"$f":"UnitsDetails48[[#This Row],[Rate]]*UnitsDetails48[[#This Row],[SUD Non-Billable Units]]","v":0},null,{"$f":"UnitsDetails48[[#This Row],[Rate]]*UnitsDetails48[[#This Row],[Room & Board Units]]","v":0},null,{"$f":"'[4]Final Recon - Summary'!G466","v":0},{"$f":"UnitsDetails48[[#This Row],[ODS DMC General Units]]+UnitsDetails48[[#This Row],[ODS General Units]]+UnitsDetails48[[#This Row],[ODS DMC AB109 Units]]+UnitsDetails48[[#This Row],[ODS AB109 Units]]+UnitsDetails48[[#This Row],[SUD Non-Billable Units]]+UnitsDetails48[[#This Row],[Room & Board Units]]","v":0},0]
[0,{"$f":"'[4]Final Recon - Summary'!B467","v":"Group - Other Qualified Providers - Other Designated MH staff that bill medical"},{"$f":"'[4]Final Recon - Summary'!C467","v":"Per Billable Minute"},{"$f":"'[4]Final Recon - Summary'!D467","v":0.89999999999999991},{"$f":"UnitsDetails48[[#This Row],[ODS DMC General Units]]+UnitsDetails48[[#This Row],[ODS General Units]]+UnitsDetails48[[#This Row],[ODS DMC AB109 Units]]+UnitsDetails48[[#This Row],[ODS AB109 Units]]+UnitsDetails48[[#This Row],[Room & Board Units]]+UnitsDetails48[[#This Row],[SUD Non-Billable Units]]","v":0},0,null,0,null,{"$f":"UnitsDetails48[[#This Row],[ODS General Units]]*UnitsDetails48[[#This Row],[Rate]]","v":0},null,{"$f":"UnitsDetails48[[#This Row],[Rate]]*UnitsDetails48[[#This Row],[ODS DMC AB109 Units]]","v":0},null,{"$f":"UnitsDetails48[[#This Row],[Rate]]*UnitsDetails48[[#This Row],[ODS AB109 Units]]","v":0},null,{"$f":"UnitsDetails48[[#This Row],[Rate]]*UnitsDetails48[[#This Row],[SUD Non-Billable Units]]","v":0},null,{"$f":"UnitsDetails48[[#This Row],[Rate]]*UnitsDetails48[[#This Row],[Room & Board Units]]","v":0},null,{"$f":"'[4]Final Recon - Summary'!G467","v":0},{"$f":"UnitsDetails48[[#This Row],[ODS DMC General Units]]+UnitsDetails48[[#This Row],[ODS General Units]]+UnitsDetails48[[#This Row],[ODS DMC AB109 Units]]+UnitsDetails48[[#This Row],[ODS AB109 Units]]+UnitsDetails48[[#This Row],[SUD Non-Billable Units]]+UnitsDetails48[[#This Row],[Room & Board Units]]","v":0},0]
[{"$f":"$C$5","v":0},{"$f":"'[4]Final Recon - Summary'!B468","v":"Group - Peer Support Specialist"},{"$f":"'[4]Final Recon - Summary'!C468","v":"Per Billable Minute"},{"$f":"'[4]Final Recon - Summary'!D468","v":0.94},{"$f":"UnitsDetails48[[#This Row],[ODS DMC General Units]]+UnitsDetails48[[#This Row],[ODS General Units]]+UnitsDetails48[[#This Row],[ODS DMC AB109 Units]]+UnitsDetails48[[#This Row],[ODS AB109 Units]]+UnitsDetails48[[#This Row],[Room & Board Units]]+UnitsDetails48[[#This Row],[SUD Non-Billable Units]]","v":0},0,null,0,null,{"$f":"UnitsDetails48[[#This Row],[ODS General Units]]*UnitsDetails48[[#This Row],[Rate]]","v":0},null,{"$f":"UnitsDetails48[[#This Row],[Rate]]*UnitsDetails48[[#This Row],[ODS DMC AB109 Units]]","v":0},null,{"$f":"UnitsDetails48[[#This Row],[Rate]]*UnitsDetails48[[#This Row],[ODS AB109 Units]]","v":0},null,{"$f":"UnitsDetails48[[#This Row],[Rate]]*UnitsDetails48[[#This Row],[SUD Non-Billable Units]]","v":0},null,{"$f":"UnitsDetails48[[#This Row],[Rate]]*UnitsDetails48[[#This Row],[Room & Board Units]]","v":0},null,{"$f":"'[4]Final Recon - Summary'!G468","v":0},{"$f":"UnitsDetails48[[#This Row],[ODS DMC General Units]]+UnitsDetails48[[#This Row],[ODS General Units]]+UnitsDetails48[[#This Row],[ODS DMC AB109 Units]]+UnitsDetails48[[#This Row],[ODS AB109 Units]]+UnitsDetails48[[#This Row],[SUD Non-Billable Units]]+UnitsDetails48[[#This Row],[Room & Board Units]]","v":0},0]
[0,{"$f":"'[4]Final Recon - Summary'!B469","v":"Group - Physician Assistant"},{"$f":"'[4]Final Recon - Summary'!C469","v":"Per Billable Minute"},{"$f":"'[4]Final Recon - Summary'!D469","v":2.04},{"$f":"UnitsDetails48[[#This Row],[ODS DMC General Units]]+UnitsDetails48[[#This Row],[ODS General Units]]+UnitsDetails48[[#This Row],[ODS DMC AB109 Units]]+UnitsDetails48[[#This Row],[ODS AB109 Units]]+UnitsDetails48[[#This Row],[Room & Board Units]]+UnitsDetails48[[#This Row],[SUD Non-Billable Units]]","v":0},0,null,0,null,{"$f":"UnitsDetails48[[#This Row],[ODS General Units]]*UnitsDetails48[[#This Row],[Rate]]","v":0},null,{"$f":"UnitsDetails48[[#This Row],[Rate]]*UnitsDetails48[[#This Row],[ODS DMC AB109 Units]]","v":0},null,{"$f":"UnitsDetails48[[#This Row],[Rate]]*UnitsDetails48[[#This Row],[ODS AB109 Units]]","v":0},null,{"$f":"UnitsDetails48[[#This Row],[Rate]]*UnitsDetails48[[#This Row],[SUD Non-Billable Units]]","v":0},null,{"$f":"UnitsDetails48[[#This Row],[Rate]]*UnitsDetails48[[#This Row],[Room & Board Units]]","v":0},null,{"$f":"'[4]Final Recon - Summary'!G469","v":0},{"$f":"UnitsDetails48[[#This Row],[ODS DMC General Units]]+UnitsDetails48[[#This Row],[ODS General Units]]+UnitsDetails48[[#This Row],[ODS DMC AB109 Units]]+UnitsDetails48[[#This Row],[ODS AB109 Units]]+UnitsDetails48[[#This Row],[SUD Non-Billable Units]]+UnitsDetails48[[#This Row],[Room & Board Units]]","v":0},0]
[0,{"$f":"'[4]Final Recon - Summary'!B470","v":"Group - Psychologist/Pre-licensed Psychologist"},{"$f":"'[4]Final Recon - Summary'!C470","v":"Per Billable Minute"},{"$f":"'[4]Final Recon - Summary'!D470","v":1.84},{"$f":"UnitsDetails48[[#This Row],[ODS DMC General Units]]+UnitsDetails48[[#This Row],[ODS General Units]]+UnitsDetails48[[#This Row],[ODS DMC AB109 Units]]+UnitsDetails48[[#This Row],[ODS AB109 Units]]+UnitsDetails48[[#This Row],[Room & Board Units]]+UnitsDetails48[[#This Row],[SUD Non-Billable Units]]","v":0},0,null,0,null,{"$f":"UnitsDetails48[[#This Row],[ODS General Units]]*UnitsDetails48[[#This Row],[Rate]]","v":0},null,{"$f":"UnitsDetails48[[#This Row],[Rate]]*UnitsDetails48[[#This Row],[ODS DMC AB109 Units]]","v":0},null,{"$f":"UnitsDetails48[[#This Row],[Rate]]*UnitsDetails48[[#This Row],[ODS AB109 Units]]","v":0},null,{"$f":"UnitsDetails48[[#This Row],[Rate]]*UnitsDetails48[[#This Row],[SUD Non-Billable Units]]","v":0},null,{"$f":"UnitsDetails48[[#This Row],[Rate]]*UnitsDetails48[[#This Row],[Room & Board Units]]","v":0},null,{"$f":"'[4]Final Recon - Summary'!G470","v":0},{"$f":"UnitsDetails48[[#This Row],[ODS DMC General Units]]+UnitsDetails48[[#This Row],[ODS General Units]]+UnitsDetails48[[#This Row],[ODS DMC AB109 Units]]+UnitsDetails48[[#This Row],[ODS AB109 Units]]+UnitsDetails48[[#This Row],[SUD Non-Billable Units]]+UnitsDetails48[[#This Row],[Room & Board Units]]","v":0},0]
[0,{"$f":"'[4]Final Recon - Summary'!B471","v":"Group - Psychiatrist/ Contracted Psychiatrist/Licensed Physician (MD)"},{"$f":"'[4]Final Recon - Summary'!C471","v":"Per Billable Minute"},{"$f":"'[4]Final Recon - Summary'!D471","v":2.57},{"$f":"UnitsDetails48[[#This Row],[ODS DMC General Units]]+UnitsDetails48[[#This Row],[ODS General Units]]+UnitsDetails48[[#This Row],[ODS DMC AB109 Units]]+UnitsDetails48[[#This Row],[ODS AB109 Units]]+UnitsDetails48[[#This Row],[Room & Board Units]]+UnitsDetails48[[#This Row],[SUD Non-Billable Units]]","v":0},0,null,0,null,{"$f":"UnitsDetails48[[#This Row],[ODS General Units]]*UnitsDetails48[[#This Row],[Rate]]","v":0},null,{"$f":"UnitsDetails48[[#This Row],[Rate]]*UnitsDetails48[[#This Row],[ODS DMC AB109 Units]]","v":0},null,{"$f":"UnitsDetails48[[#This Row],[Rate]]*UnitsDetails48[[#This Row],[ODS AB109 Units]]","v":0},null,{"$f":"UnitsDetails48[[#This Row],[Rate]]*UnitsDetails48[[#This Row],[SUD Non-Billable Units]]","v":0},null,{"$f":"UnitsDetails48[[#This Row],[Rate]]*UnitsDetails48[[#This Row],[Room & Board Units]]","v":0},null,{"$f":"'[4]Final Recon - Summary'!G471","v":0},{"$f":"UnitsDetails48[[#This Row],[ODS DMC General Units]]+UnitsDetails48[[#This Row],[ODS General Units]]+UnitsDetails48[[#This Row],[ODS DMC AB109 Units]]+UnitsDetails48[[#This Row],[ODS AB109 Units]]+UnitsDetails48[[#This Row],[SUD Non-Billable Units]]+UnitsDetails48[[#This Row],[Room & Board Units]]","v":0},0]
[0,{"$f":"'[4]Final Recon - Summary'!B472","v":"Group - Registered Nurse (RN)"},{"$f":"'[4]Final Recon - Summary'!C472","v":"Per Billable Minute"},{"$f":"'[4]Final Recon - Summary'!D472","v":1.8599999999999999},{"$f":"UnitsDetails48[[#This Row],[ODS DMC General Units]]+UnitsDetails48[[#This Row],[ODS General Units]]+UnitsDetails48[[#This Row],[ODS DMC AB109 Units]]+UnitsDetails48[[#This Row],[ODS AB109 Units]]+UnitsDetails48[[#This Row],[Room & Board Units]]+UnitsDetails48[[#This Row],[SUD Non-Billable Units]]","v":0},0,null,0,null,{"$f":"UnitsDetails48[[#This Row],[ODS General Units]]*UnitsDetails48[[#This Row],[Rate]]","v":0},null,{"$f":"UnitsDetails48[[#This Row],[Rate]]*UnitsDetails48[[#This Row],[ODS DMC AB109 Units]]","v":0},null,{"$f":"UnitsDetails48[[#This Row],[Rate]]*UnitsDetails48[[#This Row],[ODS AB109 Units]]","v":0},null,{"$f":"UnitsDetails48[[#This Row],[Rate]]*UnitsDetails48[[#This Row],[SUD Non-Billable Units]]","v":0},null,{"$f":"UnitsDetails48[[#This Row],[Rate]]*UnitsDetails48[[#This Row],[Room & Board Units]]","v":0},null,{"$f":"'[4]Final Recon - Summary'!G472","v":0},{"$f":"UnitsDetails48[[#This Row],[ODS DMC General Units]]+UnitsDetails48[[#This Row],[ODS General Units]]+UnitsDetails48[[#This Row],[ODS DMC AB109 Units]]+UnitsDetails48[[#This Row],[ODS AB109 Units]]+UnitsDetails48[[#This Row],[SUD Non-Billable Units]]+UnitsDetails48[[#This Row],[Room & Board Units]]","v":0},0]
[0,{"$f":"'[4]Final Recon - Summary'!B473","v":"Group - Registered Pharmacist"},{"$f":"'[4]Final Recon - Summary'!C473","v":"Per Billable Minute"},{"$f":"'[4]Final Recon - Summary'!D473","v":2.19},{"$f":"UnitsDetails48[[#This Row],[ODS DMC General Units]]+UnitsDetails48[[#This Row],[ODS General Units]]+UnitsDetails48[[#This Row],[ODS DMC AB109 Units]]+UnitsDetails48[[#This Row],[ODS AB109 Units]]+UnitsDetails48[[#This Row],[Room & Board Units]]+UnitsDetails48[[#This Row],[SUD Non-Billable Units]]","v":0},0,null,0,null,{"$f":"UnitsDetails48[[#This Row],[ODS General Units]]*UnitsDetails48[[#This Row],[Rate]]","v":0},null,{"$f":"UnitsDetails48[[#This Row],[Rate]]*UnitsDetails48[[#This Row],[ODS DMC AB109 Units]]","v":0},null,{"$f":"UnitsDetails48[[#This Row],[Rate]]*UnitsDetails48[[#This Row],[ODS AB109 Units]]","v":0},null,{"$f":"UnitsDetails48[[#This Row],[Rate]]*UnitsDetails48[[#This Row],[SUD Non-Billable Units]]","v":0},null,{"$f":"UnitsDetails48[[#This Row],[Rate]]*UnitsDetails48[[#This Row],[Room & Board Units]]","v":0},null,{"$f":"'[4]Final Recon - Summary'!G473","v":0},{"$f":"UnitsDetails48[[#This Row],[ODS DMC General Units]]+UnitsDetails48[[#This Row],[ODS General Units]]+UnitsDetails48[[#This Row],[ODS DMC AB109 Units]]+UnitsDetails48[[#This Row],[ODS AB109 Units]]+UnitsDetails48[[#This Row],[SUD Non-Billable Units]]+UnitsDetails48[[#This Row],[Room & Board Units]]","v":0},0]
[0,{"$f":"'[4]Final Recon - Summary'!B474","v":"Group - Interpreter Services"},{"$f":"'[4]Final Recon - Summary'!C474","v":"Per Billable Minute"},{"$f":"'[4]Final Recon - Summary'!D474","v":0.49},{"$f":"UnitsDetails48[[#This Row],[ODS DMC General Units]]+UnitsDetails48[[#This Row],[ODS General Units]]+UnitsDetails48[[#This Row],[ODS DMC AB109 Units]]+UnitsDetails48[[#This Row],[ODS AB109 Units]]+UnitsDetails48[[#This Row],[Room & Board Units]]+UnitsDetails48[[#This Row],[SUD Non-Billable Units]]","v":0},0,null,0,null,{"$f":"UnitsDetails48[[#This Row],[ODS General Units]]*UnitsDetails48[[#This Row],[Rate]]","v":0},null,{"$f":"UnitsDetails48[[#This Row],[Rate]]*UnitsDetails48[[#This Row],[ODS DMC AB109 Units]]","v":0},null,{"$f":"UnitsDetails48[[#This Row],[Rate]]*UnitsDetails48[[#This Row],[ODS AB109 Units]]","v":0},null,{"$f":"UnitsDetails48[[#This Row],[Rate]]*UnitsDetails48[[#This Row],[SUD Non-Billable Units]]","v":0},null,{"$f":"UnitsDetails48[[#This Row],[Rate]]*UnitsDetails48[[#This Row],[Room & Board Units]]","v":0},null,{"$f":"'[4]Final Recon - Summary'!G474","v":0},{"$f":"UnitsDetails48[[#This Row],[ODS DMC General Units]]+UnitsDetails48[[#This Row],[ODS General Units]]+UnitsDetails48[[#This Row],[ODS DMC AB109 Units]]+UnitsDetails48[[#This Row],[ODS AB109 Units]]+UnitsDetails48[[#This Row],[SUD Non-Billable Units]]+UnitsDetails48[[#This Row],[Room & Board Units]]","v":0},0]
[0,{"$f":"'[4]Final Recon - Summary'!B475","v":"Bundled Rates"}]
[0,{"$f":"'[4]Final Recon - Summary'!B476","v":"Supported Employment"},{"$f":"'[4]Final Recon - Summary'!C476","v":"Bundled Full Month"},{"$f":"'[4]Final Recon - Summary'!D476","v":1209.1699999999998},{"$f":"UnitsDetails48[[#This Row],[ODS DMC General Units]]+UnitsDetails48[[#This Row],[ODS General Units]]+UnitsDetails48[[#This Row],[ODS DMC AB109 Units]]+UnitsDetails48[[#This Row],[ODS AB109 Units]]+UnitsDetails48[[#This Row],[Room & Board Units]]+UnitsDetails48[[#This Row],[SUD Non-Billable Units]]","v":0},{"$f":"+D406*E406","v":0},null,{"$f":"+D406*G406","v":0},null,{"$f":"UnitsDetails48[[#This Row],[ODS General Units]]*UnitsDetails48[[#This Row],[Rate]]","v":0},null,{"$f":"UnitsDetails48[[#This Row],[Rate]]*UnitsDetails48[[#This Row],[ODS DMC AB109 Units]]","v":0},null,{"$f":"UnitsDetails48[[#This Row],[Rate]]*UnitsDetails48[[#This Row],[ODS AB109 Units]]","v":0},null,{"$f":"UnitsDetails48[[#This Row],[Rate]]*UnitsDetails48[[#This Row],[SUD Non-Billable Units]]","v":0},null,{"$f":"UnitsDetails48[[#This Row],[Rate]]*UnitsDetails48[[#This Row],[Room & Board Units]]","v":0},null,{"$f":"'[4]Final Recon - Summary'!G476","v":0},{"$f":"UnitsDetails48[[#This Row],[ODS DMC General Units]]+UnitsDetails48[[#This Row],[ODS General Units]]+UnitsDetails48[[#This Row],[ODS DMC AB109 Units]]+UnitsDetails48[[#This Row],[ODS AB109 Units]]+UnitsDetails48[[#This Row],[SUD Non-Billable Units]]+UnitsDetails48[[#This Row],[Room & Board Units]]","v":0},{"$f":"T406-U406","v":0}]
[0,{"$f":"'[4]Final Recon - Summary'!B477","v":"Supported Employment"},{"$f":"'[4]Final Recon - Summary'!C477","v":"Bundled Partial Month"},{"$f":"'[4]Final Recon - Summary'!D477","v":604.58999999999992},{"$f":"UnitsDetails48[[#This Row],[ODS DMC General Units]]+UnitsDetails48[[#This Row],[ODS General Units]]+UnitsDetails48[[#This Row],[ODS DMC AB109 Units]]+UnitsDetails48[[#This Row],[ODS AB109 Units]]+UnitsDetails48[[#This Row],[Room & Board Units]]+UnitsDetails48[[#This Row],[SUD Non-Billable Units]]","v":0},{"$f":"+D407*E407","v":0},null,{"$f":"+D407*G407","v":0},null,{"$f":"UnitsDetails48[[#This Row],[ODS General Units]]*UnitsDetails48[[#This Row],[Rate]]","v":0},null,{"$f":"UnitsDetails48[[#This Row],[Rate]]*UnitsDetails48[[#This Row],[ODS DMC AB109 Units]]","v":0},null,{"$f":"UnitsDetails48[[#This Row],[Rate]]*UnitsDetails48[[#This Row],[ODS AB109 Units]]","v":0},null,{"$f":"UnitsDetails48[[#This Row],[Rate]]*UnitsDetails48[[#This Row],[SUD Non-Billable Units]]","v":0},null,{"$f":"UnitsDetails48[[#This Row],[Rate]]*UnitsDetails48[[#This Row],[Room & Board Units]]","v":0},null,{"$f":"'[4]Final Recon - Summary'!G477","v":0},{"$f":"UnitsDetails48[[#This Row],[ODS DMC General Units]]+UnitsDetails48[[#This Row],[ODS General Units]]+UnitsDetails48[[#This Row],[ODS DMC AB109 Units]]+UnitsDetails48[[#This Row],[ODS AB109 Units]]+UnitsDetails48[[#This Row],[SUD Non-Billable Units]]+UnitsDetails48[[#This Row],[Room & Board Units]]","v":0},{"$f":"T407-U407","v":0}]
[0]
[0]
[0]
[0]
[0]
[0]
[0]
[0]
[0]
[0,{"$f":"'[4]Final Recon - Summary'!B487","v":"Total"},null,null,{"$f":"UnitsDetails48[[#This Row],[ODS DMC General Units]]+UnitsDetails48[[#This Row],[ODS General Units]]+UnitsDetails48[[#This Row],[ODS DMC AB109 Units]]+UnitsDetails48[[#This Row],[ODS AB109 Units]]+UnitsDetails48[[#This Row],[Room & Board Units]]+UnitsDetails48[[#This Row],[SUD Non-Billable Units]]","v":0},{"$f":"SUM(F366:F416)","v":0},null,{"$f":"SUM(H366:H416)","v":0},null,{"$f":"SUM(J366:J416)","v":0},null,{"$f":"SUM(L366:L416)","v":0},null,{"$f":"SUM(N366:N416)","v":0},null,{"$f":"SUM(P366:P416)","v":0},null,{"$f":"SUM(R366:R416)","v":0}]
[]
["BEHAVIORAL HEALTH SERVICES"]
["Fical Year-End Units Details"]
[]
[null,"Contractor:",{"$f":"C361","v":0}]
[null,"Contract #:",{"$f":"C362","v":0}]
[null,"Program Name:",{"$f":"'[4]Final Recon - Summary'!C503","v":"Program 8"}]
[]
["Column1","Service Modalities","Unit","Rate","Final TUOS Units Reconciliation","Final Amount Reconciliation","ODS DMC General Units","ODS DMC General Amount","ODS General Units","ODS General Amount","ODS DMC AB109 Units","ODS DMC AB109 Amount","ODS AB109 Units","ODS AB109 Amount","SUD Non-Billable Units","SUD Non-Billable Amount","Room & Board Units","Room & Board Amount",null,"Total Units (Summary)","Total Units (Details)","Checkpoint"]
[{"$f":"$C$5","v":0},{"$f":"'[4]Final Recon - Summary'!B507","v":"Individual - Alcohol and Drug Counselor"},{"$f":"'[4]Final Recon - Summary'!C507","v":"Per Billable Minute"},{"$f":"'[4]Final Recon - Summary'!D507","v":5.28},{"$f":"UnitsDetails49[[#This Row],[ODS DMC General Units]]+UnitsDetails49[[#This Row],[ODS General Units]]+UnitsDetails49[[#This Row],[ODS DMC AB109 Units]]+UnitsDetails49[[#This Row],[ODS AB109 Units]]+UnitsDetails49[[#This Row],[Room & Board Units]]+UnitsDetails49[[#This Row],[SUD Non-Billable Units]]","v":0},{"$f":"+D427*E427","v":0},null,{"$f":"+D427*G427","v":0},null,{"$f":"UnitsDetails49[[#This Row],[ODS General Units]]*UnitsDetails49[[#This Row],[Rate]]","v":0},null,{"$f":"UnitsDetails49[[#This Row],[Rate]]*UnitsDetails49[[#This Row],[ODS DMC AB109 Units]]","v":0},null,{"$f":"UnitsDetails49[[#This Row],[Rate]]*UnitsDetails49[[#This Row],[ODS AB109 Units]]","v":0},null,{"$f":"UnitsDetails49[[#This Row],[Rate]]*UnitsDetails49[[#This Row],[SUD Non-Billable Units]]","v":0},null,{"$f":"UnitsDetails49[[#This Row],[Rate]]*UnitsDetails49[[#This Row],[Room & Board Units]]","v":0},null,{"$f":"'[4]Final Recon - Summary'!G507","v":0},{"$f":"UnitsDetails49[[#This Row],[ODS DMC General Units]]+UnitsDetails49[[#This Row],[ODS General Units]]+UnitsDetails49[[#This Row],[ODS DMC AB109 Units]]+UnitsDetails49[[#This Row],[ODS AB109 Units]]+UnitsDetails49[[#This Row],[SUD Non-Billable Units]]+UnitsDetails49[[#This Row],[Room & Board Units]]","v":0},{"$f":"T427-U427","v":0}]
[0,{"$f":"'[4]Final Recon - Summary'!B508","v":"Individual - Clinical Nurse Specialist"},{"$f":"'[4]Final Recon - Summary'!C508","v":"Per Billable Minute"},{"$f":"'[4]Final Recon - Summary'!D508","v":12.129999999999999},{"$f":"UnitsDetails49[[#This Row],[ODS DMC General Units]]+UnitsDetails49[[#This Row],[ODS General Units]]+UnitsDetails49[[#This Row],[ODS DMC AB109 Units]]+UnitsDetails49[[#This Row],[ODS AB109 Units]]+UnitsDetails49[[#This Row],[Room & Board Units]]+UnitsDetails49[[#This Row],[SUD Non-Billable Units]]","v":0},0,null,0,null,{"$f":"UnitsDetails49[[#This Row],[ODS General Units]]*UnitsDetails49[[#This Row],[Rate]]","v":0},null,{"$f":"UnitsDetails49[[#This Row],[Rate]]*UnitsDetails49[[#This Row],[ODS DMC AB109 Units]]","v":0},null,{"$f":"UnitsDetails49[[#This Row],[Rate]]*UnitsDetails49[[#This Row],[ODS AB109 Units]]","v":0},null,{"$f":"UnitsDetails49[[#This Row],[Rate]]*UnitsDetails49[[#This Row],[SUD Non-Billable Units]]","v":0},null,{"$f":"UnitsDetails49[[#This Row],[Rate]]*UnitsDetails49[[#This Row],[Room & Board Units]]","v":0},null,{"$f":"'[4]Final Recon - Summary'!G508","v":0},{"$f":"UnitsDetails49[[#This Row],[ODS DMC General Units]]+UnitsDetails49[[#This Row],[ODS General Units]]+UnitsDetails49[[#This Row],[ODS DMC AB109 Units]]+UnitsDetails49[[#This Row],[ODS AB109 Units]]+UnitsDetails49[[#This Row],[SUD Non-Billable Units]]+UnitsDetails49[[#This Row],[Room & Board Units]]","v":0},0]
[0,{"$f":"'[4]Final Recon - Summary'!B509","v":"Individual - Community Health Worker"},{"$f":"'[4]Final Recon - Summary'!C509","v":"Per Billable Minute"},{"$f":"'[4]Final Recon - Summary'!D509","v":4.91},{"$f":"UnitsDetails49[[#This Row],[ODS DMC General Units]]+UnitsDetails49[[#This Row],[ODS General Units]]+UnitsDetails49[[#This Row],[ODS DMC AB109 Units]]+UnitsDetails49[[#This Row],[ODS AB109 Units]]+UnitsDetails49[[#This Row],[Room & Board Units]]+UnitsDetails49[[#This Row],[SUD Non-Billable Units]]","v":0},0,null,0,null,{"$f":"UnitsDetails49[[#This Row],[ODS General Units]]*UnitsDetails49[[#This Row],[Rate]]","v":0},null,{"$f":"UnitsDetails49[[#This Row],[Rate]]*UnitsDetails49[[#This Row],[ODS DMC AB109 Units]]","v":0},null,{"$f":"UnitsDetails49[[#This Row],[Rate]]*UnitsDetails49[[#This Row],[ODS AB109 Units]]","v":0},null,{"$f":"UnitsDetails49[[#This Row],[Rate]]*UnitsDetails49[[#This Row],[SUD Non-Billable Units]]","v":0},null,{"$f":"UnitsDetails49[[#This Row],[Rate]]*UnitsDetails49[[#This Row],[Room & Board Units]]","v":0},null,{"$f":"'[4]Final Recon - Summary'!G509","v":0},{"$f":"UnitsDetails49[[#This Row],[ODS DMC General Units]]+UnitsDetails49[[#This Row],[ODS General Units]]+UnitsDetails49[[#This Row],[ODS DMC AB109 Units]]+UnitsDetails49[[#This Row],[ODS AB109 Units]]+UnitsDetails49[[#This Row],[SUD Non-Billable Units]]+UnitsDetails49[[#This Row],[Room & Board Units]]","v":0},0]
[0,{"$f":"'[4]Final Recon - Summary'!B510","v":"Individual - Licensed Psychiatric Technician"},{"$f":"'[4]Final Recon - Summary'!C510","v":"Per Billable Minute"},{"$f":"'[4]Final Recon - Summary'!D510","v":4.47},{"$f":"UnitsDetails49[[#This Row],[ODS DMC General Units]]+UnitsDetails49[[#This Row],[ODS General Units]]+UnitsDetails49[[#This Row],[ODS DMC AB109 Units]]+UnitsDetails49[[#This Row],[ODS AB109 Units]]+UnitsDetails49[[#This Row],[Room & Board Units]]+UnitsDetails49[[#This Row],[SUD Non-Billable Units]]","v":0},0,null,0,null,{"$f":"UnitsDetails49[[#This Row],[ODS General Units]]*UnitsDetails49[[#This Row],[Rate]]","v":0},null,{"$f":"UnitsDetails49[[#This Row],[Rate]]*UnitsDetails49[[#This Row],[ODS DMC AB109 Units]]","v":0},null,{"$f":"UnitsDetails49[[#This Row],[Rate]]*UnitsDetails49[[#This Row],[ODS AB109 Units]]","v":0},null,{"$f":"UnitsDetails49[[#This Row],[Rate]]*UnitsDetails49[[#This Row],[SUD Non-Billable Units]]","v":0},null,{"$f":"UnitsDetails49[[#This Row],[Rate]]*UnitsDetails49[[#This Row],[Room & Board Units]]","v":0},null,{"$f":"'[4]Final Recon - Summary'!G510","v":0},{"$f":"UnitsDetails49[[#This Row],[ODS DMC General Units]]+UnitsDetails49[[#This Row],[ODS General Units]]+UnitsDetails49[[#This Row],[ODS DMC AB109 Units]]+UnitsDetails49[[#This Row],[ODS AB109 Units]]+UnitsDetails49[[#This Row],[SUD Non-Billable Units]]+UnitsDetails49[[#This Row],[Room & Board Units]]","v":0},0]
[0,{"$f":"'[4]Final Recon - Summary'!B511","v":"Individual - LPHA (MFT  LCSW  LPCC)/Intern or Waivered LPHA (MFT  LCSW  LPCC)"},{"$f":"'[4]Final Recon - Summary'!C511","v":"Per Billable Minute"},{"$f":"'[4]Final Recon - Summary'!D511","v":6.3599999999999994},{"$f":"UnitsDetails49[[#This Row],[ODS DMC General Units]]+UnitsDetails49[[#This Row],[ODS General Units]]+UnitsDetails49[[#This Row],[ODS DMC AB109 Units]]+UnitsDetails49[[#This Row],[ODS AB109 Units]]+UnitsDetails49[[#This Row],[Room & Board Units]]+UnitsDetails49[[#This Row],[SUD Non-Billable Units]]","v":0},0,null,0,null,{"$f":"UnitsDetails49[[#This Row],[ODS General Units]]*UnitsDetails49[[#This Row],[Rate]]","v":0},null,{"$f":"UnitsDetails49[[#This Row],[Rate]]*UnitsDetails49[[#This Row],[ODS DMC AB109 Units]]","v":0},null,{"$f":"UnitsDetails49[[#This Row],[Rate]]*UnitsDetails49[[#This Row],[ODS AB109 Units]]","v":0},null,{"$f":"UnitsDetails49[[#This Row],[Rate]]*UnitsDetails49[[#This Row],[SUD Non-Billable Units]]","v":0},null,{"$f":"UnitsDetails49[[#This Row],[Rate]]*UnitsDetails49[[#This Row],[Room & Board Units]]","v":0},null,{"$f":"'[4]Final Recon - Summary'!G511","v":0},{"$f":"UnitsDetails49[[#This Row],[ODS DMC General Units]]+UnitsDetails49[[#This Row],[ODS General Units]]+UnitsDetails49[[#This Row],[ODS DMC AB109 Units]]+UnitsDetails49[[#This Row],[ODS AB109 Units]]+UnitsDetails49[[#This Row],[SUD Non-Billable Units]]+UnitsDetails49[[#This Row],[Room & Board Units]]","v":0},0]
[0,{"$f":"'[4]Final Recon - Summary'!B512","v":"Individual - Licensed Vocational Nurse (LVN)"},{"$f":"'[4]Final Recon - Summary'!C512","v":"Per Billable Minute"},{"$f":"'[4]Final Recon - Summary'!D512","v":5.2100000000000009},{"$f":"UnitsDetails49[[#This Row],[ODS DMC General Units]]+UnitsDetails49[[#This Row],[ODS General Units]]+UnitsDetails49[[#This Row],[ODS DMC AB109 Units]]+UnitsDetails49[[#This Row],[ODS AB109 Units]]+UnitsDetails49[[#This Row],[Room & Board Units]]+UnitsDetails49[[#This Row],[SUD Non-Billable Units]]","v":0},0,null,0,null,{"$f":"UnitsDetails49[[#This Row],[ODS General Units]]*UnitsDetails49[[#This Row],[Rate]]","v":0},null,{"$f":"UnitsDetails49[[#This Row],[Rate]]*UnitsDetails49[[#This Row],[ODS DMC AB109 Units]]","v":0},null,{"$f":"UnitsDetails49[[#This Row],[Rate]]*UnitsDetails49[[#This Row],[ODS AB109 Units]]","v":0},null,{"$f":"UnitsDetails49[[#This Row],[Rate]]*UnitsDetails49[[#This Row],[SUD Non-Billable Units]]","v":0},null,{"$f":"UnitsDetails49[[#This Row],[Rate]]*UnitsDetails49[[#This Row],[Room & Board Units]]","v":0},null,{"$f":"'[4]Final Recon - Summary'!G512","v":0},{"$f":"UnitsDetails49[[#This Row],[ODS DMC General Units]]+UnitsDetails49[[#This Row],[ODS General Units]]+UnitsDetails49[[#This Row],[ODS DMC AB109 Units]]+UnitsDetails49[[#This Row],[ODS AB109 Units]]+UnitsDetails49[[#This Row],[SUD Non-Billable Units]]+UnitsDetails49[[#This Row],[Room & Board Units]]","v":0},0]
[0,{"$f":"'[4]Final Recon - Summary'!B513","v":"Individual - Medical Assistant"},{"$f":"'[4]Final Recon - Summary'!C513","v":"Per Billable Minute"},{"$f":"'[4]Final Recon - Summary'!D513","v":3.5700000000000003},{"$f":"UnitsDetails49[[#This Row],[ODS DMC General Units]]+UnitsDetails49[[#This Row],[ODS General Units]]+UnitsDetails49[[#This Row],[ODS DMC AB109 Units]]+UnitsDetails49[[#This Row],[ODS AB109 Units]]+UnitsDetails49[[#This Row],[Room & Board Units]]+UnitsDetails49[[#This Row],[SUD Non-Billable Units]]","v":0},0,null,0,null,{"$f":"UnitsDetails49[[#This Row],[ODS General Units]]*UnitsDetails49[[#This Row],[Rate]]","v":0},null,{"$f":"UnitsDetails49[[#This Row],[Rate]]*UnitsDetails49[[#This Row],[ODS DMC AB109 Units]]","v":0},null,{"$f":"UnitsDetails49[[#This Row],[Rate]]*UnitsDetails49[[#This Row],[ODS AB109 Units]]","v":0},null,{"$f":"UnitsDetails49[[#This Row],[Rate]]*UnitsDetails49[[#This Row],[SUD Non-Billable Units]]","v":0},null,{"$f":"UnitsDetails49[[#This Row],[Rate]]*UnitsDetails49[[#This Row],[Room & Board Units]]","v":0},null,{"$f":"'[4]Final Recon - Summary'!G513","v":0},{"$f":"UnitsDetails49[[#This Row],[ODS DMC General Units]]+UnitsDetails49[[#This Row],[ODS General Units]]+UnitsDetails49[[#This Row],[ODS DMC AB109 Units]]+UnitsDetails49[[#This Row],[ODS AB109 Units]]+UnitsDetails49[[#This Row],[SUD Non-Billable Units]]+UnitsDetails49[[#This Row],[Room & Board Units]]","v":0},0]
[0,{"$f":"'[4]Final Recon - Summary'!B514","v":"Individual - Mental Health Rehabilitation Specialist"},{"$f":"'[4]Final Recon - Summary'!C514","v":"Per Billable Minute"},{"$f":"'[4]Final Recon - Summary'!D514","v":4.79},{"$f":"UnitsDetails49[[#This Row],[ODS DMC General Units]]+UnitsDetails49[[#This Row],[ODS General Units]]+UnitsDetails49[[#This Row],[ODS DMC AB109 Units]]+UnitsDetails49[[#This Row],[ODS AB109 Units]]+UnitsDetails49[[#This Row],[Room & Board Units]]+UnitsDetails49[[#This Row],[SUD Non-Billable Units]]","v":0},0,null,0,null,{"$f":"UnitsDetails49[[#This Row],[ODS General Units]]*UnitsDetails49[[#This Row],[Rate]]","v":0},null,{"$f":"UnitsDetails49[[#This Row],[Rate]]*UnitsDetails49[[#This Row],[ODS DMC AB109 Units]]","v":0},null,{"$f":"UnitsDetails49[[#This Row],[Rate]]*UnitsDetails49[[#This Row],[ODS AB109 Units]]","v":0},null,{"$f":"UnitsDetails49[[#This Row],[Rate]]*UnitsDetails49[[#This Row],[SUD Non-Billable Units]]","v":0},null,{"$f":"UnitsDetails49[[#This Row],[Rate]]*UnitsDetails49[[#This Row],[Room & Board Units]]","v":0},null,{"$f":"'[4]Final Recon - Summary'!G514","v":0},{"$f":"UnitsDetails49[[#This Row],[ODS DMC General Units]]+UnitsDetails49[[#This Row],[ODS General Units]]+UnitsDetails49[[#This Row],[ODS DMC AB109 Units]]+UnitsDetails49[[#This Row],[ODS AB109 Units]]+UnitsDetails49[[#This Row],[SUD Non-Billable Units]]+UnitsDetails49[[#This Row],[Room & Board Units]]","v":0},0]
[0,{"$f":"'[4]Final Recon - Summary'!B515","v":"Individual - Nurse Practitioner"},{"$f":"'[4]Final Recon - Summary'!C515","v":"Per Billable Minute"},{"$f":"'[4]Final Recon - Summary'!D515","v":12.129999999999999},{"$f":"UnitsDetails49[[#This Row],[ODS DMC General Units]]+UnitsDetails49[[#This Row],[ODS General Units]]+UnitsDetails49[[#This Row],[ODS DMC AB109 Units]]+UnitsDetails49[[#This Row],[ODS AB109 Units]]+UnitsDetails49[[#This Row],[Room & Board Units]]+UnitsDetails49[[#This Row],[SUD Non-Billable Units]]","v":0},0,null,0,null,{"$f":"UnitsDetails49[[#This Row],[ODS General Units]]*UnitsDetails49[[#This Row],[Rate]]","v":0},null,{"$f":"UnitsDetails49[[#This Row],[Rate]]*UnitsDetails49[[#This Row],[ODS DMC AB109 Units]]","v":0},null,{"$f":"UnitsDetails49[[#This Row],[Rate]]*UnitsDetails49[[#This Row],[ODS AB109 Units]]","v":0},null,{"$f":"UnitsDetails49[[#This Row],[Rate]]*UnitsDetails49[[#This Row],[SUD Non-Billable Units]]","v":0},null,{"$f":"UnitsDetails49[[#This Row],[Rate]]*UnitsDetails49[[#This Row],[Room & Board Units]]","v":0},null,{"$f":"'[4]Final Recon - Summary'!G515","v":0},{"$f":"UnitsDetails49[[#This Row],[ODS DMC General Units]]+UnitsDetails49[[#This Row],[ODS General Units]]+UnitsDetails49[[#This Row],[ODS DMC AB109 Units]]+UnitsDetails49[[#This Row],[ODS AB109 Units]]+UnitsDetails49[[#This Row],[SUD Non-Billable Units]]+UnitsDetails49[[#This Row],[Room & Board Units]]","v":0},0]
[0,{"$f":"'[4]Final Recon - Summary'!B516","v":"Individual - Occupational Therapist"},{"$f":"'[4]Final Recon - Summary'!C516","v":"Per Billable Minute"},{"$f":"'[4]Final Recon - Summary'!D516","v":8.4599999999999991},{"$f":"UnitsDetails49[[#This Row],[ODS DMC General Units]]+UnitsDetails49[[#This Row],[ODS General Units]]+UnitsDetails49[[#This Row],[ODS DMC AB109 Units]]+UnitsDetails49[[#This Row],[ODS AB109 Units]]+UnitsDetails49[[#This Row],[Room & Board Units]]+UnitsDetails49[[#This Row],[SUD Non-Billable Units]]","v":0},0,null,0,null,{"$f":"UnitsDetails49[[#This Row],[ODS General Units]]*UnitsDetails49[[#This Row],[Rate]]","v":0},null,{"$f":"UnitsDetails49[[#This Row],[Rate]]*UnitsDetails49[[#This Row],[ODS DMC AB109 Units]]","v":0},null,{"$f":"UnitsDetails49[[#This Row],[Rate]]*UnitsDetails49[[#This Row],[ODS AB109 Units]]","v":0},null,{"$f":"UnitsDetails49[[#This Row],[Rate]]*UnitsDetails49[[#This Row],[SUD Non-Billable Units]]","v":0},null,{"$f":"UnitsDetails49[[#This Row],[Rate]]*UnitsDetails49[[#This Row],[Room & Board Units]]","v":0},null,{"$f":"'[4]Final Recon - Summary'!G516","v":0},{"$f":"UnitsDetails49[[#This Row],[ODS DMC General Units]]+UnitsDetails49[[#This Row],[ODS General Units]]+UnitsDetails49[[#This Row],[ODS DMC AB109 Units]]+UnitsDetails49[[#This Row],[ODS AB109 Units]]+UnitsDetails49[[#This Row],[SUD Non-Billable Units]]+UnitsDetails49[[#This Row],[Room & Board Units]]","v":0},0]
[0,{"$f":"'[4]Final Recon - Summary'!B517","v":"Individual - Other Qualified Providers - Other Designated MH staff that bill medical"},{"$f":"'[4]Final Recon - Summary'!C517","v":"Per Billable Minute"},{"$f":"'[4]Final Recon - Summary'!D517","v":4.79},{"$f":"UnitsDetails49[[#This Row],[ODS DMC General Units]]+UnitsDetails49[[#This Row],[ODS General Units]]+UnitsDetails49[[#This Row],[ODS DMC AB109 Units]]+UnitsDetails49[[#This Row],[ODS AB109 Units]]+UnitsDetails49[[#This Row],[Room & Board Units]]+UnitsDetails49[[#This Row],[SUD Non-Billable Units]]","v":0},0,null,0,null,{"$f":"UnitsDetails49[[#This Row],[ODS General Units]]*UnitsDetails49[[#This Row],[Rate]]","v":0},null,{"$f":"UnitsDetails49[[#This Row],[Rate]]*UnitsDetails49[[#This Row],[ODS DMC AB109 Units]]","v":0},null,{"$f":"UnitsDetails49[[#This Row],[Rate]]*UnitsDetails49[[#This Row],[ODS AB109 Units]]","v":0},null,{"$f":"UnitsDetails49[[#This Row],[Rate]]*UnitsDetails49[[#This Row],[SUD Non-Billable Units]]","v":0},null,{"$f":"UnitsDetails49[[#This Row],[Rate]]*UnitsDetails49[[#This Row],[Room & Board Units]]","v":0},null,{"$f":"'[4]Final Recon - Summary'!G517","v":0},{"$f":"UnitsDetails49[[#This Row],[ODS DMC General Units]]+UnitsDetails49[[#This Row],[ODS General Units]]+UnitsDetails49[[#This Row],[ODS DMC AB109 Units]]+UnitsDetails49[[#This Row],[ODS AB109 Units]]+UnitsDetails49[[#This Row],[SUD Non-Billable Units]]+UnitsDetails49[[#This Row],[Room & Board Units]]","v":0},0]
[0,{"$f":"'[4]Final Recon - Summary'!B518","v":"Individual - Peer Support Specialist"},{"$f":"'[4]Final Recon - Summary'!C518","v":"Per Billable Minute"},{"$f":"'[4]Final Recon - Summary'!D518","v":5.0199999999999996},{"$f":"UnitsDetails49[[#This Row],[ODS DMC General Units]]+UnitsDetails49[[#This Row],[ODS General Units]]+UnitsDetails49[[#This Row],[ODS DMC AB109 Units]]+UnitsDetails49[[#This Row],[ODS AB109 Units]]+UnitsDetails49[[#This Row],[Room & Board Units]]+UnitsDetails49[[#This Row],[SUD Non-Billable Units]]","v":0},0,null,0,null,{"$f":"UnitsDetails49[[#This Row],[ODS General Units]]*UnitsDetails49[[#This Row],[Rate]]","v":0},null,{"$f":"UnitsDetails49[[#This Row],[Rate]]*UnitsDetails49[[#This Row],[ODS DMC AB109 Units]]","v":0},null,{"$f":"UnitsDetails49[[#This Row],[Rate]]*UnitsDetails49[[#This Row],[ODS AB109 Units]]","v":0},null,{"$f":"UnitsDetails49[[#This Row],[Rate]]*UnitsDetails49[[#This Row],[SUD Non-Billable Units]]","v":0},null,{"$f":"UnitsDetails49[[#This Row],[Rate]]*UnitsDetails49[[#This Row],[Room & Board Units]]","v":0},null,{"$f":"'[4]Final Recon - Summary'!G518","v":0},{"$f":"UnitsDetails49[[#This Row],[ODS DMC General Units]]+UnitsDetails49[[#This Row],[ODS General Units]]+UnitsDetails49[[#This Row],[ODS DMC AB109 Units]]+UnitsDetails49[[#This Row],[ODS AB109 Units]]+UnitsDetails49[[#This Row],[SUD Non-Billable Units]]+UnitsDetails49[[#This Row],[Room & Board Units]]","v":0},0]
[0,{"$f":"'[4]Final Recon - Summary'!B519","v":"Individual - Physician Assistant"},{"$f":"'[4]Final Recon - Summary'!C519","v":"Per Billable Minute"},{"$f":"'[4]Final Recon - Summary'!D519","v":10.95},{"$f":"UnitsDetails49[[#This Row],[ODS DMC General Units]]+UnitsDetails49[[#This Row],[ODS General Units]]+UnitsDetails49[[#This Row],[ODS DMC AB109 Units]]+UnitsDetails49[[#This Row],[ODS AB109 Units]]+UnitsDetails49[[#This Row],[Room & Board Units]]+UnitsDetails49[[#This Row],[SUD Non-Billable Units]]","v":0},0,null,0,null,{"$f":"UnitsDetails49[[#This Row],[ODS General Units]]*UnitsDetails49[[#This Row],[Rate]]","v":0},null,{"$f":"UnitsDetails49[[#This Row],[Rate]]*UnitsDetails49[[#This Row],[ODS DMC AB109 Units]]","v":0},null,{"$f":"UnitsDetails49[[#This Row],[Rate]]*UnitsDetails49[[#This Row],[ODS AB109 Units]]","v":0},null,{"$f":"UnitsDetails49[[#This Row],[Rate]]*UnitsDetails49[[#This Row],[SUD Non-Billable Units]]","v":0},null,{"$f":"UnitsDetails49[[#This Row],[Rate]]*UnitsDetails49[[#This Row],[Room & Board Units]]","v":0},null,{"$f":"'[4]Final Recon - Summary'!G519","v":0},{"$f":"UnitsDetails49[[#This Row],[ODS DMC General Units]]+UnitsDetails49[[#This Row],[ODS General Units]]+UnitsDetails49[[#This Row],[ODS DMC AB109 Units]]+UnitsDetails49[[#This Row],[ODS AB109 Units]]+UnitsDetails49[[#This Row],[SUD Non-Billable Units]]+UnitsDetails49[[#This Row],[Room & Board Units]]","v":0},0]
[0,{"$f":"'[4]Final Recon - Summary'!B520","v":"Individual - Psychologist/Pre-licensed Psychologist"},{"$f":"'[4]Final Recon - Summary'!C520","v":"Per Billable Minute"},{"$f":"'[4]Final Recon - Summary'!D520","v":9.82},{"$f":"UnitsDetails49[[#This Row],[ODS DMC General Units]]+UnitsDetails49[[#This Row],[ODS General Units]]+UnitsDetails49[[#This Row],[ODS DMC AB109 Units]]+UnitsDetails49[[#This Row],[ODS AB109 Units]]+UnitsDetails49[[#This Row],[Room & Board Units]]+UnitsDetails49[[#This Row],[SUD Non-Billable Units]]","v":0},0,null,0,null,{"$f":"UnitsDetails49[[#This Row],[ODS General Units]]*UnitsDetails49[[#This Row],[Rate]]","v":0},null,{"$f":"UnitsDetails49[[#This Row],[Rate]]*UnitsDetails49[[#This Row],[ODS DMC AB109 Units]]","v":0},null,{"$f":"UnitsDetails49[[#This Row],[Rate]]*UnitsDetails49[[#This Row],[ODS AB109 Units]]","v":0},null,{"$f":"UnitsDetails49[[#This Row],[Rate]]*UnitsDetails49[[#This Row],[SUD Non-Billable Units]]","v":0},null,{"$f":"UnitsDetails49[[#This Row],[Rate]]*UnitsDetails49[[#This Row],[Room & Board Units]]","v":0},null,{"$f":"'[4]Final Recon - Summary'!G520","v":0},{"$f":"UnitsDetails49[[#This Row],[ODS DMC General Units]]+UnitsDetails49[[#This Row],[ODS General Units]]+UnitsDetails49[[#This Row],[ODS DMC AB109 Units]]+UnitsDetails49[[#This Row],[ODS AB109 Units]]+UnitsDetails49[[#This Row],[SUD Non-Billable Units]]+UnitsDetails49[[#This Row],[Room & Board Units]]","v":0},0]
[0,{"$f":"'[4]Final Recon - Summary'!B521","v":"Individual - Psychiatrist/ Contracted Psychiatrist/Licensed Physician (MD)"},{"$f":"'[4]Final Recon - Summary'!C521","v":"Per Billable Minute"},{"$f":"'[4]Final Recon - Summary'!D521","v":11.57},{"$f":"UnitsDetails49[[#This Row],[ODS DMC General Units]]+UnitsDetails49[[#This Row],[ODS General Units]]+UnitsDetails49[[#This Row],[ODS DMC AB109 Units]]+UnitsDetails49[[#This Row],[ODS AB109 Units]]+UnitsDetails49[[#This Row],[Room & Board Units]]+UnitsDetails49[[#This Row],[SUD Non-Billable Units]]","v":0},0,null,0,null,{"$f":"UnitsDetails49[[#This Row],[ODS General Units]]*UnitsDetails49[[#This Row],[Rate]]","v":0},null,{"$f":"UnitsDetails49[[#This Row],[Rate]]*UnitsDetails49[[#This Row],[ODS DMC AB109 Units]]","v":0},null,{"$f":"UnitsDetails49[[#This Row],[Rate]]*UnitsDetails49[[#This Row],[ODS AB109 Units]]","v":0},null,{"$f":"UnitsDetails49[[#This Row],[Rate]]*UnitsDetails49[[#This Row],[SUD Non-Billable Units]]","v":0},null,{"$f":"UnitsDetails49[[#This Row],[Rate]]*UnitsDetails49[[#This Row],[Room & Board Units]]","v":0},null,{"$f":"'[4]Final Recon - Summary'!G521","v":0},{"$f":"UnitsDetails49[[#This Row],[ODS DMC General Units]]+UnitsDetails49[[#This Row],[ODS General Units]]+UnitsDetails49[[#This Row],[ODS DMC AB109 Units]]+UnitsDetails49[[#This Row],[ODS AB109 Units]]+UnitsDetails49[[#This Row],[SUD Non-Billable Units]]+UnitsDetails49[[#This Row],[Room & Board Units]]","v":0},0]
[0,{"$f":"'[4]Final Recon - Summary'!B522","v":"Individual - Registered Nurse (RN)"},{"$f":"'[4]Final Recon - Summary'!C522","v":"Per Billable Minute"},{"$f":"'[4]Final Recon - Summary'!D522","v":9.91},{"$f":"UnitsDetails49[[#This Row],[ODS DMC General Units]]+UnitsDetails49[[#This Row],[ODS General Units]]+UnitsDetails49[[#This Row],[ODS DMC AB109 Units]]+UnitsDetails49[[#This Row],[ODS AB109 Units]]+UnitsDetails49[[#This Row],[Room & Board Units]]+UnitsDetails49[[#This Row],[SUD Non-Billable Units]]","v":0},0,null,0,null,{"$f":"UnitsDetails49[[#This Row],[ODS General Units]]*UnitsDetails49[[#This Row],[Rate]]","v":0},null,{"$f":"UnitsDetails49[[#This Row],[Rate]]*UnitsDetails49[[#This Row],[ODS DMC AB109 Units]]","v":0},null,{"$f":"UnitsDetails49[[#This Row],[Rate]]*UnitsDetails49[[#This Row],[ODS AB109 Units]]","v":0},null,{"$f":"UnitsDetails49[[#This Row],[Rate]]*UnitsDetails49[[#This Row],[SUD Non-Billable Units]]","v":0},null,{"$f":"UnitsDetails49[[#This Row],[Rate]]*UnitsDetails49[[#This Row],[Room & Board Units]]","v":0},null,{"$f":"'[4]Final Recon - Summary'!G522","v":0},{"$f":"UnitsDetails49[[#This Row],[ODS DMC General Units]]+UnitsDetails49[[#This Row],[ODS General Units]]+UnitsDetails49[[#This Row],[ODS DMC AB109 Units]]+UnitsDetails49[[#This Row],[ODS AB109 Units]]+UnitsDetails49[[#This Row],[SUD Non-Billable Units]]+UnitsDetails49[[#This Row],[Room & Board Units]]","v":0},0]
[0,{"$f":"'[4]Final Recon - Summary'!B523","v":"Individual - Registered Pharmacist"},{"$f":"'[4]Final Recon - Summary'!C523","v":"Per Billable Minute"},{"$f":"'[4]Final Recon - Summary'!D523","v":11.690000000000001},{"$f":"UnitsDetails49[[#This Row],[ODS DMC General Units]]+UnitsDetails49[[#This Row],[ODS General Units]]+UnitsDetails49[[#This Row],[ODS DMC AB109 Units]]+UnitsDetails49[[#This Row],[ODS AB109 Units]]+UnitsDetails49[[#This Row],[Room & Board Units]]+UnitsDetails49[[#This Row],[SUD Non-Billable Units]]","v":0},0,null,0,null,{"$f":"UnitsDetails49[[#This Row],[ODS General Units]]*UnitsDetails49[[#This Row],[Rate]]","v":0},null,{"$f":"UnitsDetails49[[#This Row],[Rate]]*UnitsDetails49[[#This Row],[ODS DMC AB109 Units]]","v":0},null,{"$f":"UnitsDetails49[[#This Row],[Rate]]*UnitsDetails49[[#This Row],[ODS AB109 Units]]","v":0},null,{"$f":"UnitsDetails49[[#This Row],[Rate]]*UnitsDetails49[[#This Row],[SUD Non-Billable Units]]","v":0},null,{"$f":"UnitsDetails49[[#This Row],[Rate]]*UnitsDetails49[[#This Row],[Room & Board Units]]","v":0},null,{"$f":"'[4]Final Recon - Summary'!G523","v":0},{"$f":"UnitsDetails49[[#This Row],[ODS DMC General Units]]+UnitsDetails49[[#This Row],[ODS General Units]]+UnitsDetails49[[#This Row],[ODS DMC AB109 Units]]+UnitsDetails49[[#This Row],[ODS AB109 Units]]+UnitsDetails49[[#This Row],[SUD Non-Billable Units]]+UnitsDetails49[[#This Row],[Room & Board Units]]","v":0},0]
[0,{"$f":"'[4]Final Recon - Summary'!B524","v":"Individual - Interpreter Services"},{"$f":"'[4]Final Recon - Summary'!C524","v":"Per Billable Minute"},{"$f":"'[4]Final Recon - Summary'!D524","v":2.19},{"$f":"UnitsDetails49[[#This Row],[ODS DMC General Units]]+UnitsDetails49[[#This Row],[ODS General Units]]+UnitsDetails49[[#This Row],[ODS DMC AB109 Units]]+UnitsDetails49[[#This Row],[ODS AB109 Units]]+UnitsDetails49[[#This Row],[Room & Board Units]]+UnitsDetails49[[#This Row],[SUD Non-Billable Units]]","v":0},0,null,0,null,{"$f":"UnitsDetails49[[#This Row],[ODS General Units]]*UnitsDetails49[[#This Row],[Rate]]","v":0},null,{"$f":"UnitsDetails49[[#This Row],[Rate]]*UnitsDetails49[[#This Row],[ODS DMC AB109 Units]]","v":0},null,{"$f":"UnitsDetails49[[#This Row],[Rate]]*UnitsDetails49[[#This Row],[ODS AB109 Units]]","v":0},null,{"$f":"UnitsDetails49[[#This Row],[Rate]]*UnitsDetails49[[#This Row],[SUD Non-Billable Units]]","v":0},null,{"$f":"UnitsDetails49[[#This Row],[Rate]]*UnitsDetails49[[#This Row],[Room & Board Units]]","v":0},null,{"$f":"'[4]Final Recon - Summary'!G524","v":0},{"$f":"UnitsDetails49[[#This Row],[ODS DMC General Units]]+UnitsDetails49[[#This Row],[ODS General Units]]+UnitsDetails49[[#This Row],[ODS DMC AB109 Units]]+UnitsDetails49[[#This Row],[ODS AB109 Units]]+UnitsDetails49[[#This Row],[SUD Non-Billable Units]]+UnitsDetails49[[#This Row],[Room & Board Units]]","v":0},0]
[0,{"$f":"'[4]Final Recon - Summary'!B525","v":"Interactive Complexity"},{"$f":"'[4]Final Recon - Summary'!C525","v":"Per Occurrence"},{"$f":"'[4]Final Recon - Summary'!D525","v":14.61},{"$f":"UnitsDetails49[[#This Row],[ODS DMC General Units]]+UnitsDetails49[[#This Row],[ODS General Units]]+UnitsDetails49[[#This Row],[ODS DMC AB109 Units]]+UnitsDetails49[[#This Row],[ODS AB109 Units]]+UnitsDetails49[[#This Row],[Room & Board Units]]+UnitsDetails49[[#This Row],[SUD Non-Billable Units]]","v":0},0,null,0,null,{"$f":"UnitsDetails49[[#This Row],[ODS General Units]]*UnitsDetails49[[#This Row],[Rate]]","v":0},null,{"$f":"UnitsDetails49[[#This Row],[Rate]]*UnitsDetails49[[#This Row],[ODS DMC AB109 Units]]","v":0},null,{"$f":"UnitsDetails49[[#This Row],[Rate]]*UnitsDetails49[[#This Row],[ODS AB109 Units]]","v":0},null,{"$f":"UnitsDetails49[[#This Row],[Rate]]*UnitsDetails49[[#This Row],[SUD Non-Billable Units]]","v":0},null,{"$f":"UnitsDetails49[[#This Row],[Rate]]*UnitsDetails49[[#This Row],[Room & Board Units]]","v":0},null,{"$f":"'[4]Final Recon - Summary'!G525","v":0},{"$f":"UnitsDetails49[[#This Row],[ODS DMC General Units]]+UnitsDetails49[[#This Row],[ODS General Units]]+UnitsDetails49[[#This Row],[ODS DMC AB109 Units]]+UnitsDetails49[[#This Row],[ODS AB109 Units]]+UnitsDetails49[[#This Row],[SUD Non-Billable Units]]+UnitsDetails49[[#This Row],[Room & Board Units]]","v":0},0]
[0,{"$f":"'[4]Final Recon - Summary'!B526","v":"Parent-Child Interaction Therapy (PCIT Modifier 22)"},{"$f":"'[4]Final Recon - Summary'!C526","v":"Per Occurrence"},{"$f":"'[4]Final Recon - Summary'!D526","v":3.04},{"$f":"UnitsDetails49[[#This Row],[ODS DMC General Units]]+UnitsDetails49[[#This Row],[ODS General Units]]+UnitsDetails49[[#This Row],[ODS DMC AB109 Units]]+UnitsDetails49[[#This Row],[ODS AB109 Units]]+UnitsDetails49[[#This Row],[Room & Board Units]]+UnitsDetails49[[#This Row],[SUD Non-Billable Units]]","v":0},0,null,0,null,{"$f":"UnitsDetails49[[#This Row],[ODS General Units]]*UnitsDetails49[[#This Row],[Rate]]","v":0},null,{"$f":"UnitsDetails49[[#This Row],[Rate]]*UnitsDetails49[[#This Row],[ODS DMC AB109 Units]]","v":0},null,{"$f":"UnitsDetails49[[#This Row],[Rate]]*UnitsDetails49[[#This Row],[ODS AB109 Units]]","v":0},null,{"$f":"UnitsDetails49[[#This Row],[Rate]]*UnitsDetails49[[#This Row],[SUD Non-Billable Units]]","v":0},null,{"$f":"UnitsDetails49[[#This Row],[Rate]]*UnitsDetails49[[#This Row],[Room & Board Units]]","v":0},null,{"$f":"'[4]Final Recon - Summary'!G526","v":0},{"$f":"UnitsDetails49[[#This Row],[ODS DMC General Units]]+UnitsDetails49[[#This Row],[ODS General Units]]+UnitsDetails49[[#This Row],[ODS DMC AB109 Units]]+UnitsDetails49[[#This Row],[ODS AB109 Units]]+UnitsDetails49[[#This Row],[SUD Non-Billable Units]]+UnitsDetails49[[#This Row],[Room & Board Units]]","v":0},0]
[0,{"$f":"'[4]Final Recon - Summary'!B527","v":"Group - Alcohol and Drug Counselor"},{"$f":"'[4]Final Recon - Summary'!C527","v":"Per Billable Minute"},{"$f":"'[4]Final Recon - Summary'!D527","v":1.1800000000000002},{"$f":"UnitsDetails49[[#This Row],[ODS DMC General Units]]+UnitsDetails49[[#This Row],[ODS General Units]]+UnitsDetails49[[#This Row],[ODS DMC AB109 Units]]+UnitsDetails49[[#This Row],[ODS AB109 Units]]+UnitsDetails49[[#This Row],[Room & Board Units]]+UnitsDetails49[[#This Row],[SUD Non-Billable Units]]","v":0},0,null,0,null,{"$f":"UnitsDetails49[[#This Row],[ODS General Units]]*UnitsDetails49[[#This Row],[Rate]]","v":0},null,{"$f":"UnitsDetails49[[#This Row],[Rate]]*UnitsDetails49[[#This Row],[ODS DMC AB109 Units]]","v":0},null,{"$f":"UnitsDetails49[[#This Row],[Rate]]*UnitsDetails49[[#This Row],[ODS AB109 Units]]","v":0},null,{"$f":"UnitsDetails49[[#This Row],[Rate]]*UnitsDetails49[[#This Row],[SUD Non-Billable Units]]","v":0},null,{"$f":"UnitsDetails49[[#This Row],[Rate]]*UnitsDetails49[[#This Row],[Room & Board Units]]","v":0},null,{"$f":"'[4]Final Recon - Summary'!G527","v":0},{"$f":"UnitsDetails49[[#This Row],[ODS DMC General Units]]+UnitsDetails49[[#This Row],[ODS General Units]]+UnitsDetails49[[#This Row],[ODS DMC AB109 Units]]+UnitsDetails49[[#This Row],[ODS AB109 Units]]+UnitsDetails49[[#This Row],[SUD Non-Billable Units]]+UnitsDetails49[[#This Row],[Room & Board Units]]","v":0},0]
[0,{"$f":"'[4]Final Recon - Summary'!B528","v":"Group - Clinical Nurse Specialist"},{"$f":"'[4]Final Recon - Summary'!C528","v":"Per Billable Minute"},{"$f":"'[4]Final Recon - Summary'!D528","v":2.69},{"$f":"UnitsDetails49[[#This Row],[ODS DMC General Units]]+UnitsDetails49[[#This Row],[ODS General Units]]+UnitsDetails49[[#This Row],[ODS DMC AB109 Units]]+UnitsDetails49[[#This Row],[ODS AB109 Units]]+UnitsDetails49[[#This Row],[Room & Board Units]]+UnitsDetails49[[#This Row],[SUD Non-Billable Units]]","v":0},0,null,0,null,{"$f":"UnitsDetails49[[#This Row],[ODS General Units]]*UnitsDetails49[[#This Row],[Rate]]","v":0},null,{"$f":"UnitsDetails49[[#This Row],[Rate]]*UnitsDetails49[[#This Row],[ODS DMC AB109 Units]]","v":0},null,{"$f":"UnitsDetails49[[#This Row],[Rate]]*UnitsDetails49[[#This Row],[ODS AB109 Units]]","v":0},null,{"$f":"UnitsDetails49[[#This Row],[Rate]]*UnitsDetails49[[#This Row],[SUD Non-Billable Units]]","v":0},null,{"$f":"UnitsDetails49[[#This Row],[Rate]]*UnitsDetails49[[#This Row],[Room & Board Units]]","v":0},null,{"$f":"'[4]Final Recon - Summary'!G528","v":0},{"$f":"UnitsDetails49[[#This Row],[ODS DMC General Units]]+UnitsDetails49[[#This Row],[ODS General Units]]+UnitsDetails49[[#This Row],[ODS DMC AB109 Units]]+UnitsDetails49[[#This Row],[ODS AB109 Units]]+UnitsDetails49[[#This Row],[SUD Non-Billable Units]]+UnitsDetails49[[#This Row],[Room & Board Units]]","v":0},0]
[0,{"$f":"'[4]Final Recon - Summary'!B529","v":"Group - Community Health Worker (CPT 98961)"},{"$f":"'[4]Final Recon - Summary'!C529","v":"Per Billable Minute"},{"$f":"'[4]Final Recon - Summary'!D529","v":1.6300000000000001},{"$f":"UnitsDetails49[[#This Row],[ODS DMC General Units]]+UnitsDetails49[[#This Row],[ODS General Units]]+UnitsDetails49[[#This Row],[ODS DMC AB109 Units]]+UnitsDetails49[[#This Row],[ODS AB109 Units]]+UnitsDetails49[[#This Row],[Room & Board Units]]+UnitsDetails49[[#This Row],[SUD Non-Billable Units]]","v":0},0,null,0,null,{"$f":"UnitsDetails49[[#This Row],[ODS General Units]]*UnitsDetails49[[#This Row],[Rate]]","v":0},null,{"$f":"UnitsDetails49[[#This Row],[Rate]]*UnitsDetails49[[#This Row],[ODS DMC AB109 Units]]","v":0},null,{"$f":"UnitsDetails49[[#This Row],[Rate]]*UnitsDetails49[[#This Row],[ODS AB109 Units]]","v":0},null,{"$f":"UnitsDetails49[[#This Row],[Rate]]*UnitsDetails49[[#This Row],[SUD Non-Billable Units]]","v":0},null,{"$f":"UnitsDetails49[[#This Row],[Rate]]*UnitsDetails49[[#This Row],[Room & Board Units]]","v":0},null,{"$f":"'[4]Final Recon - Summary'!G529","v":0},{"$f":"UnitsDetails49[[#This Row],[ODS DMC General Units]]+UnitsDetails49[[#This Row],[ODS General Units]]+UnitsDetails49[[#This Row],[ODS DMC AB109 Units]]+UnitsDetails49[[#This Row],[ODS AB109 Units]]+UnitsDetails49[[#This Row],[SUD Non-Billable Units]]+UnitsDetails49[[#This Row],[Room & Board Units]]","v":0},0]
[0,{"$f":"'[4]Final Recon - Summary'!B530","v":"Group - Community Health Worker (CPT 98962)"},{"$f":"'[4]Final Recon - Summary'!C530","v":"Per Billable Minute"},{"$f":"'[4]Final Recon - Summary'!D530","v":0.75},{"$f":"UnitsDetails49[[#This Row],[ODS DMC General Units]]+UnitsDetails49[[#This Row],[ODS General Units]]+UnitsDetails49[[#This Row],[ODS DMC AB109 Units]]+UnitsDetails49[[#This Row],[ODS AB109 Units]]+UnitsDetails49[[#This Row],[Room & Board Units]]+UnitsDetails49[[#This Row],[SUD Non-Billable Units]]","v":0},0,null,0,null,{"$f":"UnitsDetails49[[#This Row],[ODS General Units]]*UnitsDetails49[[#This Row],[Rate]]","v":0},null,{"$f":"UnitsDetails49[[#This Row],[Rate]]*UnitsDetails49[[#This Row],[ODS DMC AB109 Units]]","v":0},null,{"$f":"UnitsDetails49[[#This Row],[Rate]]*UnitsDetails49[[#This Row],[ODS AB109 Units]]","v":0},null,{"$f":"UnitsDetails49[[#This Row],[Rate]]*UnitsDetails49[[#This Row],[SUD Non-Billable Units]]","v":0},null,{"$f":"UnitsDetails49[[#This Row],[Rate]]*UnitsDetails49[[#This Row],[Room & Board Units]]","v":0},null,{"$f":"'[4]Final Recon - Summary'!G530","v":0},{"$f":"UnitsDetails49[[#This Row],[ODS DMC General Units]]+UnitsDetails49[[#This Row],[ODS General Units]]+UnitsDetails49[[#This Row],[ODS DMC AB109 Units]]+UnitsDetails49[[#This Row],[ODS AB109 Units]]+UnitsDetails49[[#This Row],[SUD Non-Billable Units]]+UnitsDetails49[[#This Row],[Room & Board Units]]","v":0},0]
[0,{"$f":"'[4]Final Recon - Summary'!B531","v":"Group - Licensed Psychiatric Technician"},{"$f":"'[4]Final Recon - Summary'!C531","v":"Per Billable Minute"},{"$f":"'[4]Final Recon - Summary'!D531","v":0.98},{"$f":"UnitsDetails49[[#This Row],[ODS DMC General Units]]+UnitsDetails49[[#This Row],[ODS General Units]]+UnitsDetails49[[#This Row],[ODS DMC AB109 Units]]+UnitsDetails49[[#This Row],[ODS AB109 Units]]+UnitsDetails49[[#This Row],[Room & Board Units]]+UnitsDetails49[[#This Row],[SUD Non-Billable Units]]","v":0},0,null,0,null,{"$f":"UnitsDetails49[[#This Row],[ODS General Units]]*UnitsDetails49[[#This Row],[Rate]]","v":0},null,{"$f":"UnitsDetails49[[#This Row],[Rate]]*UnitsDetails49[[#This Row],[ODS DMC AB109 Units]]","v":0},null,{"$f":"UnitsDetails49[[#This Row],[Rate]]*UnitsDetails49[[#This Row],[ODS AB109 Units]]","v":0},null,{"$f":"UnitsDetails49[[#This Row],[Rate]]*UnitsDetails49[[#This Row],[SUD Non-Billable Units]]","v":0},null,{"$f":"UnitsDetails49[[#This Row],[Rate]]*UnitsDetails49[[#This Row],[Room & Board Units]]","v":0},null,{"$f":"'[4]Final Recon - Summary'!G531","v":0},{"$f":"UnitsDetails49[[#This Row],[ODS DMC General Units]]+UnitsDetails49[[#This Row],[ODS General Units]]+UnitsDetails49[[#This Row],[ODS DMC AB109 Units]]+UnitsDetails49[[#This Row],[ODS AB109 Units]]+UnitsDetails49[[#This Row],[SUD Non-Billable Units]]+UnitsDetails49[[#This Row],[Room & Board Units]]","v":0},0]
[0,{"$f":"'[4]Final Recon - Summary'!B532","v":"Group - LPHA (MFT  LCSW  LPCC)/Intern or Waivered LPHA (MFT  LCSW  LPCC)"},{"$f":"'[4]Final Recon - Summary'!C532","v":"Per Billable Minute"},{"$f":"'[4]Final Recon - Summary'!D532","v":1.4200000000000002},{"$f":"UnitsDetails49[[#This Row],[ODS DMC General Units]]+UnitsDetails49[[#This Row],[ODS General Units]]+UnitsDetails49[[#This Row],[ODS DMC AB109 Units]]+UnitsDetails49[[#This Row],[ODS AB109 Units]]+UnitsDetails49[[#This Row],[Room & Board Units]]+UnitsDetails49[[#This Row],[SUD Non-Billable Units]]","v":0},0,null,0,null,{"$f":"UnitsDetails49[[#This Row],[ODS General Units]]*UnitsDetails49[[#This Row],[Rate]]","v":0},null,{"$f":"UnitsDetails49[[#This Row],[Rate]]*UnitsDetails49[[#This Row],[ODS DMC AB109 Units]]","v":0},null,{"$f":"UnitsDetails49[[#This Row],[Rate]]*UnitsDetails49[[#This Row],[ODS AB109 Units]]","v":0},null,{"$f":"UnitsDetails49[[#This Row],[Rate]]*UnitsDetails49[[#This Row],[SUD Non-Billable Units]]","v":0},null,{"$f":"UnitsDetails49[[#This Row],[Rate]]*UnitsDetails49[[#This Row],[Room & Board Units]]","v":0},null,{"$f":"'[4]Final Recon - Summary'!G532","v":0},{"$f":"UnitsDetails49[[#This Row],[ODS DMC General Units]]+UnitsDetails49[[#This Row],[ODS General Units]]+UnitsDetails49[[#This Row],[ODS DMC AB109 Units]]+UnitsDetails49[[#This Row],[ODS AB109 Units]]+UnitsDetails49[[#This Row],[SUD Non-Billable Units]]+UnitsDetails49[[#This Row],[Room & Board Units]]","v":0},0]
[0,{"$f":"'[4]Final Recon - Summary'!B533","v":"Group - Licensed Vocational Nurse (LVN)"},{"$f":"'[4]Final Recon - Summary'!C533","v":"Per Billable Minute"},{"$f":"'[4]Final Recon - Summary'!D533","v":1.1600000000000001},{"$f":"UnitsDetails49[[#This Row],[ODS DMC General Units]]+UnitsDetails49[[#This Row],[ODS General Units]]+UnitsDetails49[[#This Row],[ODS DMC AB109 Units]]+UnitsDetails49[[#This Row],[ODS AB109 Units]]+UnitsDetails49[[#This Row],[Room & Board Units]]+UnitsDetails49[[#This Row],[SUD Non-Billable Units]]","v":0},0,null,0,null,{"$f":"UnitsDetails49[[#This Row],[ODS General Units]]*UnitsDetails49[[#This Row],[Rate]]","v":0},null,{"$f":"UnitsDetails49[[#This Row],[Rate]]*UnitsDetails49[[#This Row],[ODS DMC AB109 Units]]","v":0},null,{"$f":"UnitsDetails49[[#This Row],[Rate]]*UnitsDetails49[[#This Row],[ODS AB109 Units]]","v":0},null,{"$f":"UnitsDetails49[[#This Row],[Rate]]*UnitsDetails49[[#This Row],[SUD Non-Billable Units]]","v":0},null,{"$f":"UnitsDetails49[[#This Row],[Rate]]*UnitsDetails49[[#This Row],[Room & Board Units]]","v":0},null,{"$f":"'[4]Final Recon - Summary'!G533","v":0},{"$f":"UnitsDetails49[[#This Row],[ODS DMC General Units]]+UnitsDetails49[[#This Row],[ODS General Units]]+UnitsDetails49[[#This Row],[ODS DMC AB109 Units]]+UnitsDetails49[[#This Row],[ODS AB109 Units]]+UnitsDetails49[[#This Row],[SUD Non-Billable Units]]+UnitsDetails49[[#This Row],[Room & Board Units]]","v":0},0]
[0,{"$f":"'[4]Final Recon - Summary'!B534","v":"Group - Medical Assistant"},{"$f":"'[4]Final Recon - Summary'!C534","v":"Per Billable Minute"},{"$f":"'[4]Final Recon - Summary'!D534","v":0.79},{"$f":"UnitsDetails49[[#This Row],[ODS DMC General Units]]+UnitsDetails49[[#This Row],[ODS General Units]]+UnitsDetails49[[#This Row],[ODS DMC AB109 Units]]+UnitsDetails49[[#This Row],[ODS AB109 Units]]+UnitsDetails49[[#This Row],[Room & Board Units]]+UnitsDetails49[[#This Row],[SUD Non-Billable Units]]","v":0},0,null,0,null,{"$f":"UnitsDetails49[[#This Row],[ODS General Units]]*UnitsDetails49[[#This Row],[Rate]]","v":0},null,{"$f":"UnitsDetails49[[#This Row],[Rate]]*UnitsDetails49[[#This Row],[ODS DMC AB109 Units]]","v":0},null,{"$f":"UnitsDetails49[[#This Row],[Rate]]*UnitsDetails49[[#This Row],[ODS AB109 Units]]","v":0},null,{"$f":"UnitsDetails49[[#This Row],[Rate]]*UnitsDetails49[[#This Row],[SUD Non-Billable Units]]","v":0},null,{"$f":"UnitsDetails49[[#This Row],[Rate]]*UnitsDetails49[[#This Row],[Room & Board Units]]","v":0},null,{"$f":"'[4]Final Recon - Summary'!G534","v":0},{"$f":"UnitsDetails49[[#This Row],[ODS DMC General Units]]+UnitsDetails49[[#This Row],[ODS General Units]]+UnitsDetails49[[#This Row],[ODS DMC AB109 Units]]+UnitsDetails49[[#This Row],[ODS AB109 Units]]+UnitsDetails49[[#This Row],[SUD Non-Billable Units]]+UnitsDetails49[[#This Row],[Room & Board Units]]","v":0},0]
[0,{"$f":"'[4]Final Recon - Summary'!B535","v":"Group - Mental Health Rehabilitation Specialist"},{"$f":"'[4]Final Recon - Summary'!C535","v":"Per Billable Minute"},{"$f":"'[4]Final Recon - Summary'!D535","v":1.06},{"$f":"UnitsDetails49[[#This Row],[ODS DMC General Units]]+UnitsDetails49[[#This Row],[ODS General Units]]+UnitsDetails49[[#This Row],[ODS DMC AB109 Units]]+UnitsDetails49[[#This Row],[ODS AB109 Units]]+UnitsDetails49[[#This Row],[Room & Board Units]]+UnitsDetails49[[#This Row],[SUD Non-Billable Units]]","v":0},0,null,0,null,{"$f":"UnitsDetails49[[#This Row],[ODS General Units]]*UnitsDetails49[[#This Row],[Rate]]","v":0},null,{"$f":"UnitsDetails49[[#This Row],[Rate]]*UnitsDetails49[[#This Row],[ODS DMC AB109 Units]]","v":0},null,{"$f":"UnitsDetails49[[#This Row],[Rate]]*UnitsDetails49[[#This Row],[ODS AB109 Units]]","v":0},null,{"$f":"UnitsDetails49[[#This Row],[Rate]]*UnitsDetails49[[#This Row],[SUD Non-Billable Units]]","v":0},null,{"$f":"UnitsDetails49[[#This Row],[Rate]]*UnitsDetails49[[#This Row],[Room & Board Units]]","v":0},null,{"$f":"'[4]Final Recon - Summary'!G535","v":0},{"$f":"UnitsDetails49[[#This Row],[ODS DMC General Units]]+UnitsDetails49[[#This Row],[ODS General Units]]+UnitsDetails49[[#This Row],[ODS DMC AB109 Units]]+UnitsDetails49[[#This Row],[ODS AB109 Units]]+UnitsDetails49[[#This Row],[SUD Non-Billable Units]]+UnitsDetails49[[#This Row],[Room & Board Units]]","v":0},0]
[0,{"$f":"'[4]Final Recon - Summary'!B536","v":"Group - Nurse Practitioner"},{"$f":"'[4]Final Recon - Summary'!C536","v":"Per Billable Minute"},{"$f":"'[4]Final Recon - Summary'!D536","v":2.69},{"$f":"UnitsDetails49[[#This Row],[ODS DMC General Units]]+UnitsDetails49[[#This Row],[ODS General Units]]+UnitsDetails49[[#This Row],[ODS DMC AB109 Units]]+UnitsDetails49[[#This Row],[ODS AB109 Units]]+UnitsDetails49[[#This Row],[Room & Board Units]]+UnitsDetails49[[#This Row],[SUD Non-Billable Units]]","v":0},0,null,0,null,{"$f":"UnitsDetails49[[#This Row],[ODS General Units]]*UnitsDetails49[[#This Row],[Rate]]","v":0},null,{"$f":"UnitsDetails49[[#This Row],[Rate]]*UnitsDetails49[[#This Row],[ODS DMC AB109 Units]]","v":0},null,{"$f":"UnitsDetails49[[#This Row],[Rate]]*UnitsDetails49[[#This Row],[ODS AB109 Units]]","v":0},null,{"$f":"UnitsDetails49[[#This Row],[Rate]]*UnitsDetails49[[#This Row],[SUD Non-Billable Units]]","v":0},null,{"$f":"UnitsDetails49[[#This Row],[Rate]]*UnitsDetails49[[#This Row],[Room & Board Units]]","v":0},null,{"$f":"'[4]Final Recon - Summary'!G536","v":0},{"$f":"UnitsDetails49[[#This Row],[ODS DMC General Units]]+UnitsDetails49[[#This Row],[ODS General Units]]+UnitsDetails49[[#This Row],[ODS DMC AB109 Units]]+UnitsDetails49[[#This Row],[ODS AB109 Units]]+UnitsDetails49[[#This Row],[SUD Non-Billable Units]]+UnitsDetails49[[#This Row],[Room & Board Units]]","v":0},0]
[0,{"$f":"'[4]Final Recon - Summary'!B537","v":"Group - Occupational Therapist"},{"$f":"'[4]Final Recon - Summary'!C537","v":"Per Billable Minute"},{"$f":"'[4]Final Recon - Summary'!D537","v":1.87},{"$f":"UnitsDetails49[[#This Row],[ODS DMC General Units]]+UnitsDetails49[[#This Row],[ODS General Units]]+UnitsDetails49[[#This Row],[ODS DMC AB109 Units]]+UnitsDetails49[[#This Row],[ODS AB109 Units]]+UnitsDetails49[[#This Row],[Room & Board Units]]+UnitsDetails49[[#This Row],[SUD Non-Billable Units]]","v":0},0,null,0,null,{"$f":"UnitsDetails49[[#This Row],[ODS General Units]]*UnitsDetails49[[#This Row],[Rate]]","v":0},null,{"$f":"UnitsDetails49[[#This Row],[Rate]]*UnitsDetails49[[#This Row],[ODS DMC AB109 Units]]","v":0},null,{"$f":"UnitsDetails49[[#This Row],[Rate]]*UnitsDetails49[[#This Row],[ODS AB109 Units]]","v":0},null,{"$f":"UnitsDetails49[[#This Row],[Rate]]*UnitsDetails49[[#This Row],[SUD Non-Billable Units]]","v":0},null,{"$f":"UnitsDetails49[[#This Row],[Rate]]*UnitsDetails49[[#This Row],[Room & Board Units]]","v":0},null,{"$f":"'[4]Final Recon - Summary'!G537","v":0},{"$f":"UnitsDetails49[[#This Row],[ODS DMC General Units]]+UnitsDetails49[[#This Row],[ODS General Units]]+UnitsDetails49[[#This Row],[ODS DMC AB109 Units]]+UnitsDetails49[[#This Row],[ODS AB109 Units]]+UnitsDetails49[[#This Row],[SUD Non-Billable Units]]+UnitsDetails49[[#This Row],[Room & Board Units]]","v":0},0]
[0,{"$f":"'[4]Final Recon - Summary'!B538","v":"Group - Other Qualified Providers - Other Designated MH staff that bill medical"},{"$f":"'[4]Final Recon - Summary'!C538","v":"Per Billable Minute"},{"$f":"'[4]Final Recon - Summary'!D538","v":1.06},{"$f":"UnitsDetails49[[#This Row],[ODS DMC General Units]]+UnitsDetails49[[#This Row],[ODS General Units]]+UnitsDetails49[[#This Row],[ODS DMC AB109 Units]]+UnitsDetails49[[#This Row],[ODS AB109 Units]]+UnitsDetails49[[#This Row],[Room & Board Units]]+UnitsDetails49[[#This Row],[SUD Non-Billable Units]]","v":0},0,null,0,null,{"$f":"UnitsDetails49[[#This Row],[ODS General Units]]*UnitsDetails49[[#This Row],[Rate]]","v":0},null,{"$f":"UnitsDetails49[[#This Row],[Rate]]*UnitsDetails49[[#This Row],[ODS DMC AB109 Units]]","v":0},null,{"$f":"UnitsDetails49[[#This Row],[Rate]]*UnitsDetails49[[#This Row],[ODS AB109 Units]]","v":0},null,{"$f":"UnitsDetails49[[#This Row],[Rate]]*UnitsDetails49[[#This Row],[SUD Non-Billable Units]]","v":0},null,{"$f":"UnitsDetails49[[#This Row],[Rate]]*UnitsDetails49[[#This Row],[Room & Board Units]]","v":0},null,{"$f":"'[4]Final Recon - Summary'!G538","v":0},{"$f":"UnitsDetails49[[#This Row],[ODS DMC General Units]]+UnitsDetails49[[#This Row],[ODS General Units]]+UnitsDetails49[[#This Row],[ODS DMC AB109 Units]]+UnitsDetails49[[#This Row],[ODS AB109 Units]]+UnitsDetails49[[#This Row],[SUD Non-Billable Units]]+UnitsDetails49[[#This Row],[Room & Board Units]]","v":0},0]
[{"$f":"$C$5","v":0},{"$f":"'[4]Final Recon - Summary'!B539","v":"Group - Peer Support Specialist"},{"$f":"'[4]Final Recon - Summary'!C539","v":"Per Billable Minute"},{"$f":"'[4]Final Recon - Summary'!D539","v":1.1000000000000001},{"$f":"UnitsDetails49[[#This Row],[ODS DMC General Units]]+UnitsDetails49[[#This Row],[ODS General Units]]+UnitsDetails49[[#This Row],[ODS DMC AB109 Units]]+UnitsDetails49[[#This Row],[ODS AB109 Units]]+UnitsDetails49[[#This Row],[Room & Board Units]]+UnitsDetails49[[#This Row],[SUD Non-Billable Units]]","v":0},0,null,0,null,{"$f":"UnitsDetails49[[#This Row],[ODS General Units]]*UnitsDetails49[[#This Row],[Rate]]","v":0},null,{"$f":"UnitsDetails49[[#This Row],[Rate]]*UnitsDetails49[[#This Row],[ODS DMC AB109 Units]]","v":0},null,{"$f":"UnitsDetails49[[#This Row],[Rate]]*UnitsDetails49[[#This Row],[ODS AB109 Units]]","v":0},null,{"$f":"UnitsDetails49[[#This Row],[Rate]]*UnitsDetails49[[#This Row],[SUD Non-Billable Units]]","v":0},null,{"$f":"UnitsDetails49[[#This Row],[Rate]]*UnitsDetails49[[#This Row],[Room & Board Units]]","v":0},null,{"$f":"'[4]Final Recon - Summary'!G539","v":0},{"$f":"UnitsDetails49[[#This Row],[ODS DMC General Units]]+UnitsDetails49[[#This Row],[ODS General Units]]+UnitsDetails49[[#This Row],[ODS DMC AB109 Units]]+UnitsDetails49[[#This Row],[ODS AB109 Units]]+UnitsDetails49[[#This Row],[SUD Non-Billable Units]]+UnitsDetails49[[#This Row],[Room & Board Units]]","v":0},0]
[0,{"$f":"'[4]Final Recon - Summary'!B540","v":"Group - Physician Assistant"},{"$f":"'[4]Final Recon - Summary'!C540","v":"Per Billable Minute"},{"$f":"'[4]Final Recon - Summary'!D540","v":2.44},{"$f":"UnitsDetails49[[#This Row],[ODS DMC General Units]]+UnitsDetails49[[#This Row],[ODS General Units]]+UnitsDetails49[[#This Row],[ODS DMC AB109 Units]]+UnitsDetails49[[#This Row],[ODS AB109 Units]]+UnitsDetails49[[#This Row],[Room & Board Units]]+UnitsDetails49[[#This Row],[SUD Non-Billable Units]]","v":0},0,null,0,null,{"$f":"UnitsDetails49[[#This Row],[ODS General Units]]*UnitsDetails49[[#This Row],[Rate]]","v":0},null,{"$f":"UnitsDetails49[[#This Row],[Rate]]*UnitsDetails49[[#This Row],[ODS DMC AB109 Units]]","v":0},null,{"$f":"UnitsDetails49[[#This Row],[Rate]]*UnitsDetails49[[#This Row],[ODS AB109 Units]]","v":0},null,{"$f":"UnitsDetails49[[#This Row],[Rate]]*UnitsDetails49[[#This Row],[SUD Non-Billable Units]]","v":0},null,{"$f":"UnitsDetails49[[#This Row],[Rate]]*UnitsDetails49[[#This Row],[Room & Board Units]]","v":0},null,{"$f":"'[4]Final Recon - Summary'!G540","v":0},{"$f":"UnitsDetails49[[#This Row],[ODS DMC General Units]]+UnitsDetails49[[#This Row],[ODS General Units]]+UnitsDetails49[[#This Row],[ODS DMC AB109 Units]]+UnitsDetails49[[#This Row],[ODS AB109 Units]]+UnitsDetails49[[#This Row],[SUD Non-Billable Units]]+UnitsDetails49[[#This Row],[Room & Board Units]]","v":0},0]
[0,{"$f":"'[4]Final Recon - Summary'!B541","v":"Group - Psychologist/Pre-licensed Psychologist"},{"$f":"'[4]Final Recon - Summary'!C541","v":"Per Billable Minute"},{"$f":"'[4]Final Recon - Summary'!D541","v":2.19},{"$f":"UnitsDetails49[[#This Row],[ODS DMC General Units]]+UnitsDetails49[[#This Row],[ODS General Units]]+UnitsDetails49[[#This Row],[ODS DMC AB109 Units]]+UnitsDetails49[[#This Row],[ODS AB109 Units]]+UnitsDetails49[[#This Row],[Room & Board Units]]+UnitsDetails49[[#This Row],[SUD Non-Billable Units]]","v":0},0,null,0,null,{"$f":"UnitsDetails49[[#This Row],[ODS General Units]]*UnitsDetails49[[#This Row],[Rate]]","v":0},null,{"$f":"UnitsDetails49[[#This Row],[Rate]]*UnitsDetails49[[#This Row],[ODS DMC AB109 Units]]","v":0},null,{"$f":"UnitsDetails49[[#This Row],[Rate]]*UnitsDetails49[[#This Row],[ODS AB109 Units]]","v":0},null,{"$f":"UnitsDetails49[[#This Row],[Rate]]*UnitsDetails49[[#This Row],[SUD Non-Billable Units]]","v":0},null,{"$f":"UnitsDetails49[[#This Row],[Rate]]*UnitsDetails49[[#This Row],[Room & Board Units]]","v":0},null,{"$f":"'[4]Final Recon - Summary'!G541","v":0},{"$f":"UnitsDetails49[[#This Row],[ODS DMC General Units]]+UnitsDetails49[[#This Row],[ODS General Units]]+UnitsDetails49[[#This Row],[ODS DMC AB109 Units]]+UnitsDetails49[[#This Row],[ODS AB109 Units]]+UnitsDetails49[[#This Row],[SUD Non-Billable Units]]+UnitsDetails49[[#This Row],[Room & Board Units]]","v":0},0]
[0,{"$f":"'[4]Final Recon - Summary'!B542","v":"Group - Psychiatrist/ Contracted Psychiatrist/Licensed Physician (MD)"},{"$f":"'[4]Final Recon - Summary'!C542","v":"Per Billable Minute"},{"$f":"'[4]Final Recon - Summary'!D542","v":2.57},{"$f":"UnitsDetails49[[#This Row],[ODS DMC General Units]]+UnitsDetails49[[#This Row],[ODS General Units]]+UnitsDetails49[[#This Row],[ODS DMC AB109 Units]]+UnitsDetails49[[#This Row],[ODS AB109 Units]]+UnitsDetails49[[#This Row],[Room & Board Units]]+UnitsDetails49[[#This Row],[SUD Non-Billable Units]]","v":0},0,null,0,null,{"$f":"UnitsDetails49[[#This Row],[ODS General Units]]*UnitsDetails49[[#This Row],[Rate]]","v":0},null,{"$f":"UnitsDetails49[[#This Row],[Rate]]*UnitsDetails49[[#This Row],[ODS DMC AB109 Units]]","v":0},null,{"$f":"UnitsDetails49[[#This Row],[Rate]]*UnitsDetails49[[#This Row],[ODS AB109 Units]]","v":0},null,{"$f":"UnitsDetails49[[#This Row],[Rate]]*UnitsDetails49[[#This Row],[SUD Non-Billable Units]]","v":0},null,{"$f":"UnitsDetails49[[#This Row],[Rate]]*UnitsDetails49[[#This Row],[Room & Board Units]]","v":0},null,{"$f":"'[4]Final Recon - Summary'!G542","v":0},{"$f":"UnitsDetails49[[#This Row],[ODS DMC General Units]]+UnitsDetails49[[#This Row],[ODS General Units]]+UnitsDetails49[[#This Row],[ODS DMC AB109 Units]]+UnitsDetails49[[#This Row],[ODS AB109 Units]]+UnitsDetails49[[#This Row],[SUD Non-Billable Units]]+UnitsDetails49[[#This Row],[Room & Board Units]]","v":0},0]
[0,{"$f":"'[4]Final Recon - Summary'!B543","v":"Group - Registered Nurse (RN)"},{"$f":"'[4]Final Recon - Summary'!C543","v":"Per Billable Minute"},{"$f":"'[4]Final Recon - Summary'!D543","v":2.2000000000000002},{"$f":"UnitsDetails49[[#This Row],[ODS DMC General Units]]+UnitsDetails49[[#This Row],[ODS General Units]]+UnitsDetails49[[#This Row],[ODS DMC AB109 Units]]+UnitsDetails49[[#This Row],[ODS AB109 Units]]+UnitsDetails49[[#This Row],[Room & Board Units]]+UnitsDetails49[[#This Row],[SUD Non-Billable Units]]","v":0},0,null,0,null,{"$f":"UnitsDetails49[[#This Row],[ODS General Units]]*UnitsDetails49[[#This Row],[Rate]]","v":0},null,{"$f":"UnitsDetails49[[#This Row],[Rate]]*UnitsDetails49[[#This Row],[ODS DMC AB109 Units]]","v":0},null,{"$f":"UnitsDetails49[[#This Row],[Rate]]*UnitsDetails49[[#This Row],[ODS AB109 Units]]","v":0},null,{"$f":"UnitsDetails49[[#This Row],[Rate]]*UnitsDetails49[[#This Row],[SUD Non-Billable Units]]","v":0},null,{"$f":"UnitsDetails49[[#This Row],[Rate]]*UnitsDetails49[[#This Row],[Room & Board Units]]","v":0},null,{"$f":"'[4]Final Recon - Summary'!G543","v":0},{"$f":"UnitsDetails49[[#This Row],[ODS DMC General Units]]+UnitsDetails49[[#This Row],[ODS General Units]]+UnitsDetails49[[#This Row],[ODS DMC AB109 Units]]+UnitsDetails49[[#This Row],[ODS AB109 Units]]+UnitsDetails49[[#This Row],[SUD Non-Billable Units]]+UnitsDetails49[[#This Row],[Room & Board Units]]","v":0},0]
[0,{"$f":"'[4]Final Recon - Summary'!B544","v":"Group - Registered Pharmacist"},{"$f":"'[4]Final Recon - Summary'!C544","v":"Per Billable Minute"},{"$f":"'[4]Final Recon - Summary'!D544","v":2.59},{"$f":"UnitsDetails49[[#This Row],[ODS DMC General Units]]+UnitsDetails49[[#This Row],[ODS General Units]]+UnitsDetails49[[#This Row],[ODS DMC AB109 Units]]+UnitsDetails49[[#This Row],[ODS AB109 Units]]+UnitsDetails49[[#This Row],[Room & Board Units]]+UnitsDetails49[[#This Row],[SUD Non-Billable Units]]","v":0},0,null,0,null,{"$f":"UnitsDetails49[[#This Row],[ODS General Units]]*UnitsDetails49[[#This Row],[Rate]]","v":0},null,{"$f":"UnitsDetails49[[#This Row],[Rate]]*UnitsDetails49[[#This Row],[ODS DMC AB109 Units]]","v":0},null,{"$f":"UnitsDetails49[[#This Row],[Rate]]*UnitsDetails49[[#This Row],[ODS AB109 Units]]","v":0},null,{"$f":"UnitsDetails49[[#This Row],[Rate]]*UnitsDetails49[[#This Row],[SUD Non-Billable Units]]","v":0},null,{"$f":"UnitsDetails49[[#This Row],[Rate]]*UnitsDetails49[[#This Row],[Room & Board Units]]","v":0},null,{"$f":"'[4]Final Recon - Summary'!G544","v":0},{"$f":"UnitsDetails49[[#This Row],[ODS DMC General Units]]+UnitsDetails49[[#This Row],[ODS General Units]]+UnitsDetails49[[#This Row],[ODS DMC AB109 Units]]+UnitsDetails49[[#This Row],[ODS AB109 Units]]+UnitsDetails49[[#This Row],[SUD Non-Billable Units]]+UnitsDetails49[[#This Row],[Room & Board Units]]","v":0},0]
[0,{"$f":"'[4]Final Recon - Summary'!B545","v":"Group - Interpreter Services"},{"$f":"'[4]Final Recon - Summary'!C545","v":"Per Billable Minute"},{"$f":"'[4]Final Recon - Summary'!D545","v":0.49},{"$f":"UnitsDetails49[[#This Row],[ODS DMC General Units]]+UnitsDetails49[[#This Row],[ODS General Units]]+UnitsDetails49[[#This Row],[ODS DMC AB109 Units]]+UnitsDetails49[[#This Row],[ODS AB109 Units]]+UnitsDetails49[[#This Row],[Room & Board Units]]+UnitsDetails49[[#This Row],[SUD Non-Billable Units]]","v":0},0,null,0,null,{"$f":"UnitsDetails49[[#This Row],[ODS General Units]]*UnitsDetails49[[#This Row],[Rate]]","v":0},null,{"$f":"UnitsDetails49[[#This Row],[Rate]]*UnitsDetails49[[#This Row],[ODS DMC AB109 Units]]","v":0},null,{"$f":"UnitsDetails49[[#This Row],[Rate]]*UnitsDetails49[[#This Row],[ODS AB109 Units]]","v":0},null,{"$f":"UnitsDetails49[[#This Row],[Rate]]*UnitsDetails49[[#This Row],[SUD Non-Billable Units]]","v":0},null,{"$f":"UnitsDetails49[[#This Row],[Rate]]*UnitsDetails49[[#This Row],[Room & Board Units]]","v":0},null,{"$f":"'[4]Final Recon - Summary'!G545","v":0},{"$f":"UnitsDetails49[[#This Row],[ODS DMC General Units]]+UnitsDetails49[[#This Row],[ODS General Units]]+UnitsDetails49[[#This Row],[ODS DMC AB109 Units]]+UnitsDetails49[[#This Row],[ODS AB109 Units]]+UnitsDetails49[[#This Row],[SUD Non-Billable Units]]+UnitsDetails49[[#This Row],[Room & Board Units]]","v":0},0]
[0,{"$f":"'[4]Final Recon - Summary'!B546","v":"Bundled Rates"}]
[0,{"$f":"'[4]Final Recon - Summary'!B547","v":"Coordinated Specialty Care"},{"$f":"'[4]Final Recon - Summary'!C547","v":"Bundled Full Month"},{"$f":"'[4]Final Recon - Summary'!D547","v":2520.7600000000002},{"$f":"UnitsDetails49[[#This Row],[ODS DMC General Units]]+UnitsDetails49[[#This Row],[ODS General Units]]+UnitsDetails49[[#This Row],[ODS DMC AB109 Units]]+UnitsDetails49[[#This Row],[ODS AB109 Units]]+UnitsDetails49[[#This Row],[Room & Board Units]]+UnitsDetails49[[#This Row],[SUD Non-Billable Units]]","v":0},{"$f":"+D467*E467","v":0},null,{"$f":"+D467*G467","v":0},null,{"$f":"UnitsDetails49[[#This Row],[ODS General Units]]*UnitsDetails49[[#This Row],[Rate]]","v":0},null,{"$f":"UnitsDetails49[[#This Row],[Rate]]*UnitsDetails49[[#This Row],[ODS DMC AB109 Units]]","v":0},null,{"$f":"UnitsDetails49[[#This Row],[Rate]]*UnitsDetails49[[#This Row],[ODS AB109 Units]]","v":0},null,{"$f":"UnitsDetails49[[#This Row],[Rate]]*UnitsDetails49[[#This Row],[SUD Non-Billable Units]]","v":0},null,{"$f":"UnitsDetails49[[#This Row],[Rate]]*UnitsDetails49[[#This Row],[Room & Board Units]]","v":0},null,{"$f":"'[4]Final Recon - Summary'!G547","v":0},{"$f":"UnitsDetails49[[#This Row],[ODS DMC General Units]]+UnitsDetails49[[#This Row],[ODS General Units]]+UnitsDetails49[[#This Row],[ODS DMC AB109 Units]]+UnitsDetails49[[#This Row],[ODS AB109 Units]]+UnitsDetails49[[#This Row],[SUD Non-Billable Units]]+UnitsDetails49[[#This Row],[Room & Board Units]]","v":0},{"$f":"T467-U467","v":0}]
[0,{"$f":"'[4]Final Recon - Summary'!B548","v":0},{"$f":"'[4]Final Recon - Summary'!C548","v":0},{"$f":"'[4]Final Recon - Summary'!D548","v":0},{"$f":"UnitsDetails49[[#This Row],[ODS DMC General Units]]+UnitsDetails49[[#This Row],[ODS General Units]]+UnitsDetails49[[#This Row],[ODS DMC AB109 Units]]+UnitsDetails49[[#This Row],[ODS AB109 Units]]+UnitsDetails49[[#This Row],[Room & Board Units]]+UnitsDetails49[[#This Row],[SUD Non-Billable Units]]","v":0},{"$f":"+D468*E468","v":0},null,{"$f":"+D468*G468","v":0},null,{"$f":"UnitsDetails49[[#This Row],[ODS General Units]]*UnitsDetails49[[#This Row],[Rate]]","v":0},null,{"$f":"UnitsDetails49[[#This Row],[Rate]]*UnitsDetails49[[#This Row],[ODS DMC AB109 Units]]","v":0},null,{"$f":"UnitsDetails49[[#This Row],[Rate]]*UnitsDetails49[[#This Row],[ODS AB109 Units]]","v":0},null,{"$f":"UnitsDetails49[[#This Row],[Rate]]*UnitsDetails49[[#This Row],[SUD Non-Billable Units]]","v":0},null,{"$f":"UnitsDetails49[[#This Row],[Rate]]*UnitsDetails49[[#This Row],[Room & Board Units]]","v":0},null,{"$f":"'[4]Final Recon - Summary'!G548","v":0},{"$f":"UnitsDetails49[[#This Row],[ODS DMC General Units]]+UnitsDetails49[[#This Row],[ODS General Units]]+UnitsDetails49[[#This Row],[ODS DMC AB109 Units]]+UnitsDetails49[[#This Row],[ODS AB109 Units]]+UnitsDetails49[[#This Row],[SUD Non-Billable Units]]+UnitsDetails49[[#This Row],[Room & Board Units]]","v":0},{"$f":"T468-U468","v":0}]
[0]
[0]
[0]
[0]
[0]
[0]
[0]
[0]
[0]
[0,{"$f":"'[4]Final Recon - Summary'!B558","v":"Total"},null,null,{"$f":"UnitsDetails49[[#This Row],[ODS DMC General Units]]+UnitsDetails49[[#This Row],[ODS General Units]]+UnitsDetails49[[#This Row],[ODS DMC AB109 Units]]+UnitsDetails49[[#This Row],[ODS AB109 Units]]+UnitsDetails49[[#This Row],[Room & Board Units]]+UnitsDetails49[[#This Row],[SUD Non-Billable Units]]","v":0},{"$f":"SUM(F427:F477)","v":0},null,{"$f":"SUM(H427:H477)","v":0},null,{"$f":"SUM(J427:J477)","v":0},null,{"$f":"SUM(L427:L477)","v":0},null,{"$f":"SUM(N427:N477)","v":0},null,{"$f":"SUM(P427:P477)","v":0},null,{"$f":"SUM(R427:R477)","v":0}]
[]
["BEHAVIORAL HEALTH SERVICES"]
["Fical Year-End Units Details"]
[]
[null,"Contractor:",{"$f":"C422","v":0}]
[null,"Contract #:",{"$f":"C423","v":0}]
[null,"Program Name:",{"$f":"'[4]Final Recon - Summary'!C574","v":"Program 9"}]
[]
["Column1","Service Modalities","Unit","Rate","Final TUOS Units Reconciliation","Final Amount Reconciliation","ODS DMC General Units","ODS DMC General Amount","ODS General Units","ODS General Amount","ODS DMC AB109 Units","ODS DMC AB109 Amount","ODS AB109 Units","ODS AB109 Amount","SUD Non-Billable Units","SUD Non-Billable Amount","Room & Board Units","Room & Board Amount",null,"Total Units (Summary)","Total Units (Details)","Checkpoint"]
[{"$f":"$C$5","v":0},{"$f":"'[4]Final Recon - Summary'!B578","v":"Individual - Alcohol and Drug Counselor"},{"$f":"'[4]Final Recon - Summary'!C578","v":"Per Billable Minute"},{"$f":"'[4]Final Recon - Summary'!D578","v":4.4400000000000004},{"$f":"UnitsDetails50[[#This Row],[ODS DMC General Units]]+UnitsDetails50[[#This Row],[ODS General Units]]+UnitsDetails50[[#This Row],[ODS DMC AB109 Units]]+UnitsDetails50[[#This Row],[ODS AB109 Units]]+UnitsDetails50[[#This Row],[Room & Board Units]]+UnitsDetails50[[#This Row],[SUD Non-Billable Units]]","v":0},{"$f":"+D488*E488","v":0},null,{"$f":"+D488*G488","v":0},null,{"$f":"UnitsDetails50[[#This Row],[ODS General Units]]*UnitsDetails50[[#This Row],[Rate]]","v":0},null,{"$f":"UnitsDetails50[[#This Row],[Rate]]*UnitsDetails50[[#This Row],[ODS DMC AB109 Units]]","v":0},null,{"$f":"UnitsDetails50[[#This Row],[Rate]]*UnitsDetails50[[#This Row],[ODS AB109 Units]]","v":0},null,{"$f":"UnitsDetails50[[#This Row],[Rate]]*UnitsDetails50[[#This Row],[SUD Non-Billable Units]]","v":0},null,{"$f":"UnitsDetails50[[#This Row],[Rate]]*UnitsDetails50[[#This Row],[Room & Board Units]]","v":0},null,{"$f":"'[4]Final Recon - Summary'!G578","v":0},{"$f":"UnitsDetails50[[#This Row],[ODS DMC General Units]]+UnitsDetails50[[#This Row],[ODS General Units]]+UnitsDetails50[[#This Row],[ODS DMC AB109 Units]]+UnitsDetails50[[#This Row],[ODS AB109 Units]]+UnitsDetails50[[#This Row],[SUD Non-Billable Units]]+UnitsDetails50[[#This Row],[Room & Board Units]]","v":0},{"$f":"T488-U488","v":0}]
[0,{"$f":"'[4]Final Recon - Summary'!B579","v":"Individual - Clinical Nurse Specialist"},{"$f":"'[4]Final Recon - Summary'!C579","v":"Per Billable Minute"},{"$f":"'[4]Final Recon - Summary'!D579","v":10.23},{"$f":"UnitsDetails50[[#This Row],[ODS DMC General Units]]+UnitsDetails50[[#This Row],[ODS General Units]]+UnitsDetails50[[#This Row],[ODS DMC AB109 Units]]+UnitsDetails50[[#This Row],[ODS AB109 Units]]+UnitsDetails50[[#This Row],[Room & Board Units]]+UnitsDetails50[[#This Row],[SUD Non-Billable Units]]","v":0},0,null,0,null,{"$f":"UnitsDetails50[[#This Row],[ODS General Units]]*UnitsDetails50[[#This Row],[Rate]]","v":0},null,{"$f":"UnitsDetails50[[#This Row],[Rate]]*UnitsDetails50[[#This Row],[ODS DMC AB109 Units]]","v":0},null,{"$f":"UnitsDetails50[[#This Row],[Rate]]*UnitsDetails50[[#This Row],[ODS AB109 Units]]","v":0},null,{"$f":"UnitsDetails50[[#This Row],[Rate]]*UnitsDetails50[[#This Row],[SUD Non-Billable Units]]","v":0},null,{"$f":"UnitsDetails50[[#This Row],[Rate]]*UnitsDetails50[[#This Row],[Room & Board Units]]","v":0},null,{"$f":"'[4]Final Recon - Summary'!G579","v":0},{"$f":"UnitsDetails50[[#This Row],[ODS DMC General Units]]+UnitsDetails50[[#This Row],[ODS General Units]]+UnitsDetails50[[#This Row],[ODS DMC AB109 Units]]+UnitsDetails50[[#This Row],[ODS AB109 Units]]+UnitsDetails50[[#This Row],[SUD Non-Billable Units]]+UnitsDetails50[[#This Row],[Room & Board Units]]","v":0},0]
[0,{"$f":"'[4]Final Recon - Summary'!B580","v":"Individual - Community Health Worker"},{"$f":"'[4]Final Recon - Summary'!C580","v":"Per Billable Minute"},{"$f":"'[4]Final Recon - Summary'!D580","v":4.12},{"$f":"UnitsDetails50[[#This Row],[ODS DMC General Units]]+UnitsDetails50[[#This Row],[ODS General Units]]+UnitsDetails50[[#This Row],[ODS DMC AB109 Units]]+UnitsDetails50[[#This Row],[ODS AB109 Units]]+UnitsDetails50[[#This Row],[Room & Board Units]]+UnitsDetails50[[#This Row],[SUD Non-Billable Units]]","v":0},0,null,0,null,{"$f":"UnitsDetails50[[#This Row],[ODS General Units]]*UnitsDetails50[[#This Row],[Rate]]","v":0},null,{"$f":"UnitsDetails50[[#This Row],[Rate]]*UnitsDetails50[[#This Row],[ODS DMC AB109 Units]]","v":0},null,{"$f":"UnitsDetails50[[#This Row],[Rate]]*UnitsDetails50[[#This Row],[ODS AB109 Units]]","v":0},null,{"$f":"UnitsDetails50[[#This Row],[Rate]]*UnitsDetails50[[#This Row],[SUD Non-Billable Units]]","v":0},null,{"$f":"UnitsDetails50[[#This Row],[Rate]]*UnitsDetails50[[#This Row],[Room & Board Units]]","v":0},null,{"$f":"'[4]Final Recon - Summary'!G580","v":0},{"$f":"UnitsDetails50[[#This Row],[ODS DMC General Units]]+UnitsDetails50[[#This Row],[ODS General Units]]+UnitsDetails50[[#This Row],[ODS DMC AB109 Units]]+UnitsDetails50[[#This Row],[ODS AB109 Units]]+UnitsDetails50[[#This Row],[SUD Non-Billable Units]]+UnitsDetails50[[#This Row],[Room & Board Units]]","v":0},0]
[0,{"$f":"'[4]Final Recon - Summary'!B581","v":"Individual - Licensed Psychiatric Technician"},{"$f":"'[4]Final Recon - Summary'!C581","v":"Per Billable Minute"},{"$f":"'[4]Final Recon - Summary'!D581","v":3.76},{"$f":"UnitsDetails50[[#This Row],[ODS DMC General Units]]+UnitsDetails50[[#This Row],[ODS General Units]]+UnitsDetails50[[#This Row],[ODS DMC AB109 Units]]+UnitsDetails50[[#This Row],[ODS AB109 Units]]+UnitsDetails50[[#This Row],[Room & Board Units]]+UnitsDetails50[[#This Row],[SUD Non-Billable Units]]","v":0},0,null,0,null,{"$f":"UnitsDetails50[[#This Row],[ODS General Units]]*UnitsDetails50[[#This Row],[Rate]]","v":0},null,{"$f":"UnitsDetails50[[#This Row],[Rate]]*UnitsDetails50[[#This Row],[ODS DMC AB109 Units]]","v":0},null,{"$f":"UnitsDetails50[[#This Row],[Rate]]*UnitsDetails50[[#This Row],[ODS AB109 Units]]","v":0},null,{"$f":"UnitsDetails50[[#This Row],[Rate]]*UnitsDetails50[[#This Row],[SUD Non-Billable Units]]","v":0},null,{"$f":"UnitsDetails50[[#This Row],[Rate]]*UnitsDetails50[[#This Row],[Room & Board Units]]","v":0},null,{"$f":"'[4]Final Recon - Summary'!G581","v":0},{"$f":"UnitsDetails50[[#This Row],[ODS DMC General Units]]+UnitsDetails50[[#This Row],[ODS General Units]]+UnitsDetails50[[#This Row],[ODS DMC AB109 Units]]+UnitsDetails50[[#This Row],[ODS AB109 Units]]+UnitsDetails50[[#This Row],[SUD Non-Billable Units]]+UnitsDetails50[[#This Row],[Room & Board Units]]","v":0},0]
[0,{"$f":"'[4]Final Recon - Summary'!B582","v":"Individual - LPHA (MFT  LCSW  LPCC)/Intern or Waivered LPHA (MFT  LCSW  LPCC)"},{"$f":"'[4]Final Recon - Summary'!C582","v":"Per Billable Minute"},{"$f":"'[4]Final Recon - Summary'!D582","v":5.35},{"$f":"UnitsDetails50[[#This Row],[ODS DMC General Units]]+UnitsDetails50[[#This Row],[ODS General Units]]+UnitsDetails50[[#This Row],[ODS DMC AB109 Units]]+UnitsDetails50[[#This Row],[ODS AB109 Units]]+UnitsDetails50[[#This Row],[Room & Board Units]]+UnitsDetails50[[#This Row],[SUD Non-Billable Units]]","v":0},0,null,0,null,{"$f":"UnitsDetails50[[#This Row],[ODS General Units]]*UnitsDetails50[[#This Row],[Rate]]","v":0},null,{"$f":"UnitsDetails50[[#This Row],[Rate]]*UnitsDetails50[[#This Row],[ODS DMC AB109 Units]]","v":0},null,{"$f":"UnitsDetails50[[#This Row],[Rate]]*UnitsDetails50[[#This Row],[ODS AB109 Units]]","v":0},null,{"$f":"UnitsDetails50[[#This Row],[Rate]]*UnitsDetails50[[#This Row],[SUD Non-Billable Units]]","v":0},null,{"$f":"UnitsDetails50[[#This Row],[Rate]]*UnitsDetails50[[#This Row],[Room & Board Units]]","v":0},null,{"$f":"'[4]Final Recon - Summary'!G582","v":0},{"$f":"UnitsDetails50[[#This Row],[ODS DMC General Units]]+UnitsDetails50[[#This Row],[ODS General Units]]+UnitsDetails50[[#This Row],[ODS DMC AB109 Units]]+UnitsDetails50[[#This Row],[ODS AB109 Units]]+UnitsDetails50[[#This Row],[SUD Non-Billable Units]]+UnitsDetails50[[#This Row],[Room & Board Units]]","v":0},0]
[0,{"$f":"'[4]Final Recon - Summary'!B583","v":"Individual - Licensed Vocational Nurse (LVN)"},{"$f":"'[4]Final Recon - Summary'!C583","v":"Per Billable Minute"},{"$f":"'[4]Final Recon - Summary'!D583","v":4.3800000000000008},{"$f":"UnitsDetails50[[#This Row],[ODS DMC General Units]]+UnitsDetails50[[#This Row],[ODS General Units]]+UnitsDetails50[[#This Row],[ODS DMC AB109 Units]]+UnitsDetails50[[#This Row],[ODS AB109 Units]]+UnitsDetails50[[#This Row],[Room & Board Units]]+UnitsDetails50[[#This Row],[SUD Non-Billable Units]]","v":0},0,null,0,null,{"$f":"UnitsDetails50[[#This Row],[ODS General Units]]*UnitsDetails50[[#This Row],[Rate]]","v":0},null,{"$f":"UnitsDetails50[[#This Row],[Rate]]*UnitsDetails50[[#This Row],[ODS DMC AB109 Units]]","v":0},null,{"$f":"UnitsDetails50[[#This Row],[Rate]]*UnitsDetails50[[#This Row],[ODS AB109 Units]]","v":0},null,{"$f":"UnitsDetails50[[#This Row],[Rate]]*UnitsDetails50[[#This Row],[SUD Non-Billable Units]]","v":0},null,{"$f":"UnitsDetails50[[#This Row],[Rate]]*UnitsDetails50[[#This Row],[Room & Board Units]]","v":0},null,{"$f":"'[4]Final Recon - Summary'!G583","v":0},{"$f":"UnitsDetails50[[#This Row],[ODS DMC General Units]]+UnitsDetails50[[#This Row],[ODS General Units]]+UnitsDetails50[[#This Row],[ODS DMC AB109 Units]]+UnitsDetails50[[#This Row],[ODS AB109 Units]]+UnitsDetails50[[#This Row],[SUD Non-Billable Units]]+UnitsDetails50[[#This Row],[Room & Board Units]]","v":0},0]
[0,{"$f":"'[4]Final Recon - Summary'!B584","v":"Individual - Medical Assistant"},{"$f":"'[4]Final Recon - Summary'!C584","v":"Per Billable Minute"},{"$f":"'[4]Final Recon - Summary'!D584","v":3.02},{"$f":"UnitsDetails50[[#This Row],[ODS DMC General Units]]+UnitsDetails50[[#This Row],[ODS General Units]]+UnitsDetails50[[#This Row],[ODS DMC AB109 Units]]+UnitsDetails50[[#This Row],[ODS AB109 Units]]+UnitsDetails50[[#This Row],[Room & Board Units]]+UnitsDetails50[[#This Row],[SUD Non-Billable Units]]","v":0},0,null,0,null,{"$f":"UnitsDetails50[[#This Row],[ODS General Units]]*UnitsDetails50[[#This Row],[Rate]]","v":0},null,{"$f":"UnitsDetails50[[#This Row],[Rate]]*UnitsDetails50[[#This Row],[ODS DMC AB109 Units]]","v":0},null,{"$f":"UnitsDetails50[[#This Row],[Rate]]*UnitsDetails50[[#This Row],[ODS AB109 Units]]","v":0},null,{"$f":"UnitsDetails50[[#This Row],[Rate]]*UnitsDetails50[[#This Row],[SUD Non-Billable Units]]","v":0},null,{"$f":"UnitsDetails50[[#This Row],[Rate]]*UnitsDetails50[[#This Row],[Room & Board Units]]","v":0},null,{"$f":"'[4]Final Recon - Summary'!G584","v":0},{"$f":"UnitsDetails50[[#This Row],[ODS DMC General Units]]+UnitsDetails50[[#This Row],[ODS General Units]]+UnitsDetails50[[#This Row],[ODS DMC AB109 Units]]+UnitsDetails50[[#This Row],[ODS AB109 Units]]+UnitsDetails50[[#This Row],[SUD Non-Billable Units]]+UnitsDetails50[[#This Row],[Room & Board Units]]","v":0},0]
[0,{"$f":"'[4]Final Recon - Summary'!B585","v":"Individual - Mental Health Rehabilitation Specialist"},{"$f":"'[4]Final Recon - Summary'!C585","v":"Per Billable Minute"},{"$f":"'[4]Final Recon - Summary'!D585","v":4.0199999999999996},{"$f":"UnitsDetails50[[#This Row],[ODS DMC General Units]]+UnitsDetails50[[#This Row],[ODS General Units]]+UnitsDetails50[[#This Row],[ODS DMC AB109 Units]]+UnitsDetails50[[#This Row],[ODS AB109 Units]]+UnitsDetails50[[#This Row],[Room & Board Units]]+UnitsDetails50[[#This Row],[SUD Non-Billable Units]]","v":0},0,null,0,null,{"$f":"UnitsDetails50[[#This Row],[ODS General Units]]*UnitsDetails50[[#This Row],[Rate]]","v":0},null,{"$f":"UnitsDetails50[[#This Row],[Rate]]*UnitsDetails50[[#This Row],[ODS DMC AB109 Units]]","v":0},null,{"$f":"UnitsDetails50[[#This Row],[Rate]]*UnitsDetails50[[#This Row],[ODS AB109 Units]]","v":0},null,{"$f":"UnitsDetails50[[#This Row],[Rate]]*UnitsDetails50[[#This Row],[SUD Non-Billable Units]]","v":0},null,{"$f":"UnitsDetails50[[#This Row],[Rate]]*UnitsDetails50[[#This Row],[Room & Board Units]]","v":0},null,{"$f":"'[4]Final Recon - Summary'!G585","v":0},{"$f":"UnitsDetails50[[#This Row],[ODS DMC General Units]]+UnitsDetails50[[#This Row],[ODS General Units]]+UnitsDetails50[[#This Row],[ODS DMC AB109 Units]]+UnitsDetails50[[#This Row],[ODS AB109 Units]]+UnitsDetails50[[#This Row],[SUD Non-Billable Units]]+UnitsDetails50[[#This Row],[Room & Board Units]]","v":0},0]
[0,{"$f":"'[4]Final Recon - Summary'!B586","v":"Individual - Nurse Practitioner"},{"$f":"'[4]Final Recon - Summary'!C586","v":"Per Billable Minute"},{"$f":"'[4]Final Recon - Summary'!D586","v":10.23},{"$f":"UnitsDetails50[[#This Row],[ODS DMC General Units]]+UnitsDetails50[[#This Row],[ODS General Units]]+UnitsDetails50[[#This Row],[ODS DMC AB109 Units]]+UnitsDetails50[[#This Row],[ODS AB109 Units]]+UnitsDetails50[[#This Row],[Room & Board Units]]+UnitsDetails50[[#This Row],[SUD Non-Billable Units]]","v":0},0,null,0,null,{"$f":"UnitsDetails50[[#This Row],[ODS General Units]]*UnitsDetails50[[#This Row],[Rate]]","v":0},null,{"$f":"UnitsDetails50[[#This Row],[Rate]]*UnitsDetails50[[#This Row],[ODS DMC AB109 Units]]","v":0},null,{"$f":"UnitsDetails50[[#This Row],[Rate]]*UnitsDetails50[[#This Row],[ODS AB109 Units]]","v":0},null,{"$f":"UnitsDetails50[[#This Row],[Rate]]*UnitsDetails50[[#This Row],[SUD Non-Billable Units]]","v":0},null,{"$f":"UnitsDetails50[[#This Row],[Rate]]*UnitsDetails50[[#This Row],[Room & Board Units]]","v":0},null,{"$f":"'[4]Final Recon - Summary'!G586","v":0},{"$f":"UnitsDetails50[[#This Row],[ODS DMC General Units]]+UnitsDetails50[[#This Row],[ODS General Units]]+UnitsDetails50[[#This Row],[ODS DMC AB109 Units]]+UnitsDetails50[[#This Row],[ODS AB109 Units]]+UnitsDetails50[[#This Row],[SUD Non-Billable Units]]+UnitsDetails50[[#This Row],[Room & Board Units]]","v":0},0]
[0,{"$f":"'[4]Final Recon - Summary'!B587","v":"Individual - Occupational Therapist"},{"$f":"'[4]Final Recon - Summary'!C587","v":"Per Billable Minute"},{"$f":"'[4]Final Recon - Summary'!D587","v":7.13},{"$f":"UnitsDetails50[[#This Row],[ODS DMC General Units]]+UnitsDetails50[[#This Row],[ODS General Units]]+UnitsDetails50[[#This Row],[ODS DMC AB109 Units]]+UnitsDetails50[[#This Row],[ODS AB109 Units]]+UnitsDetails50[[#This Row],[Room & Board Units]]+UnitsDetails50[[#This Row],[SUD Non-Billable Units]]","v":0},0,null,0,null,{"$f":"UnitsDetails50[[#This Row],[ODS General Units]]*UnitsDetails50[[#This Row],[Rate]]","v":0},null,{"$f":"UnitsDetails50[[#This Row],[Rate]]*UnitsDetails50[[#This Row],[ODS DMC AB109 Units]]","v":0},null,{"$f":"UnitsDetails50[[#This Row],[Rate]]*UnitsDetails50[[#This Row],[ODS AB109 Units]]","v":0},null,{"$f":"UnitsDetails50[[#This Row],[Rate]]*UnitsDetails50[[#This Row],[SUD Non-Billable Units]]","v":0},null,{"$f":"UnitsDetails50[[#This Row],[Rate]]*UnitsDetails50[[#This Row],[Room & Board Units]]","v":0},null,{"$f":"'[4]Final Recon - Summary'!G587","v":0},{"$f":"UnitsDetails50[[#This Row],[ODS DMC General Units]]+UnitsDetails50[[#This Row],[ODS General Units]]+UnitsDetails50[[#This Row],[ODS DMC AB109 Units]]+UnitsDetails50[[#This Row],[ODS AB109 Units]]+UnitsDetails50[[#This Row],[SUD Non-Billable Units]]+UnitsDetails50[[#This Row],[Room & Board Units]]","v":0},0]
[0,{"$f":"'[4]Final Recon - Summary'!B588","v":"Individual - Other Qualified Providers - Other Designated MH staff that bill medical"},{"$f":"'[4]Final Recon - Summary'!C588","v":"Per Billable Minute"},{"$f":"'[4]Final Recon - Summary'!D588","v":4.0199999999999996},{"$f":"UnitsDetails50[[#This Row],[ODS DMC General Units]]+UnitsDetails50[[#This Row],[ODS General Units]]+UnitsDetails50[[#This Row],[ODS DMC AB109 Units]]+UnitsDetails50[[#This Row],[ODS AB109 Units]]+UnitsDetails50[[#This Row],[Room & Board Units]]+UnitsDetails50[[#This Row],[SUD Non-Billable Units]]","v":0},0,null,0,null,{"$f":"UnitsDetails50[[#This Row],[ODS General Units]]*UnitsDetails50[[#This Row],[Rate]]","v":0},null,{"$f":"UnitsDetails50[[#This Row],[Rate]]*UnitsDetails50[[#This Row],[ODS DMC AB109 Units]]","v":0},null,{"$f":"UnitsDetails50[[#This Row],[Rate]]*UnitsDetails50[[#This Row],[ODS AB109 Units]]","v":0},null,{"$f":"UnitsDetails50[[#This Row],[Rate]]*UnitsDetails50[[#This Row],[SUD Non-Billable Units]]","v":0},null,{"$f":"UnitsDetails50[[#This Row],[Rate]]*UnitsDetails50[[#This Row],[Room & Board Units]]","v":0},null,{"$f":"'[4]Final Recon - Summary'!G588","v":0},{"$f":"UnitsDetails50[[#This Row],[ODS DMC General Units]]+UnitsDetails50[[#This Row],[ODS General Units]]+UnitsDetails50[[#This Row],[ODS DMC AB109 Units]]+UnitsDetails50[[#This Row],[ODS AB109 Units]]+UnitsDetails50[[#This Row],[SUD Non-Billable Units]]+UnitsDetails50[[#This Row],[Room & Board Units]]","v":0},0]
[0,{"$f":"'[4]Final Recon - Summary'!B589","v":"Individual - Peer Support Specialist"},{"$f":"'[4]Final Recon - Summary'!C589","v":"Per Billable Minute"},{"$f":"'[4]Final Recon - Summary'!D589","v":4.22},{"$f":"UnitsDetails50[[#This Row],[ODS DMC General Units]]+UnitsDetails50[[#This Row],[ODS General Units]]+UnitsDetails50[[#This Row],[ODS DMC AB109 Units]]+UnitsDetails50[[#This Row],[ODS AB109 Units]]+UnitsDetails50[[#This Row],[Room & Board Units]]+UnitsDetails50[[#This Row],[SUD Non-Billable Units]]","v":0},0,null,0,null,{"$f":"UnitsDetails50[[#This Row],[ODS General Units]]*UnitsDetails50[[#This Row],[Rate]]","v":0},null,{"$f":"UnitsDetails50[[#This Row],[Rate]]*UnitsDetails50[[#This Row],[ODS DMC AB109 Units]]","v":0},null,{"$f":"UnitsDetails50[[#This Row],[Rate]]*UnitsDetails50[[#This Row],[ODS AB109 Units]]","v":0},null,{"$f":"UnitsDetails50[[#This Row],[Rate]]*UnitsDetails50[[#This Row],[SUD Non-Billable Units]]","v":0},null,{"$f":"UnitsDetails50[[#This Row],[Rate]]*UnitsDetails50[[#This Row],[Room & Board Units]]","v":0},null,{"$f":"'[4]Final Recon - Summary'!G589","v":0},{"$f":"UnitsDetails50[[#This Row],[ODS DMC General Units]]+UnitsDetails50[[#This Row],[ODS General Units]]+UnitsDetails50[[#This Row],[ODS DMC AB109 Units]]+UnitsDetails50[[#This Row],[ODS AB109 Units]]+UnitsDetails50[[#This Row],[SUD Non-Billable Units]]+UnitsDetails50[[#This Row],[Room & Board Units]]","v":0},0]
[0,{"$f":"'[4]Final Recon - Summary'!B590","v":"Individual - Physician Assistant"},{"$f":"'[4]Final Recon - Summary'!C590","v":"Per Billable Minute"},{"$f":"'[4]Final Recon - Summary'!D590","v":9.23},{"$f":"UnitsDetails50[[#This Row],[ODS DMC General Units]]+UnitsDetails50[[#This Row],[ODS General Units]]+UnitsDetails50[[#This Row],[ODS DMC AB109 Units]]+UnitsDetails50[[#This Row],[ODS AB109 Units]]+UnitsDetails50[[#This Row],[Room & Board Units]]+UnitsDetails50[[#This Row],[SUD Non-Billable Units]]","v":0},0,null,0,null,{"$f":"UnitsDetails50[[#This Row],[ODS General Units]]*UnitsDetails50[[#This Row],[Rate]]","v":0},null,{"$f":"UnitsDetails50[[#This Row],[Rate]]*UnitsDetails50[[#This Row],[ODS DMC AB109 Units]]","v":0},null,{"$f":"UnitsDetails50[[#This Row],[Rate]]*UnitsDetails50[[#This Row],[ODS AB109 Units]]","v":0},null,{"$f":"UnitsDetails50[[#This Row],[Rate]]*UnitsDetails50[[#This Row],[SUD Non-Billable Units]]","v":0},null,{"$f":"UnitsDetails50[[#This Row],[Rate]]*UnitsDetails50[[#This Row],[Room & Board Units]]","v":0},null,{"$f":"'[4]Final Recon - Summary'!G590","v":0},{"$f":"UnitsDetails50[[#This Row],[ODS DMC General Units]]+UnitsDetails50[[#This Row],[ODS General Units]]+UnitsDetails50[[#This Row],[ODS DMC AB109 Units]]+UnitsDetails50[[#This Row],[ODS AB109 Units]]+UnitsDetails50[[#This Row],[SUD Non-Billable Units]]+UnitsDetails50[[#This Row],[Room & Board Units]]","v":0},0]
[0,{"$f":"'[4]Final Recon - Summary'!B591","v":"Individual - Psychologist/Pre-licensed Psychologist"},{"$f":"'[4]Final Recon - Summary'!C591","v":"Per Billable Minute"},{"$f":"'[4]Final Recon - Summary'!D591","v":8.2799999999999994},{"$f":"UnitsDetails50[[#This Row],[ODS DMC General Units]]+UnitsDetails50[[#This Row],[ODS General Units]]+UnitsDetails50[[#This Row],[ODS DMC AB109 Units]]+UnitsDetails50[[#This Row],[ODS AB109 Units]]+UnitsDetails50[[#This Row],[Room & Board Units]]+UnitsDetails50[[#This Row],[SUD Non-Billable Units]]","v":0},0,null,0,null,{"$f":"UnitsDetails50[[#This Row],[ODS General Units]]*UnitsDetails50[[#This Row],[Rate]]","v":0},null,{"$f":"UnitsDetails50[[#This Row],[Rate]]*UnitsDetails50[[#This Row],[ODS DMC AB109 Units]]","v":0},null,{"$f":"UnitsDetails50[[#This Row],[Rate]]*UnitsDetails50[[#This Row],[ODS AB109 Units]]","v":0},null,{"$f":"UnitsDetails50[[#This Row],[Rate]]*UnitsDetails50[[#This Row],[SUD Non-Billable Units]]","v":0},null,{"$f":"UnitsDetails50[[#This Row],[Rate]]*UnitsDetails50[[#This Row],[Room & Board Units]]","v":0},null,{"$f":"'[4]Final Recon - Summary'!G591","v":0},{"$f":"UnitsDetails50[[#This Row],[ODS DMC General Units]]+UnitsDetails50[[#This Row],[ODS General Units]]+UnitsDetails50[[#This Row],[ODS DMC AB109 Units]]+UnitsDetails50[[#This Row],[ODS AB109 Units]]+UnitsDetails50[[#This Row],[SUD Non-Billable Units]]+UnitsDetails50[[#This Row],[Room & Board Units]]","v":0},0]
[0,{"$f":"'[4]Final Recon - Summary'!B592","v":"Individual - Psychiatrist/ Contracted Psychiatrist/Licensed Physician (MD)"},{"$f":"'[4]Final Recon - Summary'!C592","v":"Per Billable Minute"},{"$f":"'[4]Final Recon - Summary'!D592","v":11.57},{"$f":"UnitsDetails50[[#This Row],[ODS DMC General Units]]+UnitsDetails50[[#This Row],[ODS General Units]]+UnitsDetails50[[#This Row],[ODS DMC AB109 Units]]+UnitsDetails50[[#This Row],[ODS AB109 Units]]+UnitsDetails50[[#This Row],[Room & Board Units]]+UnitsDetails50[[#This Row],[SUD Non-Billable Units]]","v":0},0,null,0,null,{"$f":"UnitsDetails50[[#This Row],[ODS General Units]]*UnitsDetails50[[#This Row],[Rate]]","v":0},null,{"$f":"UnitsDetails50[[#This Row],[Rate]]*UnitsDetails50[[#This Row],[ODS DMC AB109 Units]]","v":0},null,{"$f":"UnitsDetails50[[#This Row],[Rate]]*UnitsDetails50[[#This Row],[ODS AB109 Units]]","v":0},null,{"$f":"UnitsDetails50[[#This Row],[Rate]]*UnitsDetails50[[#This Row],[SUD Non-Billable Units]]","v":0},null,{"$f":"UnitsDetails50[[#This Row],[Rate]]*UnitsDetails50[[#This Row],[Room & Board Units]]","v":0},null,{"$f":"'[4]Final Recon - Summary'!G592","v":0},{"$f":"UnitsDetails50[[#This Row],[ODS DMC General Units]]+UnitsDetails50[[#This Row],[ODS General Units]]+UnitsDetails50[[#This Row],[ODS DMC AB109 Units]]+UnitsDetails50[[#This Row],[ODS AB109 Units]]+UnitsDetails50[[#This Row],[SUD Non-Billable Units]]+UnitsDetails50[[#This Row],[Room & Board Units]]","v":0},0]
[0,{"$f":"'[4]Final Recon - Summary'!B593","v":"Individual - Registered Nurse (RN)"},{"$f":"'[4]Final Recon - Summary'!C593","v":"Per Billable Minute"},{"$f":"'[4]Final Recon - Summary'!D593","v":8.36},{"$f":"UnitsDetails50[[#This Row],[ODS DMC General Units]]+UnitsDetails50[[#This Row],[ODS General Units]]+UnitsDetails50[[#This Row],[ODS DMC AB109 Units]]+UnitsDetails50[[#This Row],[ODS AB109 Units]]+UnitsDetails50[[#This Row],[Room & Board Units]]+UnitsDetails50[[#This Row],[SUD Non-Billable Units]]","v":0},0,null,0,null,{"$f":"UnitsDetails50[[#This Row],[ODS General Units]]*UnitsDetails50[[#This Row],[Rate]]","v":0},null,{"$f":"UnitsDetails50[[#This Row],[Rate]]*UnitsDetails50[[#This Row],[ODS DMC AB109 Units]]","v":0},null,{"$f":"UnitsDetails50[[#This Row],[Rate]]*UnitsDetails50[[#This Row],[ODS AB109 Units]]","v":0},null,{"$f":"UnitsDetails50[[#This Row],[Rate]]*UnitsDetails50[[#This Row],[SUD Non-Billable Units]]","v":0},null,{"$f":"UnitsDetails50[[#This Row],[Rate]]*UnitsDetails50[[#This Row],[Room & Board Units]]","v":0},null,{"$f":"'[4]Final Recon - Summary'!G593","v":0},{"$f":"UnitsDetails50[[#This Row],[ODS DMC General Units]]+UnitsDetails50[[#This Row],[ODS General Units]]+UnitsDetails50[[#This Row],[ODS DMC AB109 Units]]+UnitsDetails50[[#This Row],[ODS AB109 Units]]+UnitsDetails50[[#This Row],[SUD Non-Billable Units]]+UnitsDetails50[[#This Row],[Room & Board Units]]","v":0},0]
[0,{"$f":"'[4]Final Recon - Summary'!B594","v":"Individual - Registered Pharmacist"},{"$f":"'[4]Final Recon - Summary'!C594","v":"Per Billable Minute"},{"$f":"'[4]Final Recon - Summary'!D594","v":9.84},{"$f":"UnitsDetails50[[#This Row],[ODS DMC General Units]]+UnitsDetails50[[#This Row],[ODS General Units]]+UnitsDetails50[[#This Row],[ODS DMC AB109 Units]]+UnitsDetails50[[#This Row],[ODS AB109 Units]]+UnitsDetails50[[#This Row],[Room & Board Units]]+UnitsDetails50[[#This Row],[SUD Non-Billable Units]]","v":0},0,null,0,null,{"$f":"UnitsDetails50[[#This Row],[ODS General Units]]*UnitsDetails50[[#This Row],[Rate]]","v":0},null,{"$f":"UnitsDetails50[[#This Row],[Rate]]*UnitsDetails50[[#This Row],[ODS DMC AB109 Units]]","v":0},null,{"$f":"UnitsDetails50[[#This Row],[Rate]]*UnitsDetails50[[#This Row],[ODS AB109 Units]]","v":0},null,{"$f":"UnitsDetails50[[#This Row],[Rate]]*UnitsDetails50[[#This Row],[SUD Non-Billable Units]]","v":0},null,{"$f":"UnitsDetails50[[#This Row],[Rate]]*UnitsDetails50[[#This Row],[Room & Board Units]]","v":0},null,{"$f":"'[4]Final Recon - Summary'!G594","v":0},{"$f":"UnitsDetails50[[#This Row],[ODS DMC General Units]]+UnitsDetails50[[#This Row],[ODS General Units]]+UnitsDetails50[[#This Row],[ODS DMC AB109 Units]]+UnitsDetails50[[#This Row],[ODS AB109 Units]]+UnitsDetails50[[#This Row],[SUD Non-Billable Units]]+UnitsDetails50[[#This Row],[Room & Board Units]]","v":0},0]
[0,{"$f":"'[4]Final Recon - Summary'!B595","v":"Individual - Interpreter Services"},{"$f":"'[4]Final Recon - Summary'!C595","v":"Per Billable Minute"},{"$f":"'[4]Final Recon - Summary'!D595","v":2.19},{"$f":"UnitsDetails50[[#This Row],[ODS DMC General Units]]+UnitsDetails50[[#This Row],[ODS General Units]]+UnitsDetails50[[#This Row],[ODS DMC AB109 Units]]+UnitsDetails50[[#This Row],[ODS AB109 Units]]+UnitsDetails50[[#This Row],[Room & Board Units]]+UnitsDetails50[[#This Row],[SUD Non-Billable Units]]","v":0},0,null,0,null,{"$f":"UnitsDetails50[[#This Row],[ODS General Units]]*UnitsDetails50[[#This Row],[Rate]]","v":0},null,{"$f":"UnitsDetails50[[#This Row],[Rate]]*UnitsDetails50[[#This Row],[ODS DMC AB109 Units]]","v":0},null,{"$f":"UnitsDetails50[[#This Row],[Rate]]*UnitsDetails50[[#This Row],[ODS AB109 Units]]","v":0},null,{"$f":"UnitsDetails50[[#This Row],[Rate]]*UnitsDetails50[[#This Row],[SUD Non-Billable Units]]","v":0},null,{"$f":"UnitsDetails50[[#This Row],[Rate]]*UnitsDetails50[[#This Row],[Room & Board Units]]","v":0},null,{"$f":"'[4]Final Recon - Summary'!G595","v":0},{"$f":"UnitsDetails50[[#This Row],[ODS DMC General Units]]+UnitsDetails50[[#This Row],[ODS General Units]]+UnitsDetails50[[#This Row],[ODS DMC AB109 Units]]+UnitsDetails50[[#This Row],[ODS AB109 Units]]+UnitsDetails50[[#This Row],[SUD Non-Billable Units]]+UnitsDetails50[[#This Row],[Room & Board Units]]","v":0},0]
[0,{"$f":"'[4]Final Recon - Summary'!B596","v":"Interactive Complexity"},{"$f":"'[4]Final Recon - Summary'!C596","v":"Per Occurrence"},{"$f":"'[4]Final Recon - Summary'!D596","v":14.61},{"$f":"UnitsDetails50[[#This Row],[ODS DMC General Units]]+UnitsDetails50[[#This Row],[ODS General Units]]+UnitsDetails50[[#This Row],[ODS DMC AB109 Units]]+UnitsDetails50[[#This Row],[ODS AB109 Units]]+UnitsDetails50[[#This Row],[Room & Board Units]]+UnitsDetails50[[#This Row],[SUD Non-Billable Units]]","v":0},0,null,0,null,{"$f":"UnitsDetails50[[#This Row],[ODS General Units]]*UnitsDetails50[[#This Row],[Rate]]","v":0},null,{"$f":"UnitsDetails50[[#This Row],[Rate]]*UnitsDetails50[[#This Row],[ODS DMC AB109 Units]]","v":0},null,{"$f":"UnitsDetails50[[#This Row],[Rate]]*UnitsDetails50[[#This Row],[ODS AB109 Units]]","v":0},null,{"$f":"UnitsDetails50[[#This Row],[Rate]]*UnitsDetails50[[#This Row],[SUD Non-Billable Units]]","v":0},null,{"$f":"UnitsDetails50[[#This Row],[Rate]]*UnitsDetails50[[#This Row],[Room & Board Units]]","v":0},null,{"$f":"'[4]Final Recon - Summary'!G596","v":0},{"$f":"UnitsDetails50[[#This Row],[ODS DMC General Units]]+UnitsDetails50[[#This Row],[ODS General Units]]+UnitsDetails50[[#This Row],[ODS DMC AB109 Units]]+UnitsDetails50[[#This Row],[ODS AB109 Units]]+UnitsDetails50[[#This Row],[SUD Non-Billable Units]]+UnitsDetails50[[#This Row],[Room & Board Units]]","v":0},0]
[0,{"$f":"'[4]Final Recon - Summary'!B597","v":"Parent-Child Interaction Therapy (PCIT Modifier 22)"},{"$f":"'[4]Final Recon - Summary'!C597","v":"Per Occurrence"},{"$f":"'[4]Final Recon - Summary'!D597","v":2.56},{"$f":"UnitsDetails50[[#This Row],[ODS DMC General Units]]+UnitsDetails50[[#This Row],[ODS General Units]]+UnitsDetails50[[#This Row],[ODS DMC AB109 Units]]+UnitsDetails50[[#This Row],[ODS AB109 Units]]+UnitsDetails50[[#This Row],[Room & Board Units]]+UnitsDetails50[[#This Row],[SUD Non-Billable Units]]","v":0},0,null,0,null,{"$f":"UnitsDetails50[[#This Row],[ODS General Units]]*UnitsDetails50[[#This Row],[Rate]]","v":0},null,{"$f":"UnitsDetails50[[#This Row],[Rate]]*UnitsDetails50[[#This Row],[ODS DMC AB109 Units]]","v":0},null,{"$f":"UnitsDetails50[[#This Row],[Rate]]*UnitsDetails50[[#This Row],[ODS AB109 Units]]","v":0},null,{"$f":"UnitsDetails50[[#This Row],[Rate]]*UnitsDetails50[[#This Row],[SUD Non-Billable Units]]","v":0},null,{"$f":"UnitsDetails50[[#This Row],[Rate]]*UnitsDetails50[[#This Row],[Room & Board Units]]","v":0},null,{"$f":"'[4]Final Recon - Summary'!G597","v":0},{"$f":"UnitsDetails50[[#This Row],[ODS DMC General Units]]+UnitsDetails50[[#This Row],[ODS General Units]]+UnitsDetails50[[#This Row],[ODS DMC AB109 Units]]+UnitsDetails50[[#This Row],[ODS AB109 Units]]+UnitsDetails50[[#This Row],[SUD Non-Billable Units]]+UnitsDetails50[[#This Row],[Room & Board Units]]","v":0},0]
[0,{"$f":"'[4]Final Recon - Summary'!B598","v":"Group - Alcohol and Drug Counselor"},{"$f":"'[4]Final Recon - Summary'!C598","v":"Per Billable Minute"},{"$f":"'[4]Final Recon - Summary'!D598","v":0.98},{"$f":"UnitsDetails50[[#This Row],[ODS DMC General Units]]+UnitsDetails50[[#This Row],[ODS General Units]]+UnitsDetails50[[#This Row],[ODS DMC AB109 Units]]+UnitsDetails50[[#This Row],[ODS AB109 Units]]+UnitsDetails50[[#This Row],[Room & Board Units]]+UnitsDetails50[[#This Row],[SUD Non-Billable Units]]","v":0},0,null,0,null,{"$f":"UnitsDetails50[[#This Row],[ODS General Units]]*UnitsDetails50[[#This Row],[Rate]]","v":0},null,{"$f":"UnitsDetails50[[#This Row],[Rate]]*UnitsDetails50[[#This Row],[ODS DMC AB109 Units]]","v":0},null,{"$f":"UnitsDetails50[[#This Row],[Rate]]*UnitsDetails50[[#This Row],[ODS AB109 Units]]","v":0},null,{"$f":"UnitsDetails50[[#This Row],[Rate]]*UnitsDetails50[[#This Row],[SUD Non-Billable Units]]","v":0},null,{"$f":"UnitsDetails50[[#This Row],[Rate]]*UnitsDetails50[[#This Row],[Room & Board Units]]","v":0},null,{"$f":"'[4]Final Recon - Summary'!G598","v":0},{"$f":"UnitsDetails50[[#This Row],[ODS DMC General Units]]+UnitsDetails50[[#This Row],[ODS General Units]]+UnitsDetails50[[#This Row],[ODS DMC AB109 Units]]+UnitsDetails50[[#This Row],[ODS AB109 Units]]+UnitsDetails50[[#This Row],[SUD Non-Billable Units]]+UnitsDetails50[[#This Row],[Room & Board Units]]","v":0},0]
[0,{"$f":"'[4]Final Recon - Summary'!B599","v":"Group - Clinical Nurse Specialist"},{"$f":"'[4]Final Recon - Summary'!C599","v":"Per Billable Minute"},{"$f":"'[4]Final Recon - Summary'!D599","v":2.2799999999999998},{"$f":"UnitsDetails50[[#This Row],[ODS DMC General Units]]+UnitsDetails50[[#This Row],[ODS General Units]]+UnitsDetails50[[#This Row],[ODS DMC AB109 Units]]+UnitsDetails50[[#This Row],[ODS AB109 Units]]+UnitsDetails50[[#This Row],[Room & Board Units]]+UnitsDetails50[[#This Row],[SUD Non-Billable Units]]","v":0},0,null,0,null,{"$f":"UnitsDetails50[[#This Row],[ODS General Units]]*UnitsDetails50[[#This Row],[Rate]]","v":0},null,{"$f":"UnitsDetails50[[#This Row],[Rate]]*UnitsDetails50[[#This Row],[ODS DMC AB109 Units]]","v":0},null,{"$f":"UnitsDetails50[[#This Row],[Rate]]*UnitsDetails50[[#This Row],[ODS AB109 Units]]","v":0},null,{"$f":"UnitsDetails50[[#This Row],[Rate]]*UnitsDetails50[[#This Row],[SUD Non-Billable Units]]","v":0},null,{"$f":"UnitsDetails50[[#This Row],[Rate]]*UnitsDetails50[[#This Row],[Room & Board Units]]","v":0},null,{"$f":"'[4]Final Recon - Summary'!G599","v":0},{"$f":"UnitsDetails50[[#This Row],[ODS DMC General Units]]+UnitsDetails50[[#This Row],[ODS General Units]]+UnitsDetails50[[#This Row],[ODS DMC AB109 Units]]+UnitsDetails50[[#This Row],[ODS AB109 Units]]+UnitsDetails50[[#This Row],[SUD Non-Billable Units]]+UnitsDetails50[[#This Row],[Room & Board Units]]","v":0},0]
[0,{"$f":"'[4]Final Recon - Summary'!B600","v":"Group - Community Health Worker (CPT 98961)"},{"$f":"'[4]Final Recon - Summary'!C600","v":"Per Billable Minute"},{"$f":"'[4]Final Recon - Summary'!D600","v":1.3800000000000001},{"$f":"UnitsDetails50[[#This Row],[ODS DMC General Units]]+UnitsDetails50[[#This Row],[ODS General Units]]+UnitsDetails50[[#This Row],[ODS DMC AB109 Units]]+UnitsDetails50[[#This Row],[ODS AB109 Units]]+UnitsDetails50[[#This Row],[Room & Board Units]]+UnitsDetails50[[#This Row],[SUD Non-Billable Units]]","v":0},0,null,0,null,{"$f":"UnitsDetails50[[#This Row],[ODS General Units]]*UnitsDetails50[[#This Row],[Rate]]","v":0},null,{"$f":"UnitsDetails50[[#This Row],[Rate]]*UnitsDetails50[[#This Row],[ODS DMC AB109 Units]]","v":0},null,{"$f":"UnitsDetails50[[#This Row],[Rate]]*UnitsDetails50[[#This Row],[ODS AB109 Units]]","v":0},null,{"$f":"UnitsDetails50[[#This Row],[Rate]]*UnitsDetails50[[#This Row],[SUD Non-Billable Units]]","v":0},null,{"$f":"UnitsDetails50[[#This Row],[Rate]]*UnitsDetails50[[#This Row],[Room & Board Units]]","v":0},null,{"$f":"'[4]Final Recon - Summary'!G600","v":0},{"$f":"UnitsDetails50[[#This Row],[ODS DMC General Units]]+UnitsDetails50[[#This Row],[ODS General Units]]+UnitsDetails50[[#This Row],[ODS DMC AB109 Units]]+UnitsDetails50[[#This Row],[ODS AB109 Units]]+UnitsDetails50[[#This Row],[SUD Non-Billable Units]]+UnitsDetails50[[#This Row],[Room & Board Units]]","v":0},0]
[0,{"$f":"'[4]Final Recon - Summary'!B601","v":"Group - Community Health Worker (CPT 98962)"},{"$f":"'[4]Final Recon - Summary'!C601","v":"Per Billable Minute"},{"$f":"'[4]Final Recon - Summary'!D601","v":0.63},{"$f":"UnitsDetails50[[#This Row],[ODS DMC General Units]]+UnitsDetails50[[#This Row],[ODS General Units]]+UnitsDetails50[[#This Row],[ODS DMC AB109 Units]]+UnitsDetails50[[#This Row],[ODS AB109 Units]]+UnitsDetails50[[#This Row],[Room & Board Units]]+UnitsDetails50[[#This Row],[SUD Non-Billable Units]]","v":0},0,null,0,null,{"$f":"UnitsDetails50[[#This Row],[ODS General Units]]*UnitsDetails50[[#This Row],[Rate]]","v":0},null,{"$f":"UnitsDetails50[[#This Row],[Rate]]*UnitsDetails50[[#This Row],[ODS DMC AB109 Units]]","v":0},null,{"$f":"UnitsDetails50[[#This Row],[Rate]]*UnitsDetails50[[#This Row],[ODS AB109 Units]]","v":0},null,{"$f":"UnitsDetails50[[#This Row],[Rate]]*UnitsDetails50[[#This Row],[SUD Non-Billable Units]]","v":0},null,{"$f":"UnitsDetails50[[#This Row],[Rate]]*UnitsDetails50[[#This Row],[Room & Board Units]]","v":0},null,{"$f":"'[4]Final Recon - Summary'!G601","v":0},{"$f":"UnitsDetails50[[#This Row],[ODS DMC General Units]]+UnitsDetails50[[#This Row],[ODS General Units]]+UnitsDetails50[[#This Row],[ODS DMC AB109 Units]]+UnitsDetails50[[#This Row],[ODS AB109 Units]]+UnitsDetails50[[#This Row],[SUD Non-Billable Units]]+UnitsDetails50[[#This Row],[Room & Board Units]]","v":0},0]
[0,{"$f":"'[4]Final Recon - Summary'!B602","v":"Group - Licensed Psychiatric Technician"},{"$f":"'[4]Final Recon - Summary'!C602","v":"Per Billable Minute"},{"$f":"'[4]Final Recon - Summary'!D602","v":0.84000000000000008},{"$f":"UnitsDetails50[[#This Row],[ODS DMC General Units]]+UnitsDetails50[[#This Row],[ODS General Units]]+UnitsDetails50[[#This Row],[ODS DMC AB109 Units]]+UnitsDetails50[[#This Row],[ODS AB109 Units]]+UnitsDetails50[[#This Row],[Room & Board Units]]+UnitsDetails50[[#This Row],[SUD Non-Billable Units]]","v":0},0,null,0,null,{"$f":"UnitsDetails50[[#This Row],[ODS General Units]]*UnitsDetails50[[#This Row],[Rate]]","v":0},null,{"$f":"UnitsDetails50[[#This Row],[Rate]]*UnitsDetails50[[#This Row],[ODS DMC AB109 Units]]","v":0},null,{"$f":"UnitsDetails50[[#This Row],[Rate]]*UnitsDetails50[[#This Row],[ODS AB109 Units]]","v":0},null,{"$f":"UnitsDetails50[[#This Row],[Rate]]*UnitsDetails50[[#This Row],[SUD Non-Billable Units]]","v":0},null,{"$f":"UnitsDetails50[[#This Row],[Rate]]*UnitsDetails50[[#This Row],[Room & Board Units]]","v":0},null,{"$f":"'[4]Final Recon - Summary'!G602","v":0},{"$f":"UnitsDetails50[[#This Row],[ODS DMC General Units]]+UnitsDetails50[[#This Row],[ODS General Units]]+UnitsDetails50[[#This Row],[ODS DMC AB109 Units]]+UnitsDetails50[[#This Row],[ODS AB109 Units]]+UnitsDetails50[[#This Row],[SUD Non-Billable Units]]+UnitsDetails50[[#This Row],[Room & Board Units]]","v":0},0]
[0,{"$f":"'[4]Final Recon - Summary'!B603","v":"Group - LPHA (MFT  LCSW  LPCC)/Intern or Waivered LPHA (MFT  LCSW  LPCC)"},{"$f":"'[4]Final Recon - Summary'!C603","v":"Per Billable Minute"},{"$f":"'[4]Final Recon - Summary'!D603","v":1.1900000000000002},{"$f":"UnitsDetails50[[#This Row],[ODS DMC General Units]]+UnitsDetails50[[#This Row],[ODS General Units]]+UnitsDetails50[[#This Row],[ODS DMC AB109 Units]]+UnitsDetails50[[#This Row],[ODS AB109 Units]]+UnitsDetails50[[#This Row],[Room & Board Units]]+UnitsDetails50[[#This Row],[SUD Non-Billable Units]]","v":0},0,null,0,null,{"$f":"UnitsDetails50[[#This Row],[ODS General Units]]*UnitsDetails50[[#This Row],[Rate]]","v":0},null,{"$f":"UnitsDetails50[[#This Row],[Rate]]*UnitsDetails50[[#This Row],[ODS DMC AB109 Units]]","v":0},null,{"$f":"UnitsDetails50[[#This Row],[Rate]]*UnitsDetails50[[#This Row],[ODS AB109 Units]]","v":0},null,{"$f":"UnitsDetails50[[#This Row],[Rate]]*UnitsDetails50[[#This Row],[SUD Non-Billable Units]]","v":0},null,{"$f":"UnitsDetails50[[#This Row],[Rate]]*UnitsDetails50[[#This Row],[Room & Board Units]]","v":0},null,{"$f":"'[4]Final Recon - Summary'!G603","v":0},{"$f":"UnitsDetails50[[#This Row],[ODS DMC General Units]]+UnitsDetails50[[#This Row],[ODS General Units]]+UnitsDetails50[[#This Row],[ODS DMC AB109 Units]]+UnitsDetails50[[#This Row],[ODS AB109 Units]]+UnitsDetails50[[#This Row],[SUD Non-Billable Units]]+UnitsDetails50[[#This Row],[Room & Board Units]]","v":0},0]
[0,{"$f":"'[4]Final Recon - Summary'!B604","v":"Group - Licensed Vocational Nurse (LVN)"},{"$f":"'[4]Final Recon - Summary'!C604","v":"Per Billable Minute"},{"$f":"'[4]Final Recon - Summary'!D604","v":0.98},{"$f":"UnitsDetails50[[#This Row],[ODS DMC General Units]]+UnitsDetails50[[#This Row],[ODS General Units]]+UnitsDetails50[[#This Row],[ODS DMC AB109 Units]]+UnitsDetails50[[#This Row],[ODS AB109 Units]]+UnitsDetails50[[#This Row],[Room & Board Units]]+UnitsDetails50[[#This Row],[SUD Non-Billable Units]]","v":0},0,null,0,null,{"$f":"UnitsDetails50[[#This Row],[ODS General Units]]*UnitsDetails50[[#This Row],[Rate]]","v":0},null,{"$f":"UnitsDetails50[[#This Row],[Rate]]*UnitsDetails50[[#This Row],[ODS DMC AB109 Units]]","v":0},null,{"$f":"UnitsDetails50[[#This Row],[Rate]]*UnitsDetails50[[#This Row],[ODS AB109 Units]]","v":0},null,{"$f":"UnitsDetails50[[#This Row],[Rate]]*UnitsDetails50[[#This Row],[SUD Non-Billable Units]]","v":0},null,{"$f":"UnitsDetails50[[#This Row],[Rate]]*UnitsDetails50[[#This Row],[Room & Board Units]]","v":0},null,{"$f":"'[4]Final Recon - Summary'!G604","v":0},{"$f":"UnitsDetails50[[#This Row],[ODS DMC General Units]]+UnitsDetails50[[#This Row],[ODS General Units]]+UnitsDetails50[[#This Row],[ODS DMC AB109 Units]]+UnitsDetails50[[#This Row],[ODS AB109 Units]]+UnitsDetails50[[#This Row],[SUD Non-Billable Units]]+UnitsDetails50[[#This Row],[Room & Board Units]]","v":0},0]
[0,{"$f":"'[4]Final Recon - Summary'!B605","v":"Group - Medical Assistant"},{"$f":"'[4]Final Recon - Summary'!C605","v":"Per Billable Minute"},{"$f":"'[4]Final Recon - Summary'!D605","v":0.68},{"$f":"UnitsDetails50[[#This Row],[ODS DMC General Units]]+UnitsDetails50[[#This Row],[ODS General Units]]+UnitsDetails50[[#This Row],[ODS DMC AB109 Units]]+UnitsDetails50[[#This Row],[ODS AB109 Units]]+UnitsDetails50[[#This Row],[Room & Board Units]]+UnitsDetails50[[#This Row],[SUD Non-Billable Units]]","v":0},0,null,0,null,{"$f":"UnitsDetails50[[#This Row],[ODS General Units]]*UnitsDetails50[[#This Row],[Rate]]","v":0},null,{"$f":"UnitsDetails50[[#This Row],[Rate]]*UnitsDetails50[[#This Row],[ODS DMC AB109 Units]]","v":0},null,{"$f":"UnitsDetails50[[#This Row],[Rate]]*UnitsDetails50[[#This Row],[ODS AB109 Units]]","v":0},null,{"$f":"UnitsDetails50[[#This Row],[Rate]]*UnitsDetails50[[#This Row],[SUD Non-Billable Units]]","v":0},null,{"$f":"UnitsDetails50[[#This Row],[Rate]]*UnitsDetails50[[#This Row],[Room & Board Units]]","v":0},null,{"$f":"'[4]Final Recon - Summary'!G605","v":0},{"$f":"UnitsDetails50[[#This Row],[ODS DMC General Units]]+UnitsDetails50[[#This Row],[ODS General Units]]+UnitsDetails50[[#This Row],[ODS DMC AB109 Units]]+UnitsDetails50[[#This Row],[ODS AB109 Units]]+UnitsDetails50[[#This Row],[SUD Non-Billable Units]]+UnitsDetails50[[#This Row],[Room & Board Units]]","v":0},0]
[0,{"$f":"'[4]Final Recon - Summary'!B606","v":"Group - Mental Health Rehabilitation Specialist"},{"$f":"'[4]Final Recon - Summary'!C606","v":"Per Billable Minute"},{"$f":"'[4]Final Recon - Summary'!D606","v":0.89999999999999991},{"$f":"UnitsDetails50[[#This Row],[ODS DMC General Units]]+UnitsDetails50[[#This Row],[ODS General Units]]+UnitsDetails50[[#This Row],[ODS DMC AB109 Units]]+UnitsDetails50[[#This Row],[ODS AB109 Units]]+UnitsDetails50[[#This Row],[Room & Board Units]]+UnitsDetails50[[#This Row],[SUD Non-Billable Units]]","v":0},0,null,0,null,{"$f":"UnitsDetails50[[#This Row],[ODS General Units]]*UnitsDetails50[[#This Row],[Rate]]","v":0},null,{"$f":"UnitsDetails50[[#This Row],[Rate]]*UnitsDetails50[[#This Row],[ODS DMC AB109 Units]]","v":0},null,{"$f":"UnitsDetails50[[#This Row],[Rate]]*UnitsDetails50[[#This Row],[ODS AB109 Units]]","v":0},null,{"$f":"UnitsDetails50[[#This Row],[Rate]]*UnitsDetails50[[#This Row],[SUD Non-Billable Units]]","v":0},null,{"$f":"UnitsDetails50[[#This Row],[Rate]]*UnitsDetails50[[#This Row],[Room & Board Units]]","v":0},null,{"$f":"'[4]Final Recon - Summary'!G606","v":0},{"$f":"UnitsDetails50[[#This Row],[ODS DMC General Units]]+UnitsDetails50[[#This Row],[ODS General Units]]+UnitsDetails50[[#This Row],[ODS DMC AB109 Units]]+UnitsDetails50[[#This Row],[ODS AB109 Units]]+UnitsDetails50[[#This Row],[SUD Non-Billable Units]]+UnitsDetails50[[#This Row],[Room & Board Units]]","v":0},0]
[0,{"$f":"'[4]Final Recon - Summary'!B607","v":"Group - Nurse Practitioner"},{"$f":"'[4]Final Recon - Summary'!C607","v":"Per Billable Minute"},{"$f":"'[4]Final Recon - Summary'!D607","v":2.2799999999999998},{"$f":"UnitsDetails50[[#This Row],[ODS DMC General Units]]+UnitsDetails50[[#This Row],[ODS General Units]]+UnitsDetails50[[#This Row],[ODS DMC AB109 Units]]+UnitsDetails50[[#This Row],[ODS AB109 Units]]+UnitsDetails50[[#This Row],[Room & Board Units]]+UnitsDetails50[[#This Row],[SUD Non-Billable Units]]","v":0},0,null,0,null,{"$f":"UnitsDetails50[[#This Row],[ODS General Units]]*UnitsDetails50[[#This Row],[Rate]]","v":0},null,{"$f":"UnitsDetails50[[#This Row],[Rate]]*UnitsDetails50[[#This Row],[ODS DMC AB109 Units]]","v":0},null,{"$f":"UnitsDetails50[[#This Row],[Rate]]*UnitsDetails50[[#This Row],[ODS AB109 Units]]","v":0},null,{"$f":"UnitsDetails50[[#This Row],[Rate]]*UnitsDetails50[[#This Row],[SUD Non-Billable Units]]","v":0},null,{"$f":"UnitsDetails50[[#This Row],[Rate]]*UnitsDetails50[[#This Row],[Room & Board Units]]","v":0},null,{"$f":"'[4]Final Recon - Summary'!G607","v":0},{"$f":"UnitsDetails50[[#This Row],[ODS DMC General Units]]+UnitsDetails50[[#This Row],[ODS General Units]]+UnitsDetails50[[#This Row],[ODS DMC AB109 Units]]+UnitsDetails50[[#This Row],[ODS AB109 Units]]+UnitsDetails50[[#This Row],[SUD Non-Billable Units]]+UnitsDetails50[[#This Row],[Room & Board Units]]","v":0},0]
[0,{"$f":"'[4]Final Recon - Summary'!B608","v":"Group - Occupational Therapist"},{"$f":"'[4]Final Recon - Summary'!C608","v":"Per Billable Minute"},{"$f":"'[4]Final Recon - Summary'!D608","v":1.59},{"$f":"UnitsDetails50[[#This Row],[ODS DMC General Units]]+UnitsDetails50[[#This Row],[ODS General Units]]+UnitsDetails50[[#This Row],[ODS DMC AB109 Units]]+UnitsDetails50[[#This Row],[ODS AB109 Units]]+UnitsDetails50[[#This Row],[Room & Board Units]]+UnitsDetails50[[#This Row],[SUD Non-Billable Units]]","v":0},0,null,0,null,{"$f":"UnitsDetails50[[#This Row],[ODS General Units]]*UnitsDetails50[[#This Row],[Rate]]","v":0},null,{"$f":"UnitsDetails50[[#This Row],[Rate]]*UnitsDetails50[[#This Row],[ODS DMC AB109 Units]]","v":0},null,{"$f":"UnitsDetails50[[#This Row],[Rate]]*UnitsDetails50[[#This Row],[ODS AB109 Units]]","v":0},null,{"$f":"UnitsDetails50[[#This Row],[Rate]]*UnitsDetails50[[#This Row],[SUD Non-Billable Units]]","v":0},null,{"$f":"UnitsDetails50[[#This Row],[Rate]]*UnitsDetails50[[#This Row],[Room & Board Units]]","v":0},null,{"$f":"'[4]Final Recon - Summary'!G608","v":0},{"$f":"UnitsDetails50[[#This Row],[ODS DMC General Units]]+UnitsDetails50[[#This Row],[ODS General Units]]+UnitsDetails50[[#This Row],[ODS DMC AB109 Units]]+UnitsDetails50[[#This Row],[ODS AB109 Units]]+UnitsDetails50[[#This Row],[SUD Non-Billable Units]]+UnitsDetails50[[#This Row],[Room & Board Units]]","v":0},0]
[0,{"$f":"'[4]Final Recon - Summary'!B609","v":"Group - Other Qualified Providers - Other Designated MH staff that bill medical"},{"$f":"'[4]Final Recon - Summary'!C609","v":"Per Billable Minute"},{"$f":"'[4]Final Recon - Summary'!D609","v":0.89999999999999991},{"$f":"UnitsDetails50[[#This Row],[ODS DMC General Units]]+UnitsDetails50[[#This Row],[ODS General Units]]+UnitsDetails50[[#This Row],[ODS DMC AB109 Units]]+UnitsDetails50[[#This Row],[ODS AB109 Units]]+UnitsDetails50[[#This Row],[Room & Board Units]]+UnitsDetails50[[#This Row],[SUD Non-Billable Units]]","v":0},0,null,0,null,{"$f":"UnitsDetails50[[#This Row],[ODS General Units]]*UnitsDetails50[[#This Row],[Rate]]","v":0},null,{"$f":"UnitsDetails50[[#This Row],[Rate]]*UnitsDetails50[[#This Row],[ODS DMC AB109 Units]]","v":0},null,{"$f":"UnitsDetails50[[#This Row],[Rate]]*UnitsDetails50[[#This Row],[ODS AB109 Units]]","v":0},null,{"$f":"UnitsDetails50[[#This Row],[Rate]]*UnitsDetails50[[#This Row],[SUD Non-Billable Units]]","v":0},null,{"$f":"UnitsDetails50[[#This Row],[Rate]]*UnitsDetails50[[#This Row],[Room & Board Units]]","v":0},null,{"$f":"'[4]Final Recon - Summary'!G609","v":0},{"$f":"UnitsDetails50[[#This Row],[ODS DMC General Units]]+UnitsDetails50[[#This Row],[ODS General Units]]+UnitsDetails50[[#This Row],[ODS DMC AB109 Units]]+UnitsDetails50[[#This Row],[ODS AB109 Units]]+UnitsDetails50[[#This Row],[SUD Non-Billable Units]]+UnitsDetails50[[#This Row],[Room & Board Units]]","v":0},0]
[{"$f":"$C$5","v":0},{"$f":"'[4]Final Recon - Summary'!B610","v":"Group - Peer Support Specialist"},{"$f":"'[4]Final Recon - Summary'!C610","v":"Per Billable Minute"},{"$f":"'[4]Final Recon - Summary'!D610","v":0.94},{"$f":"UnitsDetails50[[#This Row],[ODS DMC General Units]]+UnitsDetails50[[#This Row],[ODS General Units]]+UnitsDetails50[[#This Row],[ODS DMC AB109 Units]]+UnitsDetails50[[#This Row],[ODS AB109 Units]]+UnitsDetails50[[#This Row],[Room & Board Units]]+UnitsDetails50[[#This Row],[SUD Non-Billable Units]]","v":0},0,null,0,null,{"$f":"UnitsDetails50[[#This Row],[ODS General Units]]*UnitsDetails50[[#This Row],[Rate]]","v":0},null,{"$f":"UnitsDetails50[[#This Row],[Rate]]*UnitsDetails50[[#This Row],[ODS DMC AB109 Units]]","v":0},null,{"$f":"UnitsDetails50[[#This Row],[Rate]]*UnitsDetails50[[#This Row],[ODS AB109 Units]]","v":0},null,{"$f":"UnitsDetails50[[#This Row],[Rate]]*UnitsDetails50[[#This Row],[SUD Non-Billable Units]]","v":0},null,{"$f":"UnitsDetails50[[#This Row],[Rate]]*UnitsDetails50[[#This Row],[Room & Board Units]]","v":0},null,{"$f":"'[4]Final Recon - Summary'!G610","v":0},{"$f":"UnitsDetails50[[#This Row],[ODS DMC General Units]]+UnitsDetails50[[#This Row],[ODS General Units]]+UnitsDetails50[[#This Row],[ODS DMC AB109 Units]]+UnitsDetails50[[#This Row],[ODS AB109 Units]]+UnitsDetails50[[#This Row],[SUD Non-Billable Units]]+UnitsDetails50[[#This Row],[Room & Board Units]]","v":0},0]
[0,{"$f":"'[4]Final Recon - Summary'!B611","v":"Group - Physician Assistant"},{"$f":"'[4]Final Recon - Summary'!C611","v":"Per Billable Minute"},{"$f":"'[4]Final Recon - Summary'!D611","v":2.04},{"$f":"UnitsDetails50[[#This Row],[ODS DMC General Units]]+UnitsDetails50[[#This Row],[ODS General Units]]+UnitsDetails50[[#This Row],[ODS DMC AB109 Units]]+UnitsDetails50[[#This Row],[ODS AB109 Units]]+UnitsDetails50[[#This Row],[Room & Board Units]]+UnitsDetails50[[#This Row],[SUD Non-Billable Units]]","v":0},0,null,0,null,{"$f":"UnitsDetails50[[#This Row],[ODS General Units]]*UnitsDetails50[[#This Row],[Rate]]","v":0},null,{"$f":"UnitsDetails50[[#This Row],[Rate]]*UnitsDetails50[[#This Row],[ODS DMC AB109 Units]]","v":0},null,{"$f":"UnitsDetails50[[#This Row],[Rate]]*UnitsDetails50[[#This Row],[ODS AB109 Units]]","v":0},null,{"$f":"UnitsDetails50[[#This Row],[Rate]]*UnitsDetails50[[#This Row],[SUD Non-Billable Units]]","v":0},null,{"$f":"UnitsDetails50[[#This Row],[Rate]]*UnitsDetails50[[#This Row],[Room & Board Units]]","v":0},null,{"$f":"'[4]Final Recon - Summary'!G611","v":0},{"$f":"UnitsDetails50[[#This Row],[ODS DMC General Units]]+UnitsDetails50[[#This Row],[ODS General Units]]+UnitsDetails50[[#This Row],[ODS DMC AB109 Units]]+UnitsDetails50[[#This Row],[ODS AB109 Units]]+UnitsDetails50[[#This Row],[SUD Non-Billable Units]]+UnitsDetails50[[#This Row],[Room & Board Units]]","v":0},0]
[0,{"$f":"'[4]Final Recon - Summary'!B612","v":"Group - Psychologist/Pre-licensed Psychologist"},{"$f":"'[4]Final Recon - Summary'!C612","v":"Per Billable Minute"},{"$f":"'[4]Final Recon - Summary'!D612","v":1.84},{"$f":"UnitsDetails50[[#This Row],[ODS DMC General Units]]+UnitsDetails50[[#This Row],[ODS General Units]]+UnitsDetails50[[#This Row],[ODS DMC AB109 Units]]+UnitsDetails50[[#This Row],[ODS AB109 Units]]+UnitsDetails50[[#This Row],[Room & Board Units]]+UnitsDetails50[[#This Row],[SUD Non-Billable Units]]","v":0},0,null,0,null,{"$f":"UnitsDetails50[[#This Row],[ODS General Units]]*UnitsDetails50[[#This Row],[Rate]]","v":0},null,{"$f":"UnitsDetails50[[#This Row],[Rate]]*UnitsDetails50[[#This Row],[ODS DMC AB109 Units]]","v":0},null,{"$f":"UnitsDetails50[[#This Row],[Rate]]*UnitsDetails50[[#This Row],[ODS AB109 Units]]","v":0},null,{"$f":"UnitsDetails50[[#This Row],[Rate]]*UnitsDetails50[[#This Row],[SUD Non-Billable Units]]","v":0},null,{"$f":"UnitsDetails50[[#This Row],[Rate]]*UnitsDetails50[[#This Row],[Room & Board Units]]","v":0},null,{"$f":"'[4]Final Recon - Summary'!G612","v":0},{"$f":"UnitsDetails50[[#This Row],[ODS DMC General Units]]+UnitsDetails50[[#This Row],[ODS General Units]]+UnitsDetails50[[#This Row],[ODS DMC AB109 Units]]+UnitsDetails50[[#This Row],[ODS AB109 Units]]+UnitsDetails50[[#This Row],[SUD Non-Billable Units]]+UnitsDetails50[[#This Row],[Room & Board Units]]","v":0},0]
[0,{"$f":"'[4]Final Recon - Summary'!B613","v":"Group - Psychiatrist/ Contracted Psychiatrist/Licensed Physician (MD)"},{"$f":"'[4]Final Recon - Summary'!C613","v":"Per Billable Minute"},{"$f":"'[4]Final Recon - Summary'!D613","v":2.57},{"$f":"UnitsDetails50[[#This Row],[ODS DMC General Units]]+UnitsDetails50[[#This Row],[ODS General Units]]+UnitsDetails50[[#This Row],[ODS DMC AB109 Units]]+UnitsDetails50[[#This Row],[ODS AB109 Units]]+UnitsDetails50[[#This Row],[Room & Board Units]]+UnitsDetails50[[#This Row],[SUD Non-Billable Units]]","v":0},0,null,0,null,{"$f":"UnitsDetails50[[#This Row],[ODS General Units]]*UnitsDetails50[[#This Row],[Rate]]","v":0},null,{"$f":"UnitsDetails50[[#This Row],[Rate]]*UnitsDetails50[[#This Row],[ODS DMC AB109 Units]]","v":0},null,{"$f":"UnitsDetails50[[#This Row],[Rate]]*UnitsDetails50[[#This Row],[ODS AB109 Units]]","v":0},null,{"$f":"UnitsDetails50[[#This Row],[Rate]]*UnitsDetails50[[#This Row],[SUD Non-Billable Units]]","v":0},null,{"$f":"UnitsDetails50[[#This Row],[Rate]]*UnitsDetails50[[#This Row],[Room & Board Units]]","v":0},null,{"$f":"'[4]Final Recon - Summary'!G613","v":0},{"$f":"UnitsDetails50[[#This Row],[ODS DMC General Units]]+UnitsDetails50[[#This Row],[ODS General Units]]+UnitsDetails50[[#This Row],[ODS DMC AB109 Units]]+UnitsDetails50[[#This Row],[ODS AB109 Units]]+UnitsDetails50[[#This Row],[SUD Non-Billable Units]]+UnitsDetails50[[#This Row],[Room & Board Units]]","v":0},0]
[0,{"$f":"'[4]Final Recon - Summary'!B614","v":"Group - Registered Nurse (RN)"},{"$f":"'[4]Final Recon - Summary'!C614","v":"Per Billable Minute"},{"$f":"'[4]Final Recon - Summary'!D614","v":1.8599999999999999},{"$f":"UnitsDetails50[[#This Row],[ODS DMC General Units]]+UnitsDetails50[[#This Row],[ODS General Units]]+UnitsDetails50[[#This Row],[ODS DMC AB109 Units]]+UnitsDetails50[[#This Row],[ODS AB109 Units]]+UnitsDetails50[[#This Row],[Room & Board Units]]+UnitsDetails50[[#This Row],[SUD Non-Billable Units]]","v":0},0,null,0,null,{"$f":"UnitsDetails50[[#This Row],[ODS General Units]]*UnitsDetails50[[#This Row],[Rate]]","v":0},null,{"$f":"UnitsDetails50[[#This Row],[Rate]]*UnitsDetails50[[#This Row],[ODS DMC AB109 Units]]","v":0},null,{"$f":"UnitsDetails50[[#This Row],[Rate]]*UnitsDetails50[[#This Row],[ODS AB109 Units]]","v":0},null,{"$f":"UnitsDetails50[[#This Row],[Rate]]*UnitsDetails50[[#This Row],[SUD Non-Billable Units]]","v":0},null,{"$f":"UnitsDetails50[[#This Row],[Rate]]*UnitsDetails50[[#This Row],[Room & Board Units]]","v":0},null,{"$f":"'[4]Final Recon - Summary'!G614","v":0},{"$f":"UnitsDetails50[[#This Row],[ODS DMC General Units]]+UnitsDetails50[[#This Row],[ODS General Units]]+UnitsDetails50[[#This Row],[ODS DMC AB109 Units]]+UnitsDetails50[[#This Row],[ODS AB109 Units]]+UnitsDetails50[[#This Row],[SUD Non-Billable Units]]+UnitsDetails50[[#This Row],[Room & Board Units]]","v":0},0]
[0,{"$f":"'[4]Final Recon - Summary'!B615","v":"Group - Registered Pharmacist"},{"$f":"'[4]Final Recon - Summary'!C615","v":"Per Billable Minute"},{"$f":"'[4]Final Recon - Summary'!D615","v":2.19},{"$f":"UnitsDetails50[[#This Row],[ODS DMC General Units]]+UnitsDetails50[[#This Row],[ODS General Units]]+UnitsDetails50[[#This Row],[ODS DMC AB109 Units]]+UnitsDetails50[[#This Row],[ODS AB109 Units]]+UnitsDetails50[[#This Row],[Room & Board Units]]+UnitsDetails50[[#This Row],[SUD Non-Billable Units]]","v":0},0,null,0,null,{"$f":"UnitsDetails50[[#This Row],[ODS General Units]]*UnitsDetails50[[#This Row],[Rate]]","v":0},null,{"$f":"UnitsDetails50[[#This Row],[Rate]]*UnitsDetails50[[#This Row],[ODS DMC AB109 Units]]","v":0},null,{"$f":"UnitsDetails50[[#This Row],[Rate]]*UnitsDetails50[[#This Row],[ODS AB109 Units]]","v":0},null,{"$f":"UnitsDetails50[[#This Row],[Rate]]*UnitsDetails50[[#This Row],[SUD Non-Billable Units]]","v":0},null,{"$f":"UnitsDetails50[[#This Row],[Rate]]*UnitsDetails50[[#This Row],[Room & Board Units]]","v":0},null,{"$f":"'[4]Final Recon - Summary'!G615","v":0},{"$f":"UnitsDetails50[[#This Row],[ODS DMC General Units]]+UnitsDetails50[[#This Row],[ODS General Units]]+UnitsDetails50[[#This Row],[ODS DMC AB109 Units]]+UnitsDetails50[[#This Row],[ODS AB109 Units]]+UnitsDetails50[[#This Row],[SUD Non-Billable Units]]+UnitsDetails50[[#This Row],[Room & Board Units]]","v":0},0]
[0,{"$f":"'[4]Final Recon - Summary'!B616","v":"Group - Interpreter Services"},{"$f":"'[4]Final Recon - Summary'!C616","v":"Per Billable Minute"},{"$f":"'[4]Final Recon - Summary'!D616","v":0.49},{"$f":"UnitsDetails50[[#This Row],[ODS DMC General Units]]+UnitsDetails50[[#This Row],[ODS General Units]]+UnitsDetails50[[#This Row],[ODS DMC AB109 Units]]+UnitsDetails50[[#This Row],[ODS AB109 Units]]+UnitsDetails50[[#This Row],[Room & Board Units]]+UnitsDetails50[[#This Row],[SUD Non-Billable Units]]","v":0},0,null,0,null,{"$f":"UnitsDetails50[[#This Row],[ODS General Units]]*UnitsDetails50[[#This Row],[Rate]]","v":0},null,{"$f":"UnitsDetails50[[#This Row],[Rate]]*UnitsDetails50[[#This Row],[ODS DMC AB109 Units]]","v":0},null,{"$f":"UnitsDetails50[[#This Row],[Rate]]*UnitsDetails50[[#This Row],[ODS AB109 Units]]","v":0},null,{"$f":"UnitsDetails50[[#This Row],[Rate]]*UnitsDetails50[[#This Row],[SUD Non-Billable Units]]","v":0},null,{"$f":"UnitsDetails50[[#This Row],[Rate]]*UnitsDetails50[[#This Row],[Room & Board Units]]","v":0},null,{"$f":"'[4]Final Recon - Summary'!G616","v":0},{"$f":"UnitsDetails50[[#This Row],[ODS DMC General Units]]+UnitsDetails50[[#This Row],[ODS General Units]]+UnitsDetails50[[#This Row],[ODS DMC AB109 Units]]+UnitsDetails50[[#This Row],[ODS AB109 Units]]+UnitsDetails50[[#This Row],[SUD Non-Billable Units]]+UnitsDetails50[[#This Row],[Room & Board Units]]","v":0},0]
[0,{"$f":"'[4]Final Recon - Summary'!B617","v":"Bundled Rates"}]
[0,{"$f":"'[4]Final Recon - Summary'!B618","v":"400 FACT/FSP Caseload"},{"$f":"'[4]Final Recon - Summary'!C618","v":"Bundled Full Month"},{"$f":"'[4]Final Recon - Summary'!D618","v":3000.74},{"$f":"UnitsDetails50[[#This Row],[ODS DMC General Units]]+UnitsDetails50[[#This Row],[ODS General Units]]+UnitsDetails50[[#This Row],[ODS DMC AB109 Units]]+UnitsDetails50[[#This Row],[ODS AB109 Units]]+UnitsDetails50[[#This Row],[Room & Board Units]]+UnitsDetails50[[#This Row],[SUD Non-Billable Units]]","v":0},{"$f":"+D528*E528","v":0},null,{"$f":"+D528*G528","v":0},null,{"$f":"UnitsDetails50[[#This Row],[ODS General Units]]*UnitsDetails50[[#This Row],[Rate]]","v":0},null,{"$f":"UnitsDetails50[[#This Row],[Rate]]*UnitsDetails50[[#This Row],[ODS DMC AB109 Units]]","v":0},null,{"$f":"UnitsDetails50[[#This Row],[Rate]]*UnitsDetails50[[#This Row],[ODS AB109 Units]]","v":0},null,{"$f":"UnitsDetails50[[#This Row],[Rate]]*UnitsDetails50[[#This Row],[SUD Non-Billable Units]]","v":0},null,{"$f":"UnitsDetails50[[#This Row],[Rate]]*UnitsDetails50[[#This Row],[Room & Board Units]]","v":0},null,{"$f":"'[4]Final Recon - Summary'!G618","v":0},{"$f":"UnitsDetails50[[#This Row],[ODS DMC General Units]]+UnitsDetails50[[#This Row],[ODS General Units]]+UnitsDetails50[[#This Row],[ODS DMC AB109 Units]]+UnitsDetails50[[#This Row],[ODS AB109 Units]]+UnitsDetails50[[#This Row],[SUD Non-Billable Units]]+UnitsDetails50[[#This Row],[Room & Board Units]]","v":0},{"$f":"T528-U528","v":0}]
[0,{"$f":"'[4]Final Recon - Summary'!B619","v":"400 FACT/FSP Caseload"},{"$f":"'[4]Final Recon - Summary'!C619","v":"Bundled Partial Month"},{"$f":"'[4]Final Recon - Summary'!D619","v":2000.49},{"$f":"UnitsDetails50[[#This Row],[ODS DMC General Units]]+UnitsDetails50[[#This Row],[ODS General Units]]+UnitsDetails50[[#This Row],[ODS DMC AB109 Units]]+UnitsDetails50[[#This Row],[ODS AB109 Units]]+UnitsDetails50[[#This Row],[Room & Board Units]]+UnitsDetails50[[#This Row],[SUD Non-Billable Units]]","v":0},{"$f":"+D529*E529","v":0},null,{"$f":"+D529*G529","v":0},null,{"$f":"UnitsDetails50[[#This Row],[ODS General Units]]*UnitsDetails50[[#This Row],[Rate]]","v":0},null,{"$f":"UnitsDetails50[[#This Row],[Rate]]*UnitsDetails50[[#This Row],[ODS DMC AB109 Units]]","v":0},null,{"$f":"UnitsDetails50[[#This Row],[Rate]]*UnitsDetails50[[#This Row],[ODS AB109 Units]]","v":0},null,{"$f":"UnitsDetails50[[#This Row],[Rate]]*UnitsDetails50[[#This Row],[SUD Non-Billable Units]]","v":0},null,{"$f":"UnitsDetails50[[#This Row],[Rate]]*UnitsDetails50[[#This Row],[Room & Board Units]]","v":0},null,{"$f":"'[4]Final Recon - Summary'!G619","v":0},{"$f":"UnitsDetails50[[#This Row],[ODS DMC General Units]]+UnitsDetails50[[#This Row],[ODS General Units]]+UnitsDetails50[[#This Row],[ODS DMC AB109 Units]]+UnitsDetails50[[#This Row],[ODS AB109 Units]]+UnitsDetails50[[#This Row],[SUD Non-Billable Units]]+UnitsDetails50[[#This Row],[Room & Board Units]]","v":0},{"$f":"T529-U529","v":0}]
[0]
[0]
[0]
[0]
[0]
[0]
[0]
[0]
[0]
[0,{"$f":"'[4]Final Recon - Summary'!B629","v":"Total"},null,null,{"$f":"UnitsDetails50[[#This Row],[ODS DMC General Units]]+UnitsDetails50[[#This Row],[ODS General Units]]+UnitsDetails50[[#This Row],[ODS DMC AB109 Units]]+UnitsDetails50[[#This Row],[ODS AB109 Units]]+UnitsDetails50[[#This Row],[Room & Board Units]]+UnitsDetails50[[#This Row],[SUD Non-Billable Units]]","v":0},{"$f":"SUM(F488:F538)","v":0},null,{"$f":"SUM(H488:H538)","v":0},null,{"$f":"SUM(J488:J538)","v":0},null,{"$f":"SUM(L488:L538)","v":0},null,{"$f":"SUM(N488:N538)","v":0},null,{"$f":"SUM(P488:P538)","v":0},null,{"$f":"SUM(R488:R538)","v":0}]
[]
["BEHAVIORAL HEALTH SERVICES"]
["Fical Year-End Units Details"]
[]
[null,"Contractor:",{"$f":"C483","v":0}]
[null,"Contract #:",{"$f":"C484","v":0}]
[null,"Program Name:",{"$f":"'[4]Final Recon - Summary'!C645","v":"Program 10"}]
[]
["Column1","Service Modalities","Unit","Rate","Final TUOS Units Reconciliation","Final Amount Reconciliation","ODS DMC General Units","ODS DMC General Amount","ODS General Units","ODS General Amount","ODS DMC AB109 Units","ODS DMC AB109 Amount","ODS AB109 Units","ODS AB109 Amount","SUD Non-Billable Units","SUD Non-Billable Amount","Room & Board Units","Room & Board Amount",null,"Total Units (Summary)","Total Units (Details)","Checkpoint"]
[{"$f":"$C$5","v":0},{"$f":"'[4]Final Recon - Summary'!B649","v":"Individual - Alcohol and Drug Counselor"},{"$f":"'[4]Final Recon - Summary'!C649","v":"Per Billable Minute"},{"$f":"'[4]Final Recon - Summary'!D649","v":4.4400000000000004},{"$f":"UnitsDetails51[[#This Row],[ODS DMC General Units]]+UnitsDetails51[[#This Row],[ODS General Units]]+UnitsDetails51[[#This Row],[ODS DMC AB109 Units]]+UnitsDetails51[[#This Row],[ODS AB109 Units]]+UnitsDetails51[[#This Row],[Room & Board Units]]+UnitsDetails51[[#This Row],[SUD Non-Billable Units]]","v":0},{"$f":"+D549*E549","v":0},null,{"$f":"+D549*G549","v":0},null,{"$f":"UnitsDetails51[[#This Row],[ODS General Units]]*UnitsDetails51[[#This Row],[Rate]]","v":0},null,{"$f":"UnitsDetails51[[#This Row],[Rate]]*UnitsDetails51[[#This Row],[ODS DMC AB109 Units]]","v":0},null,{"$f":"UnitsDetails51[[#This Row],[Rate]]*UnitsDetails51[[#This Row],[ODS AB109 Units]]","v":0},null,{"$f":"UnitsDetails51[[#This Row],[Rate]]*UnitsDetails51[[#This Row],[SUD Non-Billable Units]]","v":0},null,{"$f":"UnitsDetails51[[#This Row],[Rate]]*UnitsDetails51[[#This Row],[Room & Board Units]]","v":0},null,{"$f":"'[4]Final Recon - Summary'!G649","v":0},{"$f":"UnitsDetails51[[#This Row],[ODS DMC General Units]]+UnitsDetails51[[#This Row],[ODS General Units]]+UnitsDetails51[[#This Row],[ODS DMC AB109 Units]]+UnitsDetails51[[#This Row],[ODS AB109 Units]]+UnitsDetails51[[#This Row],[SUD Non-Billable Units]]+UnitsDetails51[[#This Row],[Room & Board Units]]","v":0},{"$f":"T549-U549","v":0}]
[0,{"$f":"'[4]Final Recon - Summary'!B650","v":"Individual - Clinical Nurse Specialist"},{"$f":"'[4]Final Recon - Summary'!C650","v":"Per Billable Minute"},{"$f":"'[4]Final Recon - Summary'!D650","v":10.23},{"$f":"UnitsDetails51[[#This Row],[ODS DMC General Units]]+UnitsDetails51[[#This Row],[ODS General Units]]+UnitsDetails51[[#This Row],[ODS DMC AB109 Units]]+UnitsDetails51[[#This Row],[ODS AB109 Units]]+UnitsDetails51[[#This Row],[Room & Board Units]]+UnitsDetails51[[#This Row],[SUD Non-Billable Units]]","v":0},0,null,0,null,{"$f":"UnitsDetails51[[#This Row],[ODS General Units]]*UnitsDetails51[[#This Row],[Rate]]","v":0},null,{"$f":"UnitsDetails51[[#This Row],[Rate]]*UnitsDetails51[[#This Row],[ODS DMC AB109 Units]]","v":0},null,{"$f":"UnitsDetails51[[#This Row],[Rate]]*UnitsDetails51[[#This Row],[ODS AB109 Units]]","v":0},null,{"$f":"UnitsDetails51[[#This Row],[Rate]]*UnitsDetails51[[#This Row],[SUD Non-Billable Units]]","v":0},null,{"$f":"UnitsDetails51[[#This Row],[Rate]]*UnitsDetails51[[#This Row],[Room & Board Units]]","v":0},null,{"$f":"'[4]Final Recon - Summary'!G650","v":0},{"$f":"UnitsDetails51[[#This Row],[ODS DMC General Units]]+UnitsDetails51[[#This Row],[ODS General Units]]+UnitsDetails51[[#This Row],[ODS DMC AB109 Units]]+UnitsDetails51[[#This Row],[ODS AB109 Units]]+UnitsDetails51[[#This Row],[SUD Non-Billable Units]]+UnitsDetails51[[#This Row],[Room & Board Units]]","v":0},0]
[0,{"$f":"'[4]Final Recon - Summary'!B651","v":"Individual - Community Health Worker"},{"$f":"'[4]Final Recon - Summary'!C651","v":"Per Billable Minute"},{"$f":"'[4]Final Recon - Summary'!D651","v":4.12},{"$f":"UnitsDetails51[[#This Row],[ODS DMC General Units]]+UnitsDetails51[[#This Row],[ODS General Units]]+UnitsDetails51[[#This Row],[ODS DMC AB109 Units]]+UnitsDetails51[[#This Row],[ODS AB109 Units]]+UnitsDetails51[[#This Row],[Room & Board Units]]+UnitsDetails51[[#This Row],[SUD Non-Billable Units]]","v":0},0,null,0,null,{"$f":"UnitsDetails51[[#This Row],[ODS General Units]]*UnitsDetails51[[#This Row],[Rate]]","v":0},null,{"$f":"UnitsDetails51[[#This Row],[Rate]]*UnitsDetails51[[#This Row],[ODS DMC AB109 Units]]","v":0},null,{"$f":"UnitsDetails51[[#This Row],[Rate]]*UnitsDetails51[[#This Row],[ODS AB109 Units]]","v":0},null,{"$f":"UnitsDetails51[[#This Row],[Rate]]*UnitsDetails51[[#This Row],[SUD Non-Billable Units]]","v":0},null,{"$f":"UnitsDetails51[[#This Row],[Rate]]*UnitsDetails51[[#This Row],[Room & Board Units]]","v":0},null,{"$f":"'[4]Final Recon - Summary'!G651","v":0},{"$f":"UnitsDetails51[[#This Row],[ODS DMC General Units]]+UnitsDetails51[[#This Row],[ODS General Units]]+UnitsDetails51[[#This Row],[ODS DMC AB109 Units]]+UnitsDetails51[[#This Row],[ODS AB109 Units]]+UnitsDetails51[[#This Row],[SUD Non-Billable Units]]+UnitsDetails51[[#This Row],[Room & Board Units]]","v":0},0]
[0,{"$f":"'[4]Final Recon - Summary'!B652","v":"Individual - Licensed Psychiatric Technician"},{"$f":"'[4]Final Recon - Summary'!C652","v":"Per Billable Minute"},{"$f":"'[4]Final Recon - Summary'!D652","v":3.76},{"$f":"UnitsDetails51[[#This Row],[ODS DMC General Units]]+UnitsDetails51[[#This Row],[ODS General Units]]+UnitsDetails51[[#This Row],[ODS DMC AB109 Units]]+UnitsDetails51[[#This Row],[ODS AB109 Units]]+UnitsDetails51[[#This Row],[Room & Board Units]]+UnitsDetails51[[#This Row],[SUD Non-Billable Units]]","v":0},0,null,0,null,{"$f":"UnitsDetails51[[#This Row],[ODS General Units]]*UnitsDetails51[[#This Row],[Rate]]","v":0},null,{"$f":"UnitsDetails51[[#This Row],[Rate]]*UnitsDetails51[[#This Row],[ODS DMC AB109 Units]]","v":0},null,{"$f":"UnitsDetails51[[#This Row],[Rate]]*UnitsDetails51[[#This Row],[ODS AB109 Units]]","v":0},null,{"$f":"UnitsDetails51[[#This Row],[Rate]]*UnitsDetails51[[#This Row],[SUD Non-Billable Units]]","v":0},null,{"$f":"UnitsDetails51[[#This Row],[Rate]]*UnitsDetails51[[#This Row],[Room & Board Units]]","v":0},null,{"$f":"'[4]Final Recon - Summary'!G652","v":0},{"$f":"UnitsDetails51[[#This Row],[ODS DMC General Units]]+UnitsDetails51[[#This Row],[ODS General Units]]+UnitsDetails51[[#This Row],[ODS DMC AB109 Units]]+UnitsDetails51[[#This Row],[ODS AB109 Units]]+UnitsDetails51[[#This Row],[SUD Non-Billable Units]]+UnitsDetails51[[#This Row],[Room & Board Units]]","v":0},0]
[0,{"$f":"'[4]Final Recon - Summary'!B653","v":"Individual - LPHA (MFT  LCSW  LPCC)/Intern or Waivered LPHA (MFT  LCSW  LPCC)"},{"$f":"'[4]Final Recon - Summary'!C653","v":"Per Billable Minute"},{"$f":"'[4]Final Recon - Summary'!D653","v":5.35},{"$f":"UnitsDetails51[[#This Row],[ODS DMC General Units]]+UnitsDetails51[[#This Row],[ODS General Units]]+UnitsDetails51[[#This Row],[ODS DMC AB109 Units]]+UnitsDetails51[[#This Row],[ODS AB109 Units]]+UnitsDetails51[[#This Row],[Room & Board Units]]+UnitsDetails51[[#This Row],[SUD Non-Billable Units]]","v":0},0,null,0,null,{"$f":"UnitsDetails51[[#This Row],[ODS General Units]]*UnitsDetails51[[#This Row],[Rate]]","v":0},null,{"$f":"UnitsDetails51[[#This Row],[Rate]]*UnitsDetails51[[#This Row],[ODS DMC AB109 Units]]","v":0},null,{"$f":"UnitsDetails51[[#This Row],[Rate]]*UnitsDetails51[[#This Row],[ODS AB109 Units]]","v":0},null,{"$f":"UnitsDetails51[[#This Row],[Rate]]*UnitsDetails51[[#This Row],[SUD Non-Billable Units]]","v":0},null,{"$f":"UnitsDetails51[[#This Row],[Rate]]*UnitsDetails51[[#This Row],[Room & Board Units]]","v":0},null,{"$f":"'[4]Final Recon - Summary'!G653","v":0},{"$f":"UnitsDetails51[[#This Row],[ODS DMC General Units]]+UnitsDetails51[[#This Row],[ODS General Units]]+UnitsDetails51[[#This Row],[ODS DMC AB109 Units]]+UnitsDetails51[[#This Row],[ODS AB109 Units]]+UnitsDetails51[[#This Row],[SUD Non-Billable Units]]+UnitsDetails51[[#This Row],[Room & Board Units]]","v":0},0]
[0,{"$f":"'[4]Final Recon - Summary'!B654","v":"Individual - Licensed Vocational Nurse (LVN)"},{"$f":"'[4]Final Recon - Summary'!C654","v":"Per Billable Minute"},{"$f":"'[4]Final Recon - Summary'!D654","v":4.3800000000000008},{"$f":"UnitsDetails51[[#This Row],[ODS DMC General Units]]+UnitsDetails51[[#This Row],[ODS General Units]]+UnitsDetails51[[#This Row],[ODS DMC AB109 Units]]+UnitsDetails51[[#This Row],[ODS AB109 Units]]+UnitsDetails51[[#This Row],[Room & Board Units]]+UnitsDetails51[[#This Row],[SUD Non-Billable Units]]","v":0},0,null,0,null,{"$f":"UnitsDetails51[[#This Row],[ODS General Units]]*UnitsDetails51[[#This Row],[Rate]]","v":0},null,{"$f":"UnitsDetails51[[#This Row],[Rate]]*UnitsDetails51[[#This Row],[ODS DMC AB109 Units]]","v":0},null,{"$f":"UnitsDetails51[[#This Row],[Rate]]*UnitsDetails51[[#This Row],[ODS AB109 Units]]","v":0},null,{"$f":"UnitsDetails51[[#This Row],[Rate]]*UnitsDetails51[[#This Row],[SUD Non-Billable Units]]","v":0},null,{"$f":"UnitsDetails51[[#This Row],[Rate]]*UnitsDetails51[[#This Row],[Room & Board Units]]","v":0},null,{"$f":"'[4]Final Recon - Summary'!G654","v":0},{"$f":"UnitsDetails51[[#This Row],[ODS DMC General Units]]+UnitsDetails51[[#This Row],[ODS General Units]]+UnitsDetails51[[#This Row],[ODS DMC AB109 Units]]+UnitsDetails51[[#This Row],[ODS AB109 Units]]+UnitsDetails51[[#This Row],[SUD Non-Billable Units]]+UnitsDetails51[[#This Row],[Room & Board Units]]","v":0},0]
[0,{"$f":"'[4]Final Recon - Summary'!B655","v":"Individual - Medical Assistant"},{"$f":"'[4]Final Recon - Summary'!C655","v":"Per Billable Minute"},{"$f":"'[4]Final Recon - Summary'!D655","v":3.02},{"$f":"UnitsDetails51[[#This Row],[ODS DMC General Units]]+UnitsDetails51[[#This Row],[ODS General Units]]+UnitsDetails51[[#This Row],[ODS DMC AB109 Units]]+UnitsDetails51[[#This Row],[ODS AB109 Units]]+UnitsDetails51[[#This Row],[Room & Board Units]]+UnitsDetails51[[#This Row],[SUD Non-Billable Units]]","v":0},0,null,0,null,{"$f":"UnitsDetails51[[#This Row],[ODS General Units]]*UnitsDetails51[[#This Row],[Rate]]","v":0},null,{"$f":"UnitsDetails51[[#This Row],[Rate]]*UnitsDetails51[[#This Row],[ODS DMC AB109 Units]]","v":0},null,{"$f":"UnitsDetails51[[#This Row],[Rate]]*UnitsDetails51[[#This Row],[ODS AB109 Units]]","v":0},null,{"$f":"UnitsDetails51[[#This Row],[Rate]]*UnitsDetails51[[#This Row],[SUD Non-Billable Units]]","v":0},null,{"$f":"UnitsDetails51[[#This Row],[Rate]]*UnitsDetails51[[#This Row],[Room & Board Units]]","v":0},null,{"$f":"'[4]Final Recon - Summary'!G655","v":0},{"$f":"UnitsDetails51[[#This Row],[ODS DMC General Units]]+UnitsDetails51[[#This Row],[ODS General Units]]+UnitsDetails51[[#This Row],[ODS DMC AB109 Units]]+UnitsDetails51[[#This Row],[ODS AB109 Units]]+UnitsDetails51[[#This Row],[SUD Non-Billable Units]]+UnitsDetails51[[#This Row],[Room & Board Units]]","v":0},0]
[0,{"$f":"'[4]Final Recon - Summary'!B656","v":"Individual - Mental Health Rehabilitation Specialist"},{"$f":"'[4]Final Recon - Summary'!C656","v":"Per Billable Minute"},{"$f":"'[4]Final Recon - Summary'!D656","v":4.0199999999999996},{"$f":"UnitsDetails51[[#This Row],[ODS DMC General Units]]+UnitsDetails51[[#This Row],[ODS General Units]]+UnitsDetails51[[#This Row],[ODS DMC AB109 Units]]+UnitsDetails51[[#This Row],[ODS AB109 Units]]+UnitsDetails51[[#This Row],[Room & Board Units]]+UnitsDetails51[[#This Row],[SUD Non-Billable Units]]","v":0},0,null,0,null,{"$f":"UnitsDetails51[[#This Row],[ODS General Units]]*UnitsDetails51[[#This Row],[Rate]]","v":0},null,{"$f":"UnitsDetails51[[#This Row],[Rate]]*UnitsDetails51[[#This Row],[ODS DMC AB109 Units]]","v":0},null,{"$f":"UnitsDetails51[[#This Row],[Rate]]*UnitsDetails51[[#This Row],[ODS AB109 Units]]","v":0},null,{"$f":"UnitsDetails51[[#This Row],[Rate]]*UnitsDetails51[[#This Row],[SUD Non-Billable Units]]","v":0},null,{"$f":"UnitsDetails51[[#This Row],[Rate]]*UnitsDetails51[[#This Row],[Room & Board Units]]","v":0},null,{"$f":"'[4]Final Recon - Summary'!G656","v":0},{"$f":"UnitsDetails51[[#This Row],[ODS DMC General Units]]+UnitsDetails51[[#This Row],[ODS General Units]]+UnitsDetails51[[#This Row],[ODS DMC AB109 Units]]+UnitsDetails51[[#This Row],[ODS AB109 Units]]+UnitsDetails51[[#This Row],[SUD Non-Billable Units]]+UnitsDetails51[[#This Row],[Room & Board Units]]","v":0},0]
[0,{"$f":"'[4]Final Recon - Summary'!B657","v":"Individual - Nurse Practitioner"},{"$f":"'[4]Final Recon - Summary'!C657","v":"Per Billable Minute"},{"$f":"'[4]Final Recon - Summary'!D657","v":10.23},{"$f":"UnitsDetails51[[#This Row],[ODS DMC General Units]]+UnitsDetails51[[#This Row],[ODS General Units]]+UnitsDetails51[[#This Row],[ODS DMC AB109 Units]]+UnitsDetails51[[#This Row],[ODS AB109 Units]]+UnitsDetails51[[#This Row],[Room & Board Units]]+UnitsDetails51[[#This Row],[SUD Non-Billable Units]]","v":0},0,null,0,null,{"$f":"UnitsDetails51[[#This Row],[ODS General Units]]*UnitsDetails51[[#This Row],[Rate]]","v":0},null,{"$f":"UnitsDetails51[[#This Row],[Rate]]*UnitsDetails51[[#This Row],[ODS DMC AB109 Units]]","v":0},null,{"$f":"UnitsDetails51[[#This Row],[Rate]]*UnitsDetails51[[#This Row],[ODS AB109 Units]]","v":0},null,{"$f":"UnitsDetails51[[#This Row],[Rate]]*UnitsDetails51[[#This Row],[SUD Non-Billable Units]]","v":0},null,{"$f":"UnitsDetails51[[#This Row],[Rate]]*UnitsDetails51[[#This Row],[Room & Board Units]]","v":0},null,{"$f":"'[4]Final Recon - Summary'!G657","v":0},{"$f":"UnitsDetails51[[#This Row],[ODS DMC General Units]]+UnitsDetails51[[#This Row],[ODS General Units]]+UnitsDetails51[[#This Row],[ODS DMC AB109 Units]]+UnitsDetails51[[#This Row],[ODS AB109 Units]]+UnitsDetails51[[#This Row],[SUD Non-Billable Units]]+UnitsDetails51[[#This Row],[Room & Board Units]]","v":0},0]
[0,{"$f":"'[4]Final Recon - Summary'!B658","v":"Individual - Occupational Therapist"},{"$f":"'[4]Final Recon - Summary'!C658","v":"Per Billable Minute"},{"$f":"'[4]Final Recon - Summary'!D658","v":7.13},{"$f":"UnitsDetails51[[#This Row],[ODS DMC General Units]]+UnitsDetails51[[#This Row],[ODS General Units]]+UnitsDetails51[[#This Row],[ODS DMC AB109 Units]]+UnitsDetails51[[#This Row],[ODS AB109 Units]]+UnitsDetails51[[#This Row],[Room & Board Units]]+UnitsDetails51[[#This Row],[SUD Non-Billable Units]]","v":0},0,null,0,null,{"$f":"UnitsDetails51[[#This Row],[ODS General Units]]*UnitsDetails51[[#This Row],[Rate]]","v":0},null,{"$f":"UnitsDetails51[[#This Row],[Rate]]*UnitsDetails51[[#This Row],[ODS DMC AB109 Units]]","v":0},null,{"$f":"UnitsDetails51[[#This Row],[Rate]]*UnitsDetails51[[#This Row],[ODS AB109 Units]]","v":0},null,{"$f":"UnitsDetails51[[#This Row],[Rate]]*UnitsDetails51[[#This Row],[SUD Non-Billable Units]]","v":0},null,{"$f":"UnitsDetails51[[#This Row],[Rate]]*UnitsDetails51[[#This Row],[Room & Board Units]]","v":0},null,{"$f":"'[4]Final Recon - Summary'!G658","v":0},{"$f":"UnitsDetails51[[#This Row],[ODS DMC General Units]]+UnitsDetails51[[#This Row],[ODS General Units]]+UnitsDetails51[[#This Row],[ODS DMC AB109 Units]]+UnitsDetails51[[#This Row],[ODS AB109 Units]]+UnitsDetails51[[#This Row],[SUD Non-Billable Units]]+UnitsDetails51[[#This Row],[Room & Board Units]]","v":0},0]
[0,{"$f":"'[4]Final Recon - Summary'!B659","v":"Individual - Other Qualified Providers - Other Designated MH staff that bill medical"},{"$f":"'[4]Final Recon - Summary'!C659","v":"Per Billable Minute"},{"$f":"'[4]Final Recon - Summary'!D659","v":4.0199999999999996},{"$f":"UnitsDetails51[[#This Row],[ODS DMC General Units]]+UnitsDetails51[[#This Row],[ODS General Units]]+UnitsDetails51[[#This Row],[ODS DMC AB109 Units]]+UnitsDetails51[[#This Row],[ODS AB109 Units]]+UnitsDetails51[[#This Row],[Room & Board Units]]+UnitsDetails51[[#This Row],[SUD Non-Billable Units]]","v":0},0,null,0,null,{"$f":"UnitsDetails51[[#This Row],[ODS General Units]]*UnitsDetails51[[#This Row],[Rate]]","v":0},null,{"$f":"UnitsDetails51[[#This Row],[Rate]]*UnitsDetails51[[#This Row],[ODS DMC AB109 Units]]","v":0},null,{"$f":"UnitsDetails51[[#This Row],[Rate]]*UnitsDetails51[[#This Row],[ODS AB109 Units]]","v":0},null,{"$f":"UnitsDetails51[[#This Row],[Rate]]*UnitsDetails51[[#This Row],[SUD Non-Billable Units]]","v":0},null,{"$f":"UnitsDetails51[[#This Row],[Rate]]*UnitsDetails51[[#This Row],[Room & Board Units]]","v":0},null,{"$f":"'[4]Final Recon - Summary'!G659","v":0},{"$f":"UnitsDetails51[[#This Row],[ODS DMC General Units]]+UnitsDetails51[[#This Row],[ODS General Units]]+UnitsDetails51[[#This Row],[ODS DMC AB109 Units]]+UnitsDetails51[[#This Row],[ODS AB109 Units]]+UnitsDetails51[[#This Row],[SUD Non-Billable Units]]+UnitsDetails51[[#This Row],[Room & Board Units]]","v":0},0]
[0,{"$f":"'[4]Final Recon - Summary'!B660","v":"Individual - Peer Support Specialist"},{"$f":"'[4]Final Recon - Summary'!C660","v":"Per Billable Minute"},{"$f":"'[4]Final Recon - Summary'!D660","v":4.22},{"$f":"UnitsDetails51[[#This Row],[ODS DMC General Units]]+UnitsDetails51[[#This Row],[ODS General Units]]+UnitsDetails51[[#This Row],[ODS DMC AB109 Units]]+UnitsDetails51[[#This Row],[ODS AB109 Units]]+UnitsDetails51[[#This Row],[Room & Board Units]]+UnitsDetails51[[#This Row],[SUD Non-Billable Units]]","v":0},0,null,0,null,{"$f":"UnitsDetails51[[#This Row],[ODS General Units]]*UnitsDetails51[[#This Row],[Rate]]","v":0},null,{"$f":"UnitsDetails51[[#This Row],[Rate]]*UnitsDetails51[[#This Row],[ODS DMC AB109 Units]]","v":0},null,{"$f":"UnitsDetails51[[#This Row],[Rate]]*UnitsDetails51[[#This Row],[ODS AB109 Units]]","v":0},null,{"$f":"UnitsDetails51[[#This Row],[Rate]]*UnitsDetails51[[#This Row],[SUD Non-Billable Units]]","v":0},null,{"$f":"UnitsDetails51[[#This Row],[Rate]]*UnitsDetails51[[#This Row],[Room & Board Units]]","v":0},null,{"$f":"'[4]Final Recon - Summary'!G660","v":0},{"$f":"UnitsDetails51[[#This Row],[ODS DMC General Units]]+UnitsDetails51[[#This Row],[ODS General Units]]+UnitsDetails51[[#This Row],[ODS DMC AB109 Units]]+UnitsDetails51[[#This Row],[ODS AB109 Units]]+UnitsDetails51[[#This Row],[SUD Non-Billable Units]]+UnitsDetails51[[#This Row],[Room & Board Units]]","v":0},0]
[0,{"$f":"'[4]Final Recon - Summary'!B661","v":"Individual - Physician Assistant"},{"$f":"'[4]Final Recon - Summary'!C661","v":"Per Billable Minute"},{"$f":"'[4]Final Recon - Summary'!D661","v":9.23},{"$f":"UnitsDetails51[[#This Row],[ODS DMC General Units]]+UnitsDetails51[[#This Row],[ODS General Units]]+UnitsDetails51[[#This Row],[ODS DMC AB109 Units]]+UnitsDetails51[[#This Row],[ODS AB109 Units]]+UnitsDetails51[[#This Row],[Room & Board Units]]+UnitsDetails51[[#This Row],[SUD Non-Billable Units]]","v":0},0,null,0,null,{"$f":"UnitsDetails51[[#This Row],[ODS General Units]]*UnitsDetails51[[#This Row],[Rate]]","v":0},null,{"$f":"UnitsDetails51[[#This Row],[Rate]]*UnitsDetails51[[#This Row],[ODS DMC AB109 Units]]","v":0},null,{"$f":"UnitsDetails51[[#This Row],[Rate]]*UnitsDetails51[[#This Row],[ODS AB109 Units]]","v":0},null,{"$f":"UnitsDetails51[[#This Row],[Rate]]*UnitsDetails51[[#This Row],[SUD Non-Billable Units]]","v":0},null,{"$f":"UnitsDetails51[[#This Row],[Rate]]*UnitsDetails51[[#This Row],[Room & Board Units]]","v":0},null,{"$f":"'[4]Final Recon - Summary'!G661","v":0},{"$f":"UnitsDetails51[[#This Row],[ODS DMC General Units]]+UnitsDetails51[[#This Row],[ODS General Units]]+UnitsDetails51[[#This Row],[ODS DMC AB109 Units]]+UnitsDetails51[[#This Row],[ODS AB109 Units]]+UnitsDetails51[[#This Row],[SUD Non-Billable Units]]+UnitsDetails51[[#This Row],[Room & Board Units]]","v":0},0]
[0,{"$f":"'[4]Final Recon - Summary'!B662","v":"Individual - Psychologist/Pre-licensed Psychologist"},{"$f":"'[4]Final Recon - Summary'!C662","v":"Per Billable Minute"},{"$f":"'[4]Final Recon - Summary'!D662","v":8.2799999999999994},{"$f":"UnitsDetails51[[#This Row],[ODS DMC General Units]]+UnitsDetails51[[#This Row],[ODS General Units]]+UnitsDetails51[[#This Row],[ODS DMC AB109 Units]]+UnitsDetails51[[#This Row],[ODS AB109 Units]]+UnitsDetails51[[#This Row],[Room & Board Units]]+UnitsDetails51[[#This Row],[SUD Non-Billable Units]]","v":0},0,null,0,null,{"$f":"UnitsDetails51[[#This Row],[ODS General Units]]*UnitsDetails51[[#This Row],[Rate]]","v":0},null,{"$f":"UnitsDetails51[[#This Row],[Rate]]*UnitsDetails51[[#This Row],[ODS DMC AB109 Units]]","v":0},null,{"$f":"UnitsDetails51[[#This Row],[Rate]]*UnitsDetails51[[#This Row],[ODS AB109 Units]]","v":0},null,{"$f":"UnitsDetails51[[#This Row],[Rate]]*UnitsDetails51[[#This Row],[SUD Non-Billable Units]]","v":0},null,{"$f":"UnitsDetails51[[#This Row],[Rate]]*UnitsDetails51[[#This Row],[Room & Board Units]]","v":0},null,{"$f":"'[4]Final Recon - Summary'!G662","v":0},{"$f":"UnitsDetails51[[#This Row],[ODS DMC General Units]]+UnitsDetails51[[#This Row],[ODS General Units]]+UnitsDetails51[[#This Row],[ODS DMC AB109 Units]]+UnitsDetails51[[#This Row],[ODS AB109 Units]]+UnitsDetails51[[#This Row],[SUD Non-Billable Units]]+UnitsDetails51[[#This Row],[Room & Board Units]]","v":0},0]
[0,{"$f":"'[4]Final Recon - Summary'!B663","v":"Individual - Psychiatrist/ Contracted Psychiatrist/Licensed Physician (MD)"},{"$f":"'[4]Final Recon - Summary'!C663","v":"Per Billable Minute"},{"$f":"'[4]Final Recon - Summary'!D663","v":11.57},{"$f":"UnitsDetails51[[#This Row],[ODS DMC General Units]]+UnitsDetails51[[#This Row],[ODS General Units]]+UnitsDetails51[[#This Row],[ODS DMC AB109 Units]]+UnitsDetails51[[#This Row],[ODS AB109 Units]]+UnitsDetails51[[#This Row],[Room & Board Units]]+UnitsDetails51[[#This Row],[SUD Non-Billable Units]]","v":0},0,null,0,null,{"$f":"UnitsDetails51[[#This Row],[ODS General Units]]*UnitsDetails51[[#This Row],[Rate]]","v":0},null,{"$f":"UnitsDetails51[[#This Row],[Rate]]*UnitsDetails51[[#This Row],[ODS DMC AB109 Units]]","v":0},null,{"$f":"UnitsDetails51[[#This Row],[Rate]]*UnitsDetails51[[#This Row],[ODS AB109 Units]]","v":0},null,{"$f":"UnitsDetails51[[#This Row],[Rate]]*UnitsDetails51[[#This Row],[SUD Non-Billable Units]]","v":0},null,{"$f":"UnitsDetails51[[#This Row],[Rate]]*UnitsDetails51[[#This Row],[Room & Board Units]]","v":0},null,{"$f":"'[4]Final Recon - Summary'!G663","v":0},{"$f":"UnitsDetails51[[#This Row],[ODS DMC General Units]]+UnitsDetails51[[#This Row],[ODS General Units]]+UnitsDetails51[[#This Row],[ODS DMC AB109 Units]]+UnitsDetails51[[#This Row],[ODS AB109 Units]]+UnitsDetails51[[#This Row],[SUD Non-Billable Units]]+UnitsDetails51[[#This Row],[Room & Board Units]]","v":0},0]
[0,{"$f":"'[4]Final Recon - Summary'!B664","v":"Individual - Registered Nurse (RN)"},{"$f":"'[4]Final Recon - Summary'!C664","v":"Per Billable Minute"},{"$f":"'[4]Final Recon - Summary'!D664","v":8.36},{"$f":"UnitsDetails51[[#This Row],[ODS DMC General Units]]+UnitsDetails51[[#This Row],[ODS General Units]]+UnitsDetails51[[#This Row],[ODS DMC AB109 Units]]+UnitsDetails51[[#This Row],[ODS AB109 Units]]+UnitsDetails51[[#This Row],[Room & Board Units]]+UnitsDetails51[[#This Row],[SUD Non-Billable Units]]","v":0},0,null,0,null,{"$f":"UnitsDetails51[[#This Row],[ODS General Units]]*UnitsDetails51[[#This Row],[Rate]]","v":0},null,{"$f":"UnitsDetails51[[#This Row],[Rate]]*UnitsDetails51[[#This Row],[ODS DMC AB109 Units]]","v":0},null,{"$f":"UnitsDetails51[[#This Row],[Rate]]*UnitsDetails51[[#This Row],[ODS AB109 Units]]","v":0},null,{"$f":"UnitsDetails51[[#This Row],[Rate]]*UnitsDetails51[[#This Row],[SUD Non-Billable Units]]","v":0},null,{"$f":"UnitsDetails51[[#This Row],[Rate]]*UnitsDetails51[[#This Row],[Room & Board Units]]","v":0},null,{"$f":"'[4]Final Recon - Summary'!G664","v":0},{"$f":"UnitsDetails51[[#This Row],[ODS DMC General Units]]+UnitsDetails51[[#This Row],[ODS General Units]]+UnitsDetails51[[#This Row],[ODS DMC AB109 Units]]+UnitsDetails51[[#This Row],[ODS AB109 Units]]+UnitsDetails51[[#This Row],[SUD Non-Billable Units]]+UnitsDetails51[[#This Row],[Room & Board Units]]","v":0},0]
[0,{"$f":"'[4]Final Recon - Summary'!B665","v":"Individual - Registered Pharmacist"},{"$f":"'[4]Final Recon - Summary'!C665","v":"Per Billable Minute"},{"$f":"'[4]Final Recon - Summary'!D665","v":9.84},{"$f":"UnitsDetails51[[#This Row],[ODS DMC General Units]]+UnitsDetails51[[#This Row],[ODS General Units]]+UnitsDetails51[[#This Row],[ODS DMC AB109 Units]]+UnitsDetails51[[#This Row],[ODS AB109 Units]]+UnitsDetails51[[#This Row],[Room & Board Units]]+UnitsDetails51[[#This Row],[SUD Non-Billable Units]]","v":0},0,null,0,null,{"$f":"UnitsDetails51[[#This Row],[ODS General Units]]*UnitsDetails51[[#This Row],[Rate]]","v":0},null,{"$f":"UnitsDetails51[[#This Row],[Rate]]*UnitsDetails51[[#This Row],[ODS DMC AB109 Units]]","v":0},null,{"$f":"UnitsDetails51[[#This Row],[Rate]]*UnitsDetails51[[#This Row],[ODS AB109 Units]]","v":0},null,{"$f":"UnitsDetails51[[#This Row],[Rate]]*UnitsDetails51[[#This Row],[SUD Non-Billable Units]]","v":0},null,{"$f":"UnitsDetails51[[#This Row],[Rate]]*UnitsDetails51[[#This Row],[Room & Board Units]]","v":0},null,{"$f":"'[4]Final Recon - Summary'!G665","v":0},{"$f":"UnitsDetails51[[#This Row],[ODS DMC General Units]]+UnitsDetails51[[#This Row],[ODS General Units]]+UnitsDetails51[[#This Row],[ODS DMC AB109 Units]]+UnitsDetails51[[#This Row],[ODS AB109 Units]]+UnitsDetails51[[#This Row],[SUD Non-Billable Units]]+UnitsDetails51[[#This Row],[Room & Board Units]]","v":0},0]
[0,{"$f":"'[4]Final Recon - Summary'!B666","v":"Individual - Interpreter Services"},{"$f":"'[4]Final Recon - Summary'!C666","v":"Per Billable Minute"},{"$f":"'[4]Final Recon - Summary'!D666","v":2.19},{"$f":"UnitsDetails51[[#This Row],[ODS DMC General Units]]+UnitsDetails51[[#This Row],[ODS General Units]]+UnitsDetails51[[#This Row],[ODS DMC AB109 Units]]+UnitsDetails51[[#This Row],[ODS AB109 Units]]+UnitsDetails51[[#This Row],[Room & Board Units]]+UnitsDetails51[[#This Row],[SUD Non-Billable Units]]","v":0},0,null,0,null,{"$f":"UnitsDetails51[[#This Row],[ODS General Units]]*UnitsDetails51[[#This Row],[Rate]]","v":0},null,{"$f":"UnitsDetails51[[#This Row],[Rate]]*UnitsDetails51[[#This Row],[ODS DMC AB109 Units]]","v":0},null,{"$f":"UnitsDetails51[[#This Row],[Rate]]*UnitsDetails51[[#This Row],[ODS AB109 Units]]","v":0},null,{"$f":"UnitsDetails51[[#This Row],[Rate]]*UnitsDetails51[[#This Row],[SUD Non-Billable Units]]","v":0},null,{"$f":"UnitsDetails51[[#This Row],[Rate]]*UnitsDetails51[[#This Row],[Room & Board Units]]","v":0},null,{"$f":"'[4]Final Recon - Summary'!G666","v":0},{"$f":"UnitsDetails51[[#This Row],[ODS DMC General Units]]+UnitsDetails51[[#This Row],[ODS General Units]]+UnitsDetails51[[#This Row],[ODS DMC AB109 Units]]+UnitsDetails51[[#This Row],[ODS AB109 Units]]+UnitsDetails51[[#This Row],[SUD Non-Billable Units]]+UnitsDetails51[[#This Row],[Room & Board Units]]","v":0},0]
[0,{"$f":"'[4]Final Recon - Summary'!B667","v":"Interactive Complexity"},{"$f":"'[4]Final Recon - Summary'!C667","v":"Per Occurrence"},{"$f":"'[4]Final Recon - Summary'!D667","v":14.61},{"$f":"UnitsDetails51[[#This Row],[ODS DMC General Units]]+UnitsDetails51[[#This Row],[ODS General Units]]+UnitsDetails51[[#This Row],[ODS DMC AB109 Units]]+UnitsDetails51[[#This Row],[ODS AB109 Units]]+UnitsDetails51[[#This Row],[Room & Board Units]]+UnitsDetails51[[#This Row],[SUD Non-Billable Units]]","v":0},0,null,0,null,{"$f":"UnitsDetails51[[#This Row],[ODS General Units]]*UnitsDetails51[[#This Row],[Rate]]","v":0},null,{"$f":"UnitsDetails51[[#This Row],[Rate]]*UnitsDetails51[[#This Row],[ODS DMC AB109 Units]]","v":0},null,{"$f":"UnitsDetails51[[#This Row],[Rate]]*UnitsDetails51[[#This Row],[ODS AB109 Units]]","v":0},null,{"$f":"UnitsDetails51[[#This Row],[Rate]]*UnitsDetails51[[#This Row],[SUD Non-Billable Units]]","v":0},null,{"$f":"UnitsDetails51[[#This Row],[Rate]]*UnitsDetails51[[#This Row],[Room & Board Units]]","v":0},null,{"$f":"'[4]Final Recon - Summary'!G667","v":0},{"$f":"UnitsDetails51[[#This Row],[ODS DMC General Units]]+UnitsDetails51[[#This Row],[ODS General Units]]+UnitsDetails51[[#This Row],[ODS DMC AB109 Units]]+UnitsDetails51[[#This Row],[ODS AB109 Units]]+UnitsDetails51[[#This Row],[SUD Non-Billable Units]]+UnitsDetails51[[#This Row],[Room & Board Units]]","v":0},0]
[0,{"$f":"'[4]Final Recon - Summary'!B668","v":"Parent-Child Interaction Therapy (PCIT Modifier 22)"},{"$f":"'[4]Final Recon - Summary'!C668","v":"Per Occurrence"},{"$f":"'[4]Final Recon - Summary'!D668","v":2.56},{"$f":"UnitsDetails51[[#This Row],[ODS DMC General Units]]+UnitsDetails51[[#This Row],[ODS General Units]]+UnitsDetails51[[#This Row],[ODS DMC AB109 Units]]+UnitsDetails51[[#This Row],[ODS AB109 Units]]+UnitsDetails51[[#This Row],[Room & Board Units]]+UnitsDetails51[[#This Row],[SUD Non-Billable Units]]","v":0},0,null,0,null,{"$f":"UnitsDetails51[[#This Row],[ODS General Units]]*UnitsDetails51[[#This Row],[Rate]]","v":0},null,{"$f":"UnitsDetails51[[#This Row],[Rate]]*UnitsDetails51[[#This Row],[ODS DMC AB109 Units]]","v":0},null,{"$f":"UnitsDetails51[[#This Row],[Rate]]*UnitsDetails51[[#This Row],[ODS AB109 Units]]","v":0},null,{"$f":"UnitsDetails51[[#This Row],[Rate]]*UnitsDetails51[[#This Row],[SUD Non-Billable Units]]","v":0},null,{"$f":"UnitsDetails51[[#This Row],[Rate]]*UnitsDetails51[[#This Row],[Room & Board Units]]","v":0},null,{"$f":"'[4]Final Recon - Summary'!G668","v":0},{"$f":"UnitsDetails51[[#This Row],[ODS DMC General Units]]+UnitsDetails51[[#This Row],[ODS General Units]]+UnitsDetails51[[#This Row],[ODS DMC AB109 Units]]+UnitsDetails51[[#This Row],[ODS AB109 Units]]+UnitsDetails51[[#This Row],[SUD Non-Billable Units]]+UnitsDetails51[[#This Row],[Room & Board Units]]","v":0},0]
[0,{"$f":"'[4]Final Recon - Summary'!B669","v":"Group - Alcohol and Drug Counselor"},{"$f":"'[4]Final Recon - Summary'!C669","v":"Per Billable Minute"},{"$f":"'[4]Final Recon - Summary'!D669","v":0.98},{"$f":"UnitsDetails51[[#This Row],[ODS DMC General Units]]+UnitsDetails51[[#This Row],[ODS General Units]]+UnitsDetails51[[#This Row],[ODS DMC AB109 Units]]+UnitsDetails51[[#This Row],[ODS AB109 Units]]+UnitsDetails51[[#This Row],[Room & Board Units]]+UnitsDetails51[[#This Row],[SUD Non-Billable Units]]","v":0},0,null,0,null,{"$f":"UnitsDetails51[[#This Row],[ODS General Units]]*UnitsDetails51[[#This Row],[Rate]]","v":0},null,{"$f":"UnitsDetails51[[#This Row],[Rate]]*UnitsDetails51[[#This Row],[ODS DMC AB109 Units]]","v":0},null,{"$f":"UnitsDetails51[[#This Row],[Rate]]*UnitsDetails51[[#This Row],[ODS AB109 Units]]","v":0},null,{"$f":"UnitsDetails51[[#This Row],[Rate]]*UnitsDetails51[[#This Row],[SUD Non-Billable Units]]","v":0},null,{"$f":"UnitsDetails51[[#This Row],[Rate]]*UnitsDetails51[[#This Row],[Room & Board Units]]","v":0},null,{"$f":"'[4]Final Recon - Summary'!G669","v":0},{"$f":"UnitsDetails51[[#This Row],[ODS DMC General Units]]+UnitsDetails51[[#This Row],[ODS General Units]]+UnitsDetails51[[#This Row],[ODS DMC AB109 Units]]+UnitsDetails51[[#This Row],[ODS AB109 Units]]+UnitsDetails51[[#This Row],[SUD Non-Billable Units]]+UnitsDetails51[[#This Row],[Room & Board Units]]","v":0},0]
[0,{"$f":"'[4]Final Recon - Summary'!B670","v":"Group - Clinical Nurse Specialist"},{"$f":"'[4]Final Recon - Summary'!C670","v":"Per Billable Minute"},{"$f":"'[4]Final Recon - Summary'!D670","v":2.2799999999999998},{"$f":"UnitsDetails51[[#This Row],[ODS DMC General Units]]+UnitsDetails51[[#This Row],[ODS General Units]]+UnitsDetails51[[#This Row],[ODS DMC AB109 Units]]+UnitsDetails51[[#This Row],[ODS AB109 Units]]+UnitsDetails51[[#This Row],[Room & Board Units]]+UnitsDetails51[[#This Row],[SUD Non-Billable Units]]","v":0},0,null,0,null,{"$f":"UnitsDetails51[[#This Row],[ODS General Units]]*UnitsDetails51[[#This Row],[Rate]]","v":0},null,{"$f":"UnitsDetails51[[#This Row],[Rate]]*UnitsDetails51[[#This Row],[ODS DMC AB109 Units]]","v":0},null,{"$f":"UnitsDetails51[[#This Row],[Rate]]*UnitsDetails51[[#This Row],[ODS AB109 Units]]","v":0},null,{"$f":"UnitsDetails51[[#This Row],[Rate]]*UnitsDetails51[[#This Row],[SUD Non-Billable Units]]","v":0},null,{"$f":"UnitsDetails51[[#This Row],[Rate]]*UnitsDetails51[[#This Row],[Room & Board Units]]","v":0},null,{"$f":"'[4]Final Recon - Summary'!G670","v":0},{"$f":"UnitsDetails51[[#This Row],[ODS DMC General Units]]+UnitsDetails51[[#This Row],[ODS General Units]]+UnitsDetails51[[#This Row],[ODS DMC AB109 Units]]+UnitsDetails51[[#This Row],[ODS AB109 Units]]+UnitsDetails51[[#This Row],[SUD Non-Billable Units]]+UnitsDetails51[[#This Row],[Room & Board Units]]","v":0},0]
[0,{"$f":"'[4]Final Recon - Summary'!B671","v":"Group - Community Health Worker (CPT 98961)"},{"$f":"'[4]Final Recon - Summary'!C671","v":"Per Billable Minute"},{"$f":"'[4]Final Recon - Summary'!D671","v":1.3800000000000001},{"$f":"UnitsDetails51[[#This Row],[ODS DMC General Units]]+UnitsDetails51[[#This Row],[ODS General Units]]+UnitsDetails51[[#This Row],[ODS DMC AB109 Units]]+UnitsDetails51[[#This Row],[ODS AB109 Units]]+UnitsDetails51[[#This Row],[Room & Board Units]]+UnitsDetails51[[#This Row],[SUD Non-Billable Units]]","v":0},0,null,0,null,{"$f":"UnitsDetails51[[#This Row],[ODS General Units]]*UnitsDetails51[[#This Row],[Rate]]","v":0},null,{"$f":"UnitsDetails51[[#This Row],[Rate]]*UnitsDetails51[[#This Row],[ODS DMC AB109 Units]]","v":0},null,{"$f":"UnitsDetails51[[#This Row],[Rate]]*UnitsDetails51[[#This Row],[ODS AB109 Units]]","v":0},null,{"$f":"UnitsDetails51[[#This Row],[Rate]]*UnitsDetails51[[#This Row],[SUD Non-Billable Units]]","v":0},null,{"$f":"UnitsDetails51[[#This Row],[Rate]]*UnitsDetails51[[#This Row],[Room & Board Units]]","v":0},null,{"$f":"'[4]Final Recon - Summary'!G671","v":0},{"$f":"UnitsDetails51[[#This Row],[ODS DMC General Units]]+UnitsDetails51[[#This Row],[ODS General Units]]+UnitsDetails51[[#This Row],[ODS DMC AB109 Units]]+UnitsDetails51[[#This Row],[ODS AB109 Units]]+UnitsDetails51[[#This Row],[SUD Non-Billable Units]]+UnitsDetails51[[#This Row],[Room & Board Units]]","v":0},0]
[0,{"$f":"'[4]Final Recon - Summary'!B672","v":"Group - Community Health Worker (CPT 98962)"},{"$f":"'[4]Final Recon - Summary'!C672","v":"Per Billable Minute"},{"$f":"'[4]Final Recon - Summary'!D672","v":0.63},{"$f":"UnitsDetails51[[#This Row],[ODS DMC General Units]]+UnitsDetails51[[#This Row],[ODS General Units]]+UnitsDetails51[[#This Row],[ODS DMC AB109 Units]]+UnitsDetails51[[#This Row],[ODS AB109 Units]]+UnitsDetails51[[#This Row],[Room & Board Units]]+UnitsDetails51[[#This Row],[SUD Non-Billable Units]]","v":0},0,null,0,null,{"$f":"UnitsDetails51[[#This Row],[ODS General Units]]*UnitsDetails51[[#This Row],[Rate]]","v":0},null,{"$f":"UnitsDetails51[[#This Row],[Rate]]*UnitsDetails51[[#This Row],[ODS DMC AB109 Units]]","v":0},null,{"$f":"UnitsDetails51[[#This Row],[Rate]]*UnitsDetails51[[#This Row],[ODS AB109 Units]]","v":0},null,{"$f":"UnitsDetails51[[#This Row],[Rate]]*UnitsDetails51[[#This Row],[SUD Non-Billable Units]]","v":0},null,{"$f":"UnitsDetails51[[#This Row],[Rate]]*UnitsDetails51[[#This Row],[Room & Board Units]]","v":0},null,{"$f":"'[4]Final Recon - Summary'!G672","v":0},{"$f":"UnitsDetails51[[#This Row],[ODS DMC General Units]]+UnitsDetails51[[#This Row],[ODS General Units]]+UnitsDetails51[[#This Row],[ODS DMC AB109 Units]]+UnitsDetails51[[#This Row],[ODS AB109 Units]]+UnitsDetails51[[#This Row],[SUD Non-Billable Units]]+UnitsDetails51[[#This Row],[Room & Board Units]]","v":0},0]
[0,{"$f":"'[4]Final Recon - Summary'!B673","v":"Group - Licensed Psychiatric Technician"},{"$f":"'[4]Final Recon - Summary'!C673","v":"Per Billable Minute"},{"$f":"'[4]Final Recon - Summary'!D673","v":0.84000000000000008},{"$f":"UnitsDetails51[[#This Row],[ODS DMC General Units]]+UnitsDetails51[[#This Row],[ODS General Units]]+UnitsDetails51[[#This Row],[ODS DMC AB109 Units]]+UnitsDetails51[[#This Row],[ODS AB109 Units]]+UnitsDetails51[[#This Row],[Room & Board Units]]+UnitsDetails51[[#This Row],[SUD Non-Billable Units]]","v":0},0,null,0,null,{"$f":"UnitsDetails51[[#This Row],[ODS General Units]]*UnitsDetails51[[#This Row],[Rate]]","v":0},null,{"$f":"UnitsDetails51[[#This Row],[Rate]]*UnitsDetails51[[#This Row],[ODS DMC AB109 Units]]","v":0},null,{"$f":"UnitsDetails51[[#This Row],[Rate]]*UnitsDetails51[[#This Row],[ODS AB109 Units]]","v":0},null,{"$f":"UnitsDetails51[[#This Row],[Rate]]*UnitsDetails51[[#This Row],[SUD Non-Billable Units]]","v":0},null,{"$f":"UnitsDetails51[[#This Row],[Rate]]*UnitsDetails51[[#This Row],[Room & Board Units]]","v":0},null,{"$f":"'[4]Final Recon - Summary'!G673","v":0},{"$f":"UnitsDetails51[[#This Row],[ODS DMC General Units]]+UnitsDetails51[[#This Row],[ODS General Units]]+UnitsDetails51[[#This Row],[ODS DMC AB109 Units]]+UnitsDetails51[[#This Row],[ODS AB109 Units]]+UnitsDetails51[[#This Row],[SUD Non-Billable Units]]+UnitsDetails51[[#This Row],[Room & Board Units]]","v":0},0]
[0,{"$f":"'[4]Final Recon - Summary'!B674","v":"Group - LPHA (MFT  LCSW  LPCC)/Intern or Waivered LPHA (MFT  LCSW  LPCC)"},{"$f":"'[4]Final Recon - Summary'!C674","v":"Per Billable Minute"},{"$f":"'[4]Final Recon - Summary'!D674","v":1.1900000000000002},{"$f":"UnitsDetails51[[#This Row],[ODS DMC General Units]]+UnitsDetails51[[#This Row],[ODS General Units]]+UnitsDetails51[[#This Row],[ODS DMC AB109 Units]]+UnitsDetails51[[#This Row],[ODS AB109 Units]]+UnitsDetails51[[#This Row],[Room & Board Units]]+UnitsDetails51[[#This Row],[SUD Non-Billable Units]]","v":0},0,null,0,null,{"$f":"UnitsDetails51[[#This Row],[ODS General Units]]*UnitsDetails51[[#This Row],[Rate]]","v":0},null,{"$f":"UnitsDetails51[[#This Row],[Rate]]*UnitsDetails51[[#This Row],[ODS DMC AB109 Units]]","v":0},null,{"$f":"UnitsDetails51[[#This Row],[Rate]]*UnitsDetails51[[#This Row],[ODS AB109 Units]]","v":0},null,{"$f":"UnitsDetails51[[#This Row],[Rate]]*UnitsDetails51[[#This Row],[SUD Non-Billable Units]]","v":0},null,{"$f":"UnitsDetails51[[#This Row],[Rate]]*UnitsDetails51[[#This Row],[Room & Board Units]]","v":0},null,{"$f":"'[4]Final Recon - Summary'!G674","v":0},{"$f":"UnitsDetails51[[#This Row],[ODS DMC General Units]]+UnitsDetails51[[#This Row],[ODS General Units]]+UnitsDetails51[[#This Row],[ODS DMC AB109 Units]]+UnitsDetails51[[#This Row],[ODS AB109 Units]]+UnitsDetails51[[#This Row],[SUD Non-Billable Units]]+UnitsDetails51[[#This Row],[Room & Board Units]]","v":0},0]
[0,{"$f":"'[4]Final Recon - Summary'!B675","v":"Group - Licensed Vocational Nurse (LVN)"},{"$f":"'[4]Final Recon - Summary'!C675","v":"Per Billable Minute"},{"$f":"'[4]Final Recon - Summary'!D675","v":0.98},{"$f":"UnitsDetails51[[#This Row],[ODS DMC General Units]]+UnitsDetails51[[#This Row],[ODS General Units]]+UnitsDetails51[[#This Row],[ODS DMC AB109 Units]]+UnitsDetails51[[#This Row],[ODS AB109 Units]]+UnitsDetails51[[#This Row],[Room & Board Units]]+UnitsDetails51[[#This Row],[SUD Non-Billable Units]]","v":0},0,null,0,null,{"$f":"UnitsDetails51[[#This Row],[ODS General Units]]*UnitsDetails51[[#This Row],[Rate]]","v":0},null,{"$f":"UnitsDetails51[[#This Row],[Rate]]*UnitsDetails51[[#This Row],[ODS DMC AB109 Units]]","v":0},null,{"$f":"UnitsDetails51[[#This Row],[Rate]]*UnitsDetails51[[#This Row],[ODS AB109 Units]]","v":0},null,{"$f":"UnitsDetails51[[#This Row],[Rate]]*UnitsDetails51[[#This Row],[SUD Non-Billable Units]]","v":0},null,{"$f":"UnitsDetails51[[#This Row],[Rate]]*UnitsDetails51[[#This Row],[Room & Board Units]]","v":0},null,{"$f":"'[4]Final Recon - Summary'!G675","v":0},{"$f":"UnitsDetails51[[#This Row],[ODS DMC General Units]]+UnitsDetails51[[#This Row],[ODS General Units]]+UnitsDetails51[[#This Row],[ODS DMC AB109 Units]]+UnitsDetails51[[#This Row],[ODS AB109 Units]]+UnitsDetails51[[#This Row],[SUD Non-Billable Units]]+UnitsDetails51[[#This Row],[Room & Board Units]]","v":0},0]
[0,{"$f":"'[4]Final Recon - Summary'!B676","v":"Group - Medical Assistant"},{"$f":"'[4]Final Recon - Summary'!C676","v":"Per Billable Minute"},{"$f":"'[4]Final Recon - Summary'!D676","v":0.68},{"$f":"UnitsDetails51[[#This Row],[ODS DMC General Units]]+UnitsDetails51[[#This Row],[ODS General Units]]+UnitsDetails51[[#This Row],[ODS DMC AB109 Units]]+UnitsDetails51[[#This Row],[ODS AB109 Units]]+UnitsDetails51[[#This Row],[Room & Board Units]]+UnitsDetails51[[#This Row],[SUD Non-Billable Units]]","v":0},0,null,0,null,{"$f":"UnitsDetails51[[#This Row],[ODS General Units]]*UnitsDetails51[[#This Row],[Rate]]","v":0},null,{"$f":"UnitsDetails51[[#This Row],[Rate]]*UnitsDetails51[[#This Row],[ODS DMC AB109 Units]]","v":0},null,{"$f":"UnitsDetails51[[#This Row],[Rate]]*UnitsDetails51[[#This Row],[ODS AB109 Units]]","v":0},null,{"$f":"UnitsDetails51[[#This Row],[Rate]]*UnitsDetails51[[#This Row],[SUD Non-Billable Units]]","v":0},null,{"$f":"UnitsDetails51[[#This Row],[Rate]]*UnitsDetails51[[#This Row],[Room & Board Units]]","v":0},null,{"$f":"'[4]Final Recon - Summary'!G676","v":0},{"$f":"UnitsDetails51[[#This Row],[ODS DMC General Units]]+UnitsDetails51[[#This Row],[ODS General Units]]+UnitsDetails51[[#This Row],[ODS DMC AB109 Units]]+UnitsDetails51[[#This Row],[ODS AB109 Units]]+UnitsDetails51[[#This Row],[SUD Non-Billable Units]]+UnitsDetails51[[#This Row],[Room & Board Units]]","v":0},0]
[0,{"$f":"'[4]Final Recon - Summary'!B677","v":"Group - Mental Health Rehabilitation Specialist"},{"$f":"'[4]Final Recon - Summary'!C677","v":"Per Billable Minute"},{"$f":"'[4]Final Recon - Summary'!D677","v":0.89999999999999991},{"$f":"UnitsDetails51[[#This Row],[ODS DMC General Units]]+UnitsDetails51[[#This Row],[ODS General Units]]+UnitsDetails51[[#This Row],[ODS DMC AB109 Units]]+UnitsDetails51[[#This Row],[ODS AB109 Units]]+UnitsDetails51[[#This Row],[Room & Board Units]]+UnitsDetails51[[#This Row],[SUD Non-Billable Units]]","v":0},0,null,0,null,{"$f":"UnitsDetails51[[#This Row],[ODS General Units]]*UnitsDetails51[[#This Row],[Rate]]","v":0},null,{"$f":"UnitsDetails51[[#This Row],[Rate]]*UnitsDetails51[[#This Row],[ODS DMC AB109 Units]]","v":0},null,{"$f":"UnitsDetails51[[#This Row],[Rate]]*UnitsDetails51[[#This Row],[ODS AB109 Units]]","v":0},null,{"$f":"UnitsDetails51[[#This Row],[Rate]]*UnitsDetails51[[#This Row],[SUD Non-Billable Units]]","v":0},null,{"$f":"UnitsDetails51[[#This Row],[Rate]]*UnitsDetails51[[#This Row],[Room & Board Units]]","v":0},null,{"$f":"'[4]Final Recon - Summary'!G677","v":0},{"$f":"UnitsDetails51[[#This Row],[ODS DMC General Units]]+UnitsDetails51[[#This Row],[ODS General Units]]+UnitsDetails51[[#This Row],[ODS DMC AB109 Units]]+UnitsDetails51[[#This Row],[ODS AB109 Units]]+UnitsDetails51[[#This Row],[SUD Non-Billable Units]]+UnitsDetails51[[#This Row],[Room & Board Units]]","v":0},0]
[0,{"$f":"'[4]Final Recon - Summary'!B678","v":"Group - Nurse Practitioner"},{"$f":"'[4]Final Recon - Summary'!C678","v":"Per Billable Minute"},{"$f":"'[4]Final Recon - Summary'!D678","v":2.2799999999999998},{"$f":"UnitsDetails51[[#This Row],[ODS DMC General Units]]+UnitsDetails51[[#This Row],[ODS General Units]]+UnitsDetails51[[#This Row],[ODS DMC AB109 Units]]+UnitsDetails51[[#This Row],[ODS AB109 Units]]+UnitsDetails51[[#This Row],[Room & Board Units]]+UnitsDetails51[[#This Row],[SUD Non-Billable Units]]","v":0},0,null,0,null,{"$f":"UnitsDetails51[[#This Row],[ODS General Units]]*UnitsDetails51[[#This Row],[Rate]]","v":0},null,{"$f":"UnitsDetails51[[#This Row],[Rate]]*UnitsDetails51[[#This Row],[ODS DMC AB109 Units]]","v":0},null,{"$f":"UnitsDetails51[[#This Row],[Rate]]*UnitsDetails51[[#This Row],[ODS AB109 Units]]","v":0},null,{"$f":"UnitsDetails51[[#This Row],[Rate]]*UnitsDetails51[[#This Row],[SUD Non-Billable Units]]","v":0},null,{"$f":"UnitsDetails51[[#This Row],[Rate]]*UnitsDetails51[[#This Row],[Room & Board Units]]","v":0},null,{"$f":"'[4]Final Recon - Summary'!G678","v":0},{"$f":"UnitsDetails51[[#This Row],[ODS DMC General Units]]+UnitsDetails51[[#This Row],[ODS General Units]]+UnitsDetails51[[#This Row],[ODS DMC AB109 Units]]+UnitsDetails51[[#This Row],[ODS AB109 Units]]+UnitsDetails51[[#This Row],[SUD Non-Billable Units]]+UnitsDetails51[[#This Row],[Room & Board Units]]","v":0},0]
[0,{"$f":"'[4]Final Recon - Summary'!B679","v":"Group - Occupational Therapist"},{"$f":"'[4]Final Recon - Summary'!C679","v":"Per Billable Minute"},{"$f":"'[4]Final Recon - Summary'!D679","v":1.59},{"$f":"UnitsDetails51[[#This Row],[ODS DMC General Units]]+UnitsDetails51[[#This Row],[ODS General Units]]+UnitsDetails51[[#This Row],[ODS DMC AB109 Units]]+UnitsDetails51[[#This Row],[ODS AB109 Units]]+UnitsDetails51[[#This Row],[Room & Board Units]]+UnitsDetails51[[#This Row],[SUD Non-Billable Units]]","v":0},0,null,0,null,{"$f":"UnitsDetails51[[#This Row],[ODS General Units]]*UnitsDetails51[[#This Row],[Rate]]","v":0},null,{"$f":"UnitsDetails51[[#This Row],[Rate]]*UnitsDetails51[[#This Row],[ODS DMC AB109 Units]]","v":0},null,{"$f":"UnitsDetails51[[#This Row],[Rate]]*UnitsDetails51[[#This Row],[ODS AB109 Units]]","v":0},null,{"$f":"UnitsDetails51[[#This Row],[Rate]]*UnitsDetails51[[#This Row],[SUD Non-Billable Units]]","v":0},null,{"$f":"UnitsDetails51[[#This Row],[Rate]]*UnitsDetails51[[#This Row],[Room & Board Units]]","v":0},null,{"$f":"'[4]Final Recon - Summary'!G679","v":0},{"$f":"UnitsDetails51[[#This Row],[ODS DMC General Units]]+UnitsDetails51[[#This Row],[ODS General Units]]+UnitsDetails51[[#This Row],[ODS DMC AB109 Units]]+UnitsDetails51[[#This Row],[ODS AB109 Units]]+UnitsDetails51[[#This Row],[SUD Non-Billable Units]]+UnitsDetails51[[#This Row],[Room & Board Units]]","v":0},0]
[0,{"$f":"'[4]Final Recon - Summary'!B680","v":"Group - Other Qualified Providers - Other Designated MH staff that bill medical"},{"$f":"'[4]Final Recon - Summary'!C680","v":"Per Billable Minute"},{"$f":"'[4]Final Recon - Summary'!D680","v":0.89999999999999991},{"$f":"UnitsDetails51[[#This Row],[ODS DMC General Units]]+UnitsDetails51[[#This Row],[ODS General Units]]+UnitsDetails51[[#This Row],[ODS DMC AB109 Units]]+UnitsDetails51[[#This Row],[ODS AB109 Units]]+UnitsDetails51[[#This Row],[Room & Board Units]]+UnitsDetails51[[#This Row],[SUD Non-Billable Units]]","v":0},0,null,0,null,{"$f":"UnitsDetails51[[#This Row],[ODS General Units]]*UnitsDetails51[[#This Row],[Rate]]","v":0},null,{"$f":"UnitsDetails51[[#This Row],[Rate]]*UnitsDetails51[[#This Row],[ODS DMC AB109 Units]]","v":0},null,{"$f":"UnitsDetails51[[#This Row],[Rate]]*UnitsDetails51[[#This Row],[ODS AB109 Units]]","v":0},null,{"$f":"UnitsDetails51[[#This Row],[Rate]]*UnitsDetails51[[#This Row],[SUD Non-Billable Units]]","v":0},null,{"$f":"UnitsDetails51[[#This Row],[Rate]]*UnitsDetails51[[#This Row],[Room & Board Units]]","v":0},null,{"$f":"'[4]Final Recon - Summary'!G680","v":0},{"$f":"UnitsDetails51[[#This Row],[ODS DMC General Units]]+UnitsDetails51[[#This Row],[ODS General Units]]+UnitsDetails51[[#This Row],[ODS DMC AB109 Units]]+UnitsDetails51[[#This Row],[ODS AB109 Units]]+UnitsDetails51[[#This Row],[SUD Non-Billable Units]]+UnitsDetails51[[#This Row],[Room & Board Units]]","v":0},0]
[{"$f":"$C$5","v":0},{"$f":"'[4]Final Recon - Summary'!B681","v":"Group - Peer Support Specialist"},{"$f":"'[4]Final Recon - Summary'!C681","v":"Per Billable Minute"},{"$f":"'[4]Final Recon - Summary'!D681","v":0.94},{"$f":"UnitsDetails51[[#This Row],[ODS DMC General Units]]+UnitsDetails51[[#This Row],[ODS General Units]]+UnitsDetails51[[#This Row],[ODS DMC AB109 Units]]+UnitsDetails51[[#This Row],[ODS AB109 Units]]+UnitsDetails51[[#This Row],[Room & Board Units]]+UnitsDetails51[[#This Row],[SUD Non-Billable Units]]","v":0},0,null,0,null,{"$f":"UnitsDetails51[[#This Row],[ODS General Units]]*UnitsDetails51[[#This Row],[Rate]]","v":0},null,{"$f":"UnitsDetails51[[#This Row],[Rate]]*UnitsDetails51[[#This Row],[ODS DMC AB109 Units]]","v":0},null,{"$f":"UnitsDetails51[[#This Row],[Rate]]*UnitsDetails51[[#This Row],[ODS AB109 Units]]","v":0},null,{"$f":"UnitsDetails51[[#This Row],[Rate]]*UnitsDetails51[[#This Row],[SUD Non-Billable Units]]","v":0},null,{"$f":"UnitsDetails51[[#This Row],[Rate]]*UnitsDetails51[[#This Row],[Room & Board Units]]","v":0},null,{"$f":"'[4]Final Recon - Summary'!G681","v":0},{"$f":"UnitsDetails51[[#This Row],[ODS DMC General Units]]+UnitsDetails51[[#This Row],[ODS General Units]]+UnitsDetails51[[#This Row],[ODS DMC AB109 Units]]+UnitsDetails51[[#This Row],[ODS AB109 Units]]+UnitsDetails51[[#This Row],[SUD Non-Billable Units]]+UnitsDetails51[[#This Row],[Room & Board Units]]","v":0},0]
[0,{"$f":"'[4]Final Recon - Summary'!B682","v":"Group - Physician Assistant"},{"$f":"'[4]Final Recon - Summary'!C682","v":"Per Billable Minute"},{"$f":"'[4]Final Recon - Summary'!D682","v":2.04},{"$f":"UnitsDetails51[[#This Row],[ODS DMC General Units]]+UnitsDetails51[[#This Row],[ODS General Units]]+UnitsDetails51[[#This Row],[ODS DMC AB109 Units]]+UnitsDetails51[[#This Row],[ODS AB109 Units]]+UnitsDetails51[[#This Row],[Room & Board Units]]+UnitsDetails51[[#This Row],[SUD Non-Billable Units]]","v":0},0,null,0,null,{"$f":"UnitsDetails51[[#This Row],[ODS General Units]]*UnitsDetails51[[#This Row],[Rate]]","v":0},null,{"$f":"UnitsDetails51[[#This Row],[Rate]]*UnitsDetails51[[#This Row],[ODS DMC AB109 Units]]","v":0},null,{"$f":"UnitsDetails51[[#This Row],[Rate]]*UnitsDetails51[[#This Row],[ODS AB109 Units]]","v":0},null,{"$f":"UnitsDetails51[[#This Row],[Rate]]*UnitsDetails51[[#This Row],[SUD Non-Billable Units]]","v":0},null,{"$f":"UnitsDetails51[[#This Row],[Rate]]*UnitsDetails51[[#This Row],[Room & Board Units]]","v":0},null,{"$f":"'[4]Final Recon - Summary'!G682","v":0},{"$f":"UnitsDetails51[[#This Row],[ODS DMC General Units]]+UnitsDetails51[[#This Row],[ODS General Units]]+UnitsDetails51[[#This Row],[ODS DMC AB109 Units]]+UnitsDetails51[[#This Row],[ODS AB109 Units]]+UnitsDetails51[[#This Row],[SUD Non-Billable Units]]+UnitsDetails51[[#This Row],[Room & Board Units]]","v":0},0]
[0,{"$f":"'[4]Final Recon - Summary'!B683","v":"Group - Psychologist/Pre-licensed Psychologist"},{"$f":"'[4]Final Recon - Summary'!C683","v":"Per Billable Minute"},{"$f":"'[4]Final Recon - Summary'!D683","v":1.84},{"$f":"UnitsDetails51[[#This Row],[ODS DMC General Units]]+UnitsDetails51[[#This Row],[ODS General Units]]+UnitsDetails51[[#This Row],[ODS DMC AB109 Units]]+UnitsDetails51[[#This Row],[ODS AB109 Units]]+UnitsDetails51[[#This Row],[Room & Board Units]]+UnitsDetails51[[#This Row],[SUD Non-Billable Units]]","v":0},0,null,0,null,{"$f":"UnitsDetails51[[#This Row],[ODS General Units]]*UnitsDetails51[[#This Row],[Rate]]","v":0},null,{"$f":"UnitsDetails51[[#This Row],[Rate]]*UnitsDetails51[[#This Row],[ODS DMC AB109 Units]]","v":0},null,{"$f":"UnitsDetails51[[#This Row],[Rate]]*UnitsDetails51[[#This Row],[ODS AB109 Units]]","v":0},null,{"$f":"UnitsDetails51[[#This Row],[Rate]]*UnitsDetails51[[#This Row],[SUD Non-Billable Units]]","v":0},null,{"$f":"UnitsDetails51[[#This Row],[Rate]]*UnitsDetails51[[#This Row],[Room & Board Units]]","v":0},null,{"$f":"'[4]Final Recon - Summary'!G683","v":0},{"$f":"UnitsDetails51[[#This Row],[ODS DMC General Units]]+UnitsDetails51[[#This Row],[ODS General Units]]+UnitsDetails51[[#This Row],[ODS DMC AB109 Units]]+UnitsDetails51[[#This Row],[ODS AB109 Units]]+UnitsDetails51[[#This Row],[SUD Non-Billable Units]]+UnitsDetails51[[#This Row],[Room & Board Units]]","v":0},0]
[0,{"$f":"'[4]Final Recon - Summary'!B684","v":"Group - Psychiatrist/ Contracted Psychiatrist/Licensed Physician (MD)"},{"$f":"'[4]Final Recon - Summary'!C684","v":"Per Billable Minute"},{"$f":"'[4]Final Recon - Summary'!D684","v":2.57},{"$f":"UnitsDetails51[[#This Row],[ODS DMC General Units]]+UnitsDetails51[[#This Row],[ODS General Units]]+UnitsDetails51[[#This Row],[ODS DMC AB109 Units]]+UnitsDetails51[[#This Row],[ODS AB109 Units]]+UnitsDetails51[[#This Row],[Room & Board Units]]+UnitsDetails51[[#This Row],[SUD Non-Billable Units]]","v":0},0,null,0,null,{"$f":"UnitsDetails51[[#This Row],[ODS General Units]]*UnitsDetails51[[#This Row],[Rate]]","v":0},null,{"$f":"UnitsDetails51[[#This Row],[Rate]]*UnitsDetails51[[#This Row],[ODS DMC AB109 Units]]","v":0},null,{"$f":"UnitsDetails51[[#This Row],[Rate]]*UnitsDetails51[[#This Row],[ODS AB109 Units]]","v":0},null,{"$f":"UnitsDetails51[[#This Row],[Rate]]*UnitsDetails51[[#This Row],[SUD Non-Billable Units]]","v":0},null,{"$f":"UnitsDetails51[[#This Row],[Rate]]*UnitsDetails51[[#This Row],[Room & Board Units]]","v":0},null,{"$f":"'[4]Final Recon - Summary'!G684","v":0},{"$f":"UnitsDetails51[[#This Row],[ODS DMC General Units]]+UnitsDetails51[[#This Row],[ODS General Units]]+UnitsDetails51[[#This Row],[ODS DMC AB109 Units]]+UnitsDetails51[[#This Row],[ODS AB109 Units]]+UnitsDetails51[[#This Row],[SUD Non-Billable Units]]+UnitsDetails51[[#This Row],[Room & Board Units]]","v":0},0]
[0,{"$f":"'[4]Final Recon - Summary'!B685","v":"Group - Registered Nurse (RN)"},{"$f":"'[4]Final Recon - Summary'!C685","v":"Per Billable Minute"},{"$f":"'[4]Final Recon - Summary'!D685","v":1.8599999999999999},{"$f":"UnitsDetails51[[#This Row],[ODS DMC General Units]]+UnitsDetails51[[#This Row],[ODS General Units]]+UnitsDetails51[[#This Row],[ODS DMC AB109 Units]]+UnitsDetails51[[#This Row],[ODS AB109 Units]]+UnitsDetails51[[#This Row],[Room & Board Units]]+UnitsDetails51[[#This Row],[SUD Non-Billable Units]]","v":0},0,null,0,null,{"$f":"UnitsDetails51[[#This Row],[ODS General Units]]*UnitsDetails51[[#This Row],[Rate]]","v":0},null,{"$f":"UnitsDetails51[[#This Row],[Rate]]*UnitsDetails51[[#This Row],[ODS DMC AB109 Units]]","v":0},null,{"$f":"UnitsDetails51[[#This Row],[Rate]]*UnitsDetails51[[#This Row],[ODS AB109 Units]]","v":0},null,{"$f":"UnitsDetails51[[#This Row],[Rate]]*UnitsDetails51[[#This Row],[SUD Non-Billable Units]]","v":0},null,{"$f":"UnitsDetails51[[#This Row],[Rate]]*UnitsDetails51[[#This Row],[Room & Board Units]]","v":0},null,{"$f":"'[4]Final Recon - Summary'!G685","v":0},{"$f":"UnitsDetails51[[#This Row],[ODS DMC General Units]]+UnitsDetails51[[#This Row],[ODS General Units]]+UnitsDetails51[[#This Row],[ODS DMC AB109 Units]]+UnitsDetails51[[#This Row],[ODS AB109 Units]]+UnitsDetails51[[#This Row],[SUD Non-Billable Units]]+UnitsDetails51[[#This Row],[Room & Board Units]]","v":0},0]
[0,{"$f":"'[4]Final Recon - Summary'!B686","v":"Group - Registered Pharmacist"},{"$f":"'[4]Final Recon - Summary'!C686","v":"Per Billable Minute"},{"$f":"'[4]Final Recon - Summary'!D686","v":2.19},{"$f":"UnitsDetails51[[#This Row],[ODS DMC General Units]]+UnitsDetails51[[#This Row],[ODS General Units]]+UnitsDetails51[[#This Row],[ODS DMC AB109 Units]]+UnitsDetails51[[#This Row],[ODS AB109 Units]]+UnitsDetails51[[#This Row],[Room & Board Units]]+UnitsDetails51[[#This Row],[SUD Non-Billable Units]]","v":0},0,null,0,null,{"$f":"UnitsDetails51[[#This Row],[ODS General Units]]*UnitsDetails51[[#This Row],[Rate]]","v":0},null,{"$f":"UnitsDetails51[[#This Row],[Rate]]*UnitsDetails51[[#This Row],[ODS DMC AB109 Units]]","v":0},null,{"$f":"UnitsDetails51[[#This Row],[Rate]]*UnitsDetails51[[#This Row],[ODS AB109 Units]]","v":0},null,{"$f":"UnitsDetails51[[#This Row],[Rate]]*UnitsDetails51[[#This Row],[SUD Non-Billable Units]]","v":0},null,{"$f":"UnitsDetails51[[#This Row],[Rate]]*UnitsDetails51[[#This Row],[Room & Board Units]]","v":0},null,{"$f":"'[4]Final Recon - Summary'!G686","v":0},{"$f":"UnitsDetails51[[#This Row],[ODS DMC General Units]]+UnitsDetails51[[#This Row],[ODS General Units]]+UnitsDetails51[[#This Row],[ODS DMC AB109 Units]]+UnitsDetails51[[#This Row],[ODS AB109 Units]]+UnitsDetails51[[#This Row],[SUD Non-Billable Units]]+UnitsDetails51[[#This Row],[Room & Board Units]]","v":0},0]
[0,{"$f":"'[4]Final Recon - Summary'!B687","v":"Group - Interpreter Services"},{"$f":"'[4]Final Recon - Summary'!C687","v":"Per Billable Minute"},{"$f":"'[4]Final Recon - Summary'!D687","v":0.49},{"$f":"UnitsDetails51[[#This Row],[ODS DMC General Units]]+UnitsDetails51[[#This Row],[ODS General Units]]+UnitsDetails51[[#This Row],[ODS DMC AB109 Units]]+UnitsDetails51[[#This Row],[ODS AB109 Units]]+UnitsDetails51[[#This Row],[Room & Board Units]]+UnitsDetails51[[#This Row],[SUD Non-Billable Units]]","v":0},0,null,0,null,{"$f":"UnitsDetails51[[#This Row],[ODS General Units]]*UnitsDetails51[[#This Row],[Rate]]","v":0},null,{"$f":"UnitsDetails51[[#This Row],[Rate]]*UnitsDetails51[[#This Row],[ODS DMC AB109 Units]]","v":0},null,{"$f":"UnitsDetails51[[#This Row],[Rate]]*UnitsDetails51[[#This Row],[ODS AB109 Units]]","v":0},null,{"$f":"UnitsDetails51[[#This Row],[Rate]]*UnitsDetails51[[#This Row],[SUD Non-Billable Units]]","v":0},null,{"$f":"UnitsDetails51[[#This Row],[Rate]]*UnitsDetails51[[#This Row],[Room & Board Units]]","v":0},null,{"$f":"'[4]Final Recon - Summary'!G687","v":0},{"$f":"UnitsDetails51[[#This Row],[ODS DMC General Units]]+UnitsDetails51[[#This Row],[ODS General Units]]+UnitsDetails51[[#This Row],[ODS DMC AB109 Units]]+UnitsDetails51[[#This Row],[ODS AB109 Units]]+UnitsDetails51[[#This Row],[SUD Non-Billable Units]]+UnitsDetails51[[#This Row],[Room & Board Units]]","v":0},0]
[0,{"$f":"'[4]Final Recon - Summary'!B688","v":"Bundled Rates"}]
[0,{"$f":"'[4]Final Recon - Summary'!B689","v":"Supported Employment"},{"$f":"'[4]Final Recon - Summary'!C689","v":"Bundled Full Month"},{"$f":"'[4]Final Recon - Summary'!D689","v":1209.1699999999998},{"$f":"UnitsDetails51[[#This Row],[ODS DMC General Units]]+UnitsDetails51[[#This Row],[ODS General Units]]+UnitsDetails51[[#This Row],[ODS DMC AB109 Units]]+UnitsDetails51[[#This Row],[ODS AB109 Units]]+UnitsDetails51[[#This Row],[Room & Board Units]]+UnitsDetails51[[#This Row],[SUD Non-Billable Units]]","v":0},{"$f":"+D589*E589","v":0},null,{"$f":"+D589*G589","v":0},null,{"$f":"UnitsDetails51[[#This Row],[ODS General Units]]*UnitsDetails51[[#This Row],[Rate]]","v":0},null,{"$f":"UnitsDetails51[[#This Row],[Rate]]*UnitsDetails51[[#This Row],[ODS DMC AB109 Units]]","v":0},null,{"$f":"UnitsDetails51[[#This Row],[Rate]]*UnitsDetails51[[#This Row],[ODS AB109 Units]]","v":0},null,{"$f":"UnitsDetails51[[#This Row],[Rate]]*UnitsDetails51[[#This Row],[SUD Non-Billable Units]]","v":0},null,{"$f":"UnitsDetails51[[#This Row],[Rate]]*UnitsDetails51[[#This Row],[Room & Board Units]]","v":0},null,{"$f":"'[4]Final Recon - Summary'!G689","v":0},{"$f":"UnitsDetails51[[#This Row],[ODS DMC General Units]]+UnitsDetails51[[#This Row],[ODS General Units]]+UnitsDetails51[[#This Row],[ODS DMC AB109 Units]]+UnitsDetails51[[#This Row],[ODS AB109 Units]]+UnitsDetails51[[#This Row],[SUD Non-Billable Units]]+UnitsDetails51[[#This Row],[Room & Board Units]]","v":0},{"$f":"T589-U589","v":0}]
[0,{"$f":"'[4]Final Recon - Summary'!B690","v":"Supported Employment"},{"$f":"'[4]Final Recon - Summary'!C690","v":"Bundled Partial Month"},{"$f":"'[4]Final Recon - Summary'!D690","v":604.58999999999992},{"$f":"UnitsDetails51[[#This Row],[ODS DMC General Units]]+UnitsDetails51[[#This Row],[ODS General Units]]+UnitsDetails51[[#This Row],[ODS DMC AB109 Units]]+UnitsDetails51[[#This Row],[ODS AB109 Units]]+UnitsDetails51[[#This Row],[Room & Board Units]]+UnitsDetails51[[#This Row],[SUD Non-Billable Units]]","v":0},{"$f":"+D590*E590","v":0},null,{"$f":"+D590*G590","v":0},null,{"$f":"UnitsDetails51[[#This Row],[ODS General Units]]*UnitsDetails51[[#This Row],[Rate]]","v":0},null,{"$f":"UnitsDetails51[[#This Row],[Rate]]*UnitsDetails51[[#This Row],[ODS DMC AB109 Units]]","v":0},null,{"$f":"UnitsDetails51[[#This Row],[Rate]]*UnitsDetails51[[#This Row],[ODS AB109 Units]]","v":0},null,{"$f":"UnitsDetails51[[#This Row],[Rate]]*UnitsDetails51[[#This Row],[SUD Non-Billable Units]]","v":0},null,{"$f":"UnitsDetails51[[#This Row],[Rate]]*UnitsDetails51[[#This Row],[Room & Board Units]]","v":0},null,{"$f":"'[4]Final Recon - Summary'!G690","v":0},{"$f":"UnitsDetails51[[#This Row],[ODS DMC General Units]]+UnitsDetails51[[#This Row],[ODS General Units]]+UnitsDetails51[[#This Row],[ODS DMC AB109 Units]]+UnitsDetails51[[#This Row],[ODS AB109 Units]]+UnitsDetails51[[#This Row],[SUD Non-Billable Units]]+UnitsDetails51[[#This Row],[Room & Board Units]]","v":0},{"$f":"T590-U590","v":0}]
[0]
[0]
[0]
[0]
[0]
[0]
[0]
[0]
[0]
[0,{"$f":"'[4]Final Recon - Summary'!B700","v":"Total"},null,null,{"$f":"UnitsDetails51[[#This Row],[ODS DMC General Units]]+UnitsDetails51[[#This Row],[ODS General Units]]+UnitsDetails51[[#This Row],[ODS DMC AB109 Units]]+UnitsDetails51[[#This Row],[ODS AB109 Units]]+UnitsDetails51[[#This Row],[Room & Board Units]]+UnitsDetails51[[#This Row],[SUD Non-Billable Units]]","v":0},{"$f":"SUM(F549:F599)","v":0},null,{"$f":"SUM(H549:H599)","v":0},null,{"$f":"SUM(J549:J599)","v":0},null,{"$f":"SUM(L549:L599)","v":0},null,{"$f":"SUM(N549:N599)","v":0},null,{"$f":"SUM(P549:P599)","v":0},null,{"$f":"SUM(R549:R599)","v":0}]

{"sheet":"Final Recon - CEF (SUD only)","index":3,"n_rows":40,"n_cols":4,"rows_kept":40,"cut":false,"hidden":false,"merged":[[29,0,31,3],[39,0,39,3],[21,2,21,3],[22,2,22,3],[24,0,24,1],[24,2,24,3],[25,0,25,3],[26,0,26,3],[20,2,20,3],[12,0,12,1],[12,2,12,3],[13,0,13,1],[13,2,13,3],[14,0,15,1],[14,2,14,3],[15,2,15,3],[16,0,16,1],[16,2,16,3],[17,0,17,1],[17,2,17,3],[19,2,19,3],[6,0,6,1],[6,2,6,3],[7,0,7,3],[8,0,9,3],[11,0,11,1],[11,2,11,3],[5,0,5,3],[0,0,0,3],[1,0,1,3],[2,0,2,3],[3,0,3,3],[4,0,4,3]]}
["COUNTY OF SAN DIEGO"]
[]
["BEHAVIORAL HEALTH SERVICES"]
[]
["FEE FOR SERVICE CONTRACTING SUMMARY"]
["CERTIFICATION OF EXPENDITURES AND FUNDING (CEF)"]
["FY FINAL RECONCILIATION"]
[]
["Please complete a separate form for each program within your contract."]
[]
[]
["Contractor Name",null,{"$f":"[5]INVOICE!B5","v":0}]
["Contract Number",null,{"$f":"[5]INVOICE!B6","v":0}]
["Contract Period (MM/DD/YY-MM/DD/YY)"]
["Corporate Address"]
[]
["State Provider Number(s)"]
["Net Contracted Amount for this Contract",null,{"$f":"[5]BUDGET!F77","v":0}]
[]
["A]","Contractor Generated Revenue"]
["B]","Disallowance/Adjustments"]
["C]","Total Amount claimed YTD"]
["D]","Payment due contractor or owed to County"]
["E]","Total County Cost",null,{"$f":"C22+C23","v":0}]
["Certified number of occupied bed days"]
["Please submit a final claim with this CEF if there is any amount due to the contractor."]
["If an amount is due to the County, please select your preferred method of payment:  "]
[]
[]
["I hereby certify that all funds from other sources have been used in accordance with Contract terms and conditions; that all expenditures reported herein are allowable Contract charges; that all claims were properly made and there will be no additional claims made against the Contract Fund."]
[]
[]
[]
["Signature:",null,"Date:"]
["Printed Name:",null,"Title:"]
["Phone #:",null,"Email:"]
[]
[]
[]
["Revised April 2026"]