{"text_format":"1","workbook":"xlsx","n_sheets":4,"sheets":["Final Recon - Summary","Sheet4","Final Recon - Details (SUD)","Final Recon - CEF (SUD only)"],"not_rendered":{"charts":0,"images":2,"macros":1,"external_links":5,"defined_names":37,"comments":0,"pivot_tables":0},"unopened":[],"bounds":{"document_bytes":16777216,"sheet_cells":100000,"rows_first":2000,"rows_last":500,"rows_between":2000,"halvings":0,"cell_chars":16384,"cell_head_chars":4096},"cells_cut":0,"cells_raw":0,"read":"whole","date_system":"1900"}

{"sheet":"Final Recon - Summary","index":0,"n_rows":529,"n_cols":9,"rows_kept":529,"cut":false,"hidden":false,"merged":[[324,2,324,4],[377,2,377,4],[430,2,430,4],[483,2,483,4],[6,2,6,4],[59,2,59,4],[112,2,112,4],[165,2,165,4],[218,2,218,4],[271,2,271,4],[470,1,470,5],[472,1,472,2],[472,4,472,5],[474,4,474,5],[475,1,475,2],[475,4,475,5],[523,1,523,5],[525,1,525,2],[525,4,525,5],[527,4,527,5],[528,1,528,2],[528,4,528,5],[417,1,417,5],[419,1,419,2],[419,4,419,5],[421,4,421,5],[422,1,422,2],[422,4,422,5],[364,1,364,5],[366,1,366,2],[366,4,366,5],[368,4,368,5],[369,1,369,2],[369,4,369,5],[311,1,311,5],[313,1,313,2],[313,4,313,5],[315,4,315,5],[316,1,316,2],[316,4,316,5],[258,1,258,5],[260,1,260,2],[260,4,260,5],[262,4,262,5],[263,1,263,2],[263,4,263,5],[205,1,205,5],[207,1,207,2],[207,4,207,5],[209,4,209,5],[210,1,210,2],[210,4,210,5],[152,1,152,5],[154,1,154,2],[154,4,154,5],[156,4,156,5],[157,1,157,2],[157,4,157,5],[99,1,99,5],[101,1,101,2],[101,4,101,5],[103,4,103,5],[104,1,104,2],[104,4,104,5],[46,1,46,5],[48,1,48,2],[48,4,48,5],[50,4,50,5],[51,1,51,2],[51,4,51,5]]}
["BEHAVIORAL HEALTH SERVICES"]
["Fiscal Year-End Units Reconciliation"]
[null,null,null,null,null,null,"# of Program Components:",1]
[null,"Contractor:",null,null,null,null,"Fiscal Year:"]
[null,"Contract #:",null,null,null,null,"TUOS Run Date:"]
[null,"Program Name:",null,null,null,null,{"$f":"IF(H6>0,\"Amount Due to Provider\",\"Amount Due to County\")","v":"Amount Due to County"},{"$f":"+I43+I96+I149+I202+I255+I308+I361+I414+I467+I520","v":0}]
[null,"Rate Category:","MH Outpatient - Negative 2.5% Modifer (Exc Interpreter, MD, IC) ",null,null,null,"Invoice Number:"]
[]
["Column1","Service Modalities","Unit","Rate","Final Invoice YTD Units","Final Invoice YTD Amount","Final TUOS Units Reconciliation","Final Amount Reconciliation","Amount Due to Provider / (Amount Due to County)"]
[{"$f":"$C$5","v":0},{"$f":"_xlfn.XLOOKUP(C7,Sheet4!A1:M1,Sheet4!A2:M34,0)","v":"Individual - Clinical Nurse Specialist"},{"$f":"_xlfn.XLOOKUP(C7,Sheet4!A40:M40,Sheet4!A41:M73,0)","v":"Per Billable Minute"},{"$f":"_xlfn.XLOOKUP(C7,Sheet4!A79:M79,Sheet4!A80:M112,0)","v":8.7199999999999989},null,{"$f":"+D10*E10","v":0},{"$f":"'Final Recon - Details (SUD)'!E9","v":0},{"$f":"+D10*G10","v":0},{"$f":"+'Final Recon - Summary'!$H10-'Final Recon - Summary'!$F10","v":0}]
[{"$f":"$C$5","v":0},"Individual - Licensed Psychiatric Technician","Per Billable Minute",3.21,null,{"$f":"+D11*E11","v":0},{"$f":"'Final Recon - Details (SUD)'!E10","v":0},{"$f":"+D11*G11","v":0},{"$f":"+'Final Recon - Summary'!$H11-'Final Recon - Summary'!$F11","v":0}]
[0,"Individual - LPHA (MFT  LCSW  LPCC)/Intern or Waivered LPHA (MFT  LCSW  LPCC)","Per Billable Minute",4.5599999999999996,null,0,{"$f":"'Final Recon - Details (SUD)'!E11","v":0},0,{"$f":"+'Final Recon - Summary'!$H12-'Final Recon - Summary'!$F12","v":0}]
[0,"Individual - Licensed Vocational Nurse (LVN)","Per Billable Minute",3.74,null,0,{"$f":"'Final Recon - Details (SUD)'!E12","v":0},0,{"$f":"+'Final Recon - Summary'!$H13-'Final Recon - Summary'!$F13","v":0}]
[0,"Individual - Medical Assistant","Per Billable Minute",2.5700000000000003,null,0,{"$f":"'Final Recon - Details (SUD)'!E13","v":0},0,{"$f":"+'Final Recon - Summary'!$H14-'Final Recon - Summary'!$F14","v":0}]
[0,"Individual - Mental Health Rehabilitation Specialist","Per Billable Minute",3.44,null,0,{"$f":"'Final Recon - Details (SUD)'!E14","v":0},0,{"$f":"+'Final Recon - Summary'!$H15-'Final Recon - Summary'!$F15","v":0}]
{"$rows_left_out":515}
{"sheet":"Sheet4","index":1,"n_rows":116,"n_cols":23,"rows_kept":116,"cut":false,"hidden":true,"merged":[]}
["MH Outpatient - No Modifier","MH Outpatient - Negative 2.5% Modifer (Exc Interpreter, MD, IC) ","MH Outpatient - Positive 2.5% Modifer (Exc Interpreter, MD, IC) ","MH Outpatient - Positive 5% Modifer (Exc Interpreter, MD, IC) ","MH Outpatient - Positive 7.5% Modifer (Exc Interpreter, MD, IC) ","MH Outpatient - Positive 10% Modifer (Exc Interpreter, MD, IC) ","MH Outpatient - Positive 12.5% Modifer (Exc Interpreter, MD, IC) ","MH Outpatient - Positive 15% Modifer (Exc Interpreter, MD, IC) ","MH Outpatient - Positive 20% Modifer (Exc Interpreter, MD, IC) ","SUD Outpatient - No Modifier","SUD Outpatient - Positive 5% Modifer (Exc Interpreter, MD, AWM) ","SUD Outpatient - Positive 10% Modifer (Exc Interpreter, MD, AWM) ","SUD Outpatient - Positive 20% Modifer (Exc Interpreter, MD, AWM) ",null,null,null,null,null,null,null,null,null,"MH Outpatient - No Modifier"]
["Individual - Clinical Nurse Specialist","Individual - Clinical Nurse Specialist","Individual - Clinical Nurse Specialist","Individual - Clinical Nurse Specialist","Individual - Clinical Nurse Specialist","Individual - Clinical Nurse Specialist","Individual - Clinical Nurse Specialist","Individual - Clinical Nurse Specialist","Individual - Clinical Nurse Specialist","Individual - Alcohol and Drug Counselor","Individual - Alcohol and Drug Counselor","Individual - Alcohol and Drug Counselor","Individual - Alcohol and Drug Counselor",null,null,null,null,null,null,null,null,null,"MH Outpatient - Negative 2.5% Modifer (Exc Interpreter, MD, IC) "]
["Individual - Licensed Psychiatric Technician","Individual - Licensed Psychiatric Technician","Individual - Licensed Psychiatric Technician","Individual - Licensed Psychiatric Technician","Individual - Licensed Psychiatric Technician","Individual - Licensed Psychiatric Technician","Individual - Licensed Psychiatric Technician","Individual - Licensed Psychiatric Technician","Individual - Licensed Psychiatric Technician","Individual - Licensed Psychiatric Technician","Individual - Licensed Psychiatric Technician","Individual - Licensed Psychiatric Technician","Individual - Licensed Psychiatric Technician",null,null,null,null,null,null,null,null,null,"MH Outpatient - Positive 2.5% Modifer (Exc Interpreter, MD, IC) "]
["Individual - LPHA (MFT  LCSW  LPCC)/Intern or Waivered LPHA (MFT  LCSW  LPCC)","Individual - LPHA (MFT  LCSW  LPCC)/Intern or Waivered LPHA (MFT  LCSW  LPCC)","Individual - LPHA (MFT  LCSW  LPCC)/Intern or Waivered LPHA (MFT  LCSW  LPCC)","Individual - LPHA (MFT  LCSW  LPCC)/Intern or Waivered LPHA (MFT  LCSW  LPCC)","Individual - LPHA (MFT  LCSW  LPCC)/Intern or Waivered LPHA (MFT  LCSW  LPCC)","Individual - LPHA (MFT  LCSW  LPCC)/Intern or Waivered LPHA (MFT  LCSW  LPCC)","Individual - LPHA (MFT  LCSW  LPCC)/Intern or Waivered LPHA (MFT  LCSW  LPCC)","Individual - LPHA (MFT  LCSW  LPCC)/Intern or Waivered LPHA (MFT  LCSW  LPCC)","Individual - LPHA (MFT  LCSW  LPCC)/Intern or Waivered LPHA (MFT  LCSW  LPCC)","Individual - Licensed Physician (MD)","Individual - Licensed Physician (MD)","Individual - Licensed Physician (MD)","Individual - Licensed Physician (MD)",null,null,null,null,null,null,null,null,null,"MH Outpatient - Positive 5% Modifer (Exc Interpreter, MD, IC) "]
["Individual - Licensed Vocational Nurse (LVN)","Individual - Licensed Vocational Nurse (LVN)","Individual - Licensed Vocational Nurse (LVN)","Individual - Licensed Vocational Nurse (LVN)","Individual - Licensed Vocational Nurse (LVN)","Individual - Licensed Vocational Nurse (LVN)","Individual - Licensed Vocational Nurse (LVN)","Individual - Licensed Vocational Nurse (LVN)","Individual - Licensed Vocational Nurse (LVN)","Individual - Licensed Vocational Nurse","Individual - Licensed Vocational Nurse","Individual - Licensed Vocational Nurse","Individual - Licensed Vocational Nurse",null,null,null,null,null,null,null,null,null,"MH Outpatient - Positive 7.5% Modifer (Exc Interpreter, MD, IC) "]
["Individual - Medical Assistant","Individual - Medical Assistant","Individual - Medical Assistant","Individual - Medical Assistant","Individual - Medical Assistant","Individual - Medical Assistant","Individual - Medical Assistant","Individual - Medical Assistant","Individual - Medical Assistant","Individual - LPHA (MFT  LCSW  LPCC)/Intern or\nWaivered LPHA (MFT  LCSW  LPCC)","Individual - LPHA (MFT  LCSW  LPCC)/Intern or\nWaivered LPHA (MFT  LCSW  LPCC)","Individual - LPHA (MFT  LCSW  LPCC)/Intern or\nWaivered LPHA (MFT  LCSW  LPCC)","Individual - LPHA (MFT  LCSW  LPCC)/Intern or\nWaivered LPHA (MFT  LCSW  LPCC)",null,null,null,null,null,null,null,null,null,"MH Outpatient - Positive 10% Modifer (Exc Interpreter, MD, IC) "]
["Individual - Mental Health Rehabilitation Specialist","Individual - Mental Health Rehabilitation Specialist","Individual - Mental Health Rehabilitation Specialist","Individual - Mental Health Rehabilitation Specialist","Individual - Mental Health Rehabilitation Specialist","Individual - Mental Health Rehabilitation Specialist","Individual - Mental Health Rehabilitation Specialist","Individual - Mental Health Rehabilitation Specialist","Individual - Mental Health Rehabilitation Specialist","Individual - Medical Assistant","Individual - Medical Assistant","Individual - Medical Assistant","Individual - Medical Assistant",null,null,null,null,null,null,null,null,null,"MH Outpatient - Positive 12.5% Modifer (Exc Interpreter, MD, IC) "]
["Individual - Nurse Practitioner","Individual - Nurse Practitioner","Individual - Nurse Practitioner","Individual - Nurse Practitioner","Individual - Nurse Practitioner","Individual - Nurse Practitioner","Individual - Nurse Practitioner","Individual - Nurse Practitioner","Individual - Nurse Practitioner","Individual - Nurse Practitioner","Individual - Nurse Practitioner","Individual - Nurse Practitioner","Individual - Nurse Practitioner",null,null,null,null,null,null,null,null,null,"MH Outpatient - Positive 15% Modifer (Exc Interpreter, MD, IC) "]
["Individual - Occupational Therapist","Individual - Occupational Therapist","Individual - Occupational Therapist","Individual - Occupational Therapist","Individual - Occupational Therapist","Individual - Occupational Therapist","Individual - Occupational Therapist","Individual - Occupational Therapist","Individual - Occupational Therapist","Individual - Occupational Therapist","Individual - Occupational Therapist","Individual - Occupational Therapist","Individual - Occupational Therapist",null,null,null,null,null,null,null,null,null,"MH Outpatient - Positive 20% Modifer (Exc Interpreter, MD, IC) "]
["Individual - Other Qualified Providers - Other Designated MH staff that bill medical","Individual - Other Qualified Providers - Other Designated MH staff that bill medical","Individual - Other Qualified Providers - Other Designated MH staff that bill medical","Individual - Other Qualified Providers - Other Designated MH staff that bill medical","Individual - Other Qualified Providers - Other Designated MH staff that bill medical","Individual - Other Qualified Providers - Other Designated MH staff that bill medical","Individual - Other Qualified Providers - Other Designated MH staff that bill medical","Individual - Other Qualified Providers - Other Designated MH staff that bill medical","Individual - Other Qualified Providers - Other Designated MH staff that bill medical","Individual - Peer Support Specialist","Individual - Peer Support Specialist","Individual - Peer Support Specialist","Individual - Peer Support Specialist",null,null,null,null,null,null,null,null,null,"SUD Outpatient - No Modifier"]
["Individual - Peer Support Specialist","Individual - Peer Support Specialist","Individual - Peer Support Specialist","Individual - Peer Support Specialist","Individual - Peer Support Specialist","Individual - Peer Support Specialist","Individual - Peer Support Specialist","Individual - Peer Support Specialist","Individual - Peer Support Specialist","Individual - Physician Assistant","Individual - Physician Assistant","Individual - Physician Assistant","Individual - Physician Assistant",null,null,null,null,null,null,null,null,null,"SUD Outpatient - Positive 5% Modifer (Exc Interpreter, MD, AWM) "]
["Individual - Physician Assistant","Individual - Physician Assistant","Individual - Physician Assistant","Individual - Physician Assistant","Individual - Physician Assistant","Individual - Physician Assistant","Individual - Physician Assistant","Individual - Physician Assistant","Individual - Physician Assistant","Individual - Psychologist/Pre-licensed Psychologist","Individual - Psychologist/Pre-licensed Psychologist","Individual - Psychologist/Pre-licensed Psychologist","Individual - Psychologist/Pre-licensed Psychologist",null,null,null,null,null,null,null,null,null,"SUD Outpatient - Positive 10% Modifer (Exc Interpreter, MD, AWM) "]
["Individual - Psychologist/Pre-licensed Psychologist","Individual - Psychologist/Pre-licensed Psychologist","Individual - Psychologist/Pre-licensed Psychologist","Individual - Psychologist/Pre-licensed Psychologist","Individual - Psychologist/Pre-licensed Psychologist","Individual - Psychologist/Pre-licensed Psychologist","Individual - Psychologist/Pre-licensed Psychologist","Individual - Psychologist/Pre-licensed Psychologist","Individual - Psychologist/Pre-licensed Psychologist","Individual - Registered Nurse (RN)","Individual - Registered Nurse (RN)","Individual - Registered Nurse (RN)","Individual - Registered Nurse (RN)",null,null,null,null,null,null,null,null,null,"SUD Outpatient - Positive 20% Modifer (Exc Interpreter, MD, AWM) "]
["Individual - Psychiatrist/ Contracted Psychiatrist/Licensed Physician (MD)","Individual - Psychiatrist/ Contracted Psychiatrist/Licensed Physician (MD)","Individual - Psychiatrist/ Contracted Psychiatrist/Licensed Physician (MD)","Individual - Psychiatrist/ Contracted Psychiatrist/Licensed Physician (MD)","Individual - Psychiatrist/ Contracted Psychiatrist/Licensed Physician (MD)","Individual - Psychiatrist/ Contracted Psychiatrist/Licensed Physician (MD)","Individual - Psychiatrist/ Contracted Psychiatrist/Licensed Physician (MD)","Individual - Psychiatrist/ Contracted Psychiatrist/Licensed Physician (MD)","Individual - Psychiatrist/ Contracted Psychiatrist/Licensed Physician (MD)","Individual - Registered Pharmacist","Individual - Registered Pharmacist","Individual - Registered Pharmacist","Individual - Registered Pharmacist"]
["Individual - Registered Nurse (RN)","Individual - Registered Nurse (RN)","Individual - Registered Nurse (RN)","Individual - Registered Nurse (RN)","Individual - Registered Nurse (RN)","Individual - Registered Nurse (RN)","Individual - Registered Nurse (RN)","Individual - Registered Nurse (RN)","Individual - Registered Nurse (RN)","Individual - Interpreter Services","Individual - Interpreter Services","Individual - Interpreter Services","Individual - Interpreter Services"]
{"$rows_left_out":102}
{"sheet":"Final Recon - Details (SUD)","index":2,"n_rows":600,"n_cols":22,"rows_kept":600,"cut":false,"hidden":false,"merged":[[5,2,5,4]]}
["BEHAVIORAL HEALTH SERVICES"]
["Fiscal Year-End Units Details"]
[]
[null,"Contractor:",{"$f":"'Final Recon - Summary'!C4","v":0}]
[null,"Contract #:",{"$f":"'Final Recon - Summary'!C5","v":0}]
[null,"Rate Category:","SUD Outpatient - Positive 5% Modifer (Exc Interpreter, MD, AWM) "]
[]
["Column1","Service Modalities","Unit","Rate","Final TUOS Units Reconciliation","Final Amount Reconciliation","ODS DMC General Units","ODS DMC General Amount","ODS General Units","ODS General Amount","ODS DMC AB109 Units","ODS DMC AB109 Amount","ODS AB109 Units","ODS AB109 Amount","SUD Non-Billable Units","SUD Non-Billable Amount","Room & Board Units","Room & Board Amount",null,"Total Units (Summary)","Total Units (Details)","Checkpoint"]
[{"$f":"$C$5","v":0},{"$f":"_xlfn.XLOOKUP(C6,Sheet4!J1:M1,Sheet4!J2:M32,0)","v":"Individual - Alcohol and Drug Counselor"},{"$f":"_xlfn.XLOOKUP(C6,Sheet4!J40:M40,Sheet4!J41:M71,0)","v":"Per Billable Minute"},{"$f":"_xlfn.XLOOKUP(C6,Sheet4!J79:M79,Sheet4!J80:M110,0)","v":4.18},{"$f":"'Final Recon - Details (SUD)'!$G9+'Final Recon - Details (SUD)'!$I9+'Final Recon - Details (SUD)'!$K9+'Final Recon - Details (SUD)'!$M9+'Final Recon - Details (SUD)'!$Q9+'Final Recon - Details (SUD)'!$O9","v":0},{"$f":"+D9*E9","v":0},null,{"$f":"+D9*G9","v":0},null,{"$f":"'Final Recon - Details (SUD)'!$I9*'Final Recon - Details (SUD)'!$D9","v":0},null,{"$f":"'Final Recon - Details (SUD)'!$D9*'Final Recon - Details (SUD)'!$K9","v":0},null,{"$f":"'Final Recon - Details (SUD)'!$D9*'Final Recon - Details (SUD)'!$M9","v":0},null,{"$f":"'Final Recon - Details (SUD)'!$D9*'Final Recon - Details (SUD)'!$O9","v":0},null,{"$f":"'Final Recon - Details (SUD)'!$D9*'Final Recon - Details (SUD)'!$Q9","v":0},null,{"$f":"'[4]Final Recon - Summary'!G10","v":0},{"$f":"'Final Recon - Details (SUD)'!$G9+'Final Recon - Details (SUD)'!$I9+'Final Recon - Details (SUD)'!$K9+'Final Recon - Details (SUD)'!$M9+'Final Recon - Details (SUD)'!$O9+'Final Recon - Details (SUD)'!$Q9","v":0},{"$f":"T9-U9","v":0}]
[0,"Individual - Licensed Psychiatric Technician","Per Billable Minute",3.54,{"$f":"'Final Recon - Details (SUD)'!$G10+'Final Recon - Details (SUD)'!$I10+'Final Recon - Details (SUD)'!$K10+'Final Recon - Details (SUD)'!$M10+'Final Recon - Details (SUD)'!$Q10+'Final Recon - Details (SUD)'!$O10","v":0},0,null,0,null,{"$f":"'Final Recon - Details (SUD)'!$I10*'Final Recon - Details (SUD)'!$D10","v":0},null,{"$f":"'Final Recon - Details (SUD)'!$D10*'Final Recon - Details (SUD)'!$K10","v":0},null,{"$f":"'Final Recon - Details (SUD)'!$D10*'Final Recon - Details (SUD)'!$M10","v":0},null,{"$f":"'Final Recon - Details (SUD)'!$D10*'Final Recon - Details (SUD)'!$O10","v":0},null,{"$f":"'Final Recon - Details (SUD)'!$D10*'Final Recon - Details (SUD)'!$Q10","v":0},null,{"$f":"'[4]Final Recon - Summary'!G11","v":0},{"$f":"'Final Recon - Details (SUD)'!$G10+'Final Recon - Details (SUD)'!$I10+'Final Recon - Details (SUD)'!$K10+'Final Recon - Details (SUD)'!$M10+'Final Recon - Details (SUD)'!$O10+'Final Recon - Details (SUD)'!$Q10","v":0},0]
[0,"Individual - Licensed Physician (MD)","Per Billable Minute",10.89,{"$f":"'Final Recon - Details (SUD)'!$G11+'Final Recon - Details (SUD)'!$I11+'Final Recon - Details (SUD)'!$K11+'Final Recon - Details (SUD)'!$M11+'Final Recon - Details (SUD)'!$Q11+'Final Recon - Details (SUD)'!$O11","v":0},0,null,0,null,{"$f":"'Final Recon - Details (SUD)'!$I11*'Final Recon - Details (SUD)'!$D11","v":0},null,{"$f":"'Final Recon - Details (SUD)'!$D11*'Final Recon - Details (SUD)'!$K11","v":0},null,{"$f":"'Final Recon - Details (SUD)'!$D11*'Final Recon - Details (SUD)'!$M11","v":0},null,{"$f":"'Final Recon - Details (SUD)'!$D11*'Final Recon - Details (SUD)'!$O11","v":0},null,{"$f":"'Final Recon - Details (SUD)'!$D11*'Final Recon - Details (SUD)'!$Q11","v":0},null,{"$f":"'[4]Final Recon - Summary'!G12","v":0},{"$f":"'Final Recon - Details (SUD)'!$G11+'Final Recon - Details (SUD)'!$I11+'Final Recon - Details (SUD)'!$K11+'Final Recon - Details (SUD)'!$M11+'Final Recon - Details (SUD)'!$O11+'Final Recon - Details (SUD)'!$Q11","v":0},0]
[0,"Individual - Licensed Vocational Nurse","Per Billable Minute",4.13,{"$f":"'Final Recon - Details (SUD)'!$G12+'Final Recon - Details (SUD)'!$I12+'Final Recon - Details (SUD)'!$K12+'Final Recon - Details (SUD)'!$M12+'Final Recon - Details (SUD)'!$Q12+'Final Recon - Details (SUD)'!$O12","v":0},0,null,0,null,{"$f":"'Final Recon - Details (SUD)'!$I12*'Final Recon - Details (SUD)'!$D12","v":0},null,{"$f":"'Final Recon - Details (SUD)'!$D12*'Final Recon - Details (SUD)'!$K12","v":0},null,{"$f":"'Final Recon - Details (SUD)'!$D12*'Final Recon - Details (SUD)'!$M12","v":0},null,{"$f":"'Final Recon - Details (SUD)'!$D12*'Final Recon - Details (SUD)'!$O12","v":0},null,{"$f":"'Final Recon - Details (SUD)'!$D12*'Final Recon - Details (SUD)'!$Q12","v":0},null,{"$f":"'[4]Final Recon - Summary'!G13","v":0},{"$f":"'Final Recon - Details (SUD)'!$G12+'Final Recon - Details (SUD)'!$I12+'Final Recon - Details (SUD)'!$K12+'Final Recon - Details (SUD)'!$M12+'Final Recon - Details (SUD)'!$O12+'Final Recon - Details (SUD)'!$Q12","v":0},0]
[0,"Individual - LPHA (MFT  LCSW  LPCC)/Intern or\nWaivered LPHA (MFT  LCSW  LPCC)","Per Billable Minute",5.0299999999999994,{"$f":"'Final Recon - Details (SUD)'!$G13+'Final Recon - Details (SUD)'!$I13+'Final Recon - Details (SUD)'!$K13+'Final Recon - Details (SUD)'!$M13+'Final Recon - Details (SUD)'!$Q13+'Final Recon - Details (SUD)'!$O13","v":0},0,null,0,null,{"$f":"'Final Recon - Details (SUD)'!$I13*'Final Recon - Details (SUD)'!$D13","v":0},null,{"$f":"'Final Recon - Details (SUD)'!$D13*'Final Recon - Details (SUD)'!$K13","v":0},null,{"$f":"'Final Recon - Details (SUD)'!$D13*'Final Recon - Details (SUD)'!$M13","v":0},null,{"$f":"'Final Recon - Details (SUD)'!$D13*'Final Recon - Details (SUD)'!$O13","v":0},null,{"$f":"'Final Recon - Details (SUD)'!$D13*'Final Recon - Details (SUD)'!$Q13","v":0},null,{"$f":"'[4]Final Recon - Summary'!G14","v":0},{"$f":"'Final Recon - Details (SUD)'!$G13+'Final Recon - Details (SUD)'!$I13+'Final Recon - Details (SUD)'!$K13+'Final Recon - Details (SUD)'!$M13+'Final Recon - Details (SUD)'!$O13+'Final Recon - Details (SUD)'!$Q13","v":0},0]
[0,"Individual - Medical Assistant","Per Billable Minute",2.8400000000000003,{"$f":"'Final Recon - Details (SUD)'!$G14+'Final Recon - Details (SUD)'!$I14+'Final Recon - Details (SUD)'!$K14+'Final Recon - Details (SUD)'!$M14+'Final Recon - Details (SUD)'!$Q14+'Final Recon - Details (SUD)'!$O14","v":0},0,null,0,null,{"$f":"'Final Recon - Details (SUD)'!$I14*'Final Recon - Details (SUD)'!$D14","v":0},null,{"$f":"'Final Recon - Details (SUD)'!$D14*'Final Recon - Details (SUD)'!$K14","v":0},null,{"$f":"'Final Recon - Details (SUD)'!$D14*'Final Recon - Details (SUD)'!$M14","v":0},null,{"$f":"'Final Recon - Details (SUD)'!$D14*'Final Recon - Details (SUD)'!$O14","v":0},null,{"$f":"'Final Recon - Details (SUD)'!$D14*'Final Recon - Details (SUD)'!$Q14","v":0},null,{"$f":"'[4]Final Recon - Summary'!G15","v":0},{"$f":"'Final Recon - Details (SUD)'!$G14+'Final Recon - Details (SUD)'!$I14+'Final Recon - Details (SUD)'!$K14+'Final Recon - Details (SUD)'!$M14+'Final Recon - Details (SUD)'!$O14+'Final Recon - Details (SUD)'!$Q14","v":0},0]
[0,"Individual - Nurse Practitioner","Per Billable Minute",9.6199999999999992,{"$f":"'Final Recon - Details (SUD)'!$G15+'Final Recon - Details (SUD)'!$I15+'Final Recon - Details (SUD)'!$K15+'Final Recon - Details (SUD)'!$M15+'Final Recon - Details (SUD)'!$Q15+'Final Recon - Details (SUD)'!$O15","v":0},0,null,0,null,{"$f":"'Final Recon - Details (SUD)'!$I15*'Final Recon - Details (SUD)'!$D15","v":0},null,{"$f":"'Final Recon - Details (SUD)'!$D15*'Final Recon - Details (SUD)'!$K15","v":0},null,{"$f":"'Final Recon - Details (SUD)'!$D15*'Final Recon - Details (SUD)'!$M15","v":0},null,{"$f":"'Final Recon - Details (SUD)'!$D15*'Final Recon - Details (SUD)'!$O15","v":0},null,{"$f":"'Final Recon - Details (SUD)'!$D15*'Final Recon - Details (SUD)'!$Q15","v":0},null,{"$f":"'[4]Final Recon - Summary'!G16","v":0},{"$f":"'Final Recon - Details (SUD)'!$G15+'Final Recon - Details (SUD)'!$I15+'Final Recon - Details (SUD)'!$K15+'Final Recon - Details (SUD)'!$M15+'Final Recon - Details (SUD)'!$O15+'Final Recon - Details (SUD)'!$Q15","v":0},0]
{"$rows_left_out":586}
{"sheet":"Final Recon - CEF (SUD only)","index":3,"n_rows":40,"n_cols":4,"rows_kept":40,"cut":false,"hidden":false,"merged":[[29,0,31,3],[39,0,39,3],[21,2,21,3],[22,2,22,3],[24,0,24,1],[24,2,24,3],[25,0,25,3],[26,0,26,3],[20,2,20,3],[12,0,12,1],[12,2,12,3],[13,0,13,1],[13,2,13,3],[14,0,15,1],[14,2,14,3],[15,2,15,3],[16,0,16,1],[16,2,16,3],[17,0,17,1],[17,2,17,3],[19,2,19,3],[6,0,6,1],[6,2,6,3],[7,0,7,3],[8,0,9,3],[11,0,11,1],[11,2,11,3],[5,0,5,3],[0,0,0,3],[1,0,1,3],[2,0,2,3],[3,0,3,3],[4,0,4,3]]}
["COUNTY OF SAN DIEGO"]
[]
["BEHAVIORAL HEALTH SERVICES"]
[]
["FEE FOR SERVICE CONTRACTING SUMMARY"]
["CERTIFICATION OF EXPENDITURES AND FUNDING (CEF)"]
["FY FINAL RECONCILIATION"]
[]
["Please complete a separate form for each program within your contract."]
[]
[]
["Contractor Name",null,{"$f":"[5]INVOICE!B5","v":0}]
["Contract Number",null,{"$f":"[5]INVOICE!B6","v":0}]
["Contract Period (MM/DD/YY-MM/DD/YY)"]
["Corporate Address"]
{"$rows_left_out":25}