{"text_format":"1","workbook":"xlsx","n_sheets":7,"sheets":["Instruction","Program Invoicing","Provider Charges","Reconciliation","Sheet6","Sheet4","Data Validation"],"not_rendered":{"charts":0,"images":0,"macros":1,"external_links":0,"defined_names":4,"comments":0,"pivot_tables":0},"unopened":[],"bounds":{"document_bytes":16777216,"sheet_cells":100000,"rows_first":2000,"rows_last":500,"rows_between":2000,"halvings":0,"cell_chars":16384,"cell_head_chars":4096},"cells_cut":0,"cells_raw":0,"read":"whole","date_system":"1900"}

{"sheet":"Instruction","index":0,"n_rows":7,"n_cols":1,"rows_kept":7,"cut":false,"hidden":false,"merged":[]}
["Instructions"]
[]
["1. Copy the information in Summary tab from the Service Time Generator and paste as value in the Program Invoicing tab."]
["2. Click Update Recon button."]
["3. Copy the information in TUOS Report tab from the TUOS Generator and paste as value in the Provider Charges tab."]
["4. Click Update Recon button."]
["5. Go to Reconciliation tab to view the reconciled units based on funding source."]

{"sheet":"Program Invoicing","index":1,"n_rows":201,"n_cols":18,"rows_kept":201,"cut":false,"hidden":false,"merged":[]}
["Program Name","Credential/Degree Name/Modality","Individual/Group","Procedure Code","Unit Type","Add-On Code","Add-On Unit Type","Charge Units","Billable Minutes/Units","Add-On Charge Units","Add-On Billable Minutes/Units","Total Billable Minutes/Units"]
[null,null,null,null,null,null,null,null,null,null,null,null,{"$f":"IFERROR((VLOOKUP(B2,'Data Validation'!A:B,2,0)),0)","v":0},{"$f":"IFERROR((VLOOKUP(A2,'Data Validation'!J:K,2,0)),0)","v":0},{"$f":"IF(M2=\"Bed Days\",M2&\"-\"&N2,M2)","v":0},{"$f":"C2&\"-\"&O2","v":"-0"},{"$f":"+L2","v":0},{"$f":"+E2","v":0}]
[]
[]
[]
[]
[]
[]
[]
[]
[]
[]
[]
[]
[]
[]
[]
[]
[]
[]
{"$rows_left_out":182}
{"sheet":"Provider Charges","index":2,"n_rows":502,"n_cols":24,"rows_kept":502,"cut":false,"hidden":false,"merged":[]}
["ProgramName","DegreeName","ProcedureCode","ProcedureName","Plan","ServiceUnitType","Sum of ChargeUnits","Unit/Minutes per Charge Unit","TOTAL Units/Minutes","Individual/Group","Interpreter Services","Interactive Complexity"]
[null,null,null,null,null,null,null,null,null,null,null,null,{"$f":"IF(C2=\"H0014\",\"Ambulatory WM\",VLOOKUP(B2,'Data Validation'!D:E,2,0))","v":{"$error":"#N/A"}},{"$f":"IFERROR((VLOOKUP(A2,'Data Validation'!G:H,2,0)),0)","v":0},{"$f":"IFERROR((_xlfn.IFS(M2=\"Bed Days\",M2&\"-\"&N2,K2=\"Y\",\"Interpreter Services\",L2=\"Y\",\"Interactive Complexity\",M2=\"Ambulatory WM\",M2&\" - \"&N2)),M2)","v":{"$error":"#N/A"}},{"$f":"VLOOKUP(E2,'Data Validation'!M:N,2,0)","v":{"$error":"#N/A"}},{"$f":"+J2&\"-\"&O2","v":{"$error":"#N/A"}},{"$f":"+J2&\"-\"&O2&\"-\"&P2","v":{"$error":"#N/A"}},{"$f":"+I2","v":0},null,null,null,null,{"$f":"_xlfn.IFS(M2=\"Bed Days\",M2&\"-\"&N2,K2=\"Y\",\"Interpreter Services\",L2=\"Y\",\"Interactive Complexity\",M2=\"Ambulatory WM\",M2&\"-\"&N2)","v":{"$error":"#N/A"}}]
[]
[]
[]
[]
[]
[]
[]
[]
[]
[]
[]
[]
[]
[]
[]
[]
[]
[]
{"$rows_left_out":483}
{"sheet":"Reconciliation","index":3,"n_rows":62,"n_cols":9,"rows_kept":62,"cut":false,"hidden":false,"merged":[]}
["Credential/Service Modality","Unit Type","Total Units",null,"DMC Billable",null,"OHC",null,"County Billable"]
[{"$f":"_xlfn.UNIQUE(Sheet6!A:A)","v":0},{"$f":"IFERROR((VLOOKUP(A2,'Program Invoicing'!P:R,3,0)),\" \")","v":" "},{"$f":"IFERROR((IF(A2=0,0,SUMIF('Program Invoicing'!$P$2:$Q$297,A2,'Program Invoicing'!$Q$2:$Q$297))),0)","v":0},{"$f":"A2&\"-\"&\"Medi-Cal DMC\"","v":"0-Medi-Cal DMC"},{"$f":"SUMIF('Provider Charges'!$R$2:$S$501,D2,'Provider Charges'!$S$2:$S$501)","v":0},{"$f":"A2&\"-\"&\"OHC\"","v":"0-OHC"},{"$f":"SUMIF('Provider Charges'!$R$2:$S$501,F2,'Provider Charges'!$S$2:$S$501)","v":0},{"$f":"A2&\"-\"&\"County Billable SUD\"","v":"0-County Billable SUD"},{"$f":"IF(C2>0,C2-E2-G2,SUMIF('Provider Charges'!$R$1:$S$501,H2,'Provider Charges'!$S$1:$S$501))","v":0}]
["-0",{"$f":"IFERROR((VLOOKUP(A3,'Program Invoicing'!P:R,3,0)),\" \")","v":0},{"$f":"IFERROR((IF(A3=0,0,SUMIF('Program Invoicing'!$P$2:$Q$297,A3,'Program Invoicing'!$Q$2:$Q$297))),0)","v":0},{"$f":"A3&\"-\"&\"Medi-Cal DMC\"","v":"-0-Medi-Cal DMC"},{"$f":"SUMIF('Provider Charges'!$R$2:$S$501,D3,'Provider Charges'!$S$2:$S$501)","v":0},{"$f":"A3&\"-\"&\"OHC\"","v":"-0-OHC"},{"$f":"SUMIF('Provider Charges'!$R$2:$S$501,F3,'Provider Charges'!$S$2:$S$501)","v":0},{"$f":"A3&\"-\"&\"County Billable SUD\"","v":"-0-County Billable SUD"},{"$f":"IF(C3>0,C3-E3-G3,SUMIF('Provider Charges'!$R$1:$S$501,H3,'Provider Charges'!$S$1:$S$501))","v":0}]
[0,{"$f":"IFERROR((VLOOKUP(A4,'Program Invoicing'!P:R,3,0)),\" \")","v":" "},{"$f":"IFERROR((IF(A4=0,0,SUMIF('Program Invoicing'!$P$2:$Q$297,A4,'Program Invoicing'!$Q$2:$Q$297))),0)","v":0},"0-Medi-Cal DMC",{"$f":"SUMIF('Provider Charges'!$R$2:$S$501,D4,'Provider Charges'!$S$2:$S$501)","v":0},"0-OHC",{"$f":"SUMIF('Provider Charges'!$R$2:$S$501,F4,'Provider Charges'!$S$2:$S$501)","v":0},"0-County Billable SUD",{"$f":"IF(C4>0,C4-E4-G4,SUMIF('Provider Charges'!$R$1:$S$501,H4,'Provider Charges'!$S$1:$S$501))","v":0}]
[{"$error":"#N/A"},{"$f":"IFERROR((VLOOKUP(A5,'Program Invoicing'!P:R,3,0)),\" \")","v":" "},{"$f":"IFERROR((IF(A5=0,0,SUMIF('Program Invoicing'!$P$2:$Q$297,A5,'Program Invoicing'!$Q$2:$Q$297))),0)","v":0},{"$error":"#N/A"},{"$f":"SUMIF('Provider Charges'!$R$2:$S$501,D5,'Provider Charges'!$S$2:$S$501)","v":0},{"$error":"#N/A"},{"$f":"SUMIF('Provider Charges'!$R$2:$S$501,F5,'Provider Charges'!$S$2:$S$501)","v":0},{"$error":"#N/A"},{"$f":"IF(C5>0,C5-E5-G5,SUMIF('Provider Charges'!$R$1:$S$501,H5,'Provider Charges'!$S$1:$S$501))","v":0}]
[null,{"$f":"IFERROR((VLOOKUP(A6,'Program Invoicing'!P:R,3,0)),\" \")","v":" "},{"$f":"IFERROR((IF(A6=0,0,SUMIF('Program Invoicing'!$P$2:$Q$297,A6,'Program Invoicing'!$Q$2:$Q$297))),0)","v":0},"-Medi-Cal DMC",{"$f":"SUMIF('Provider Charges'!$R$2:$S$501,D6,'Provider Charges'!$S$2:$S$501)","v":0},"-OHC",{"$f":"SUMIF('Provider Charges'!$R$2:$S$501,F6,'Provider Charges'!$S$2:$S$501)","v":0},"-County Billable SUD",{"$f":"IF(C6>0,C6-E6-G6,SUMIF('Provider Charges'!$R$1:$S$501,H6,'Provider Charges'!$S$1:$S$501))","v":0}]
[null,{"$f":"IFERROR((VLOOKUP(A7,'Program Invoicing'!P:R,3,0)),\" \")","v":" "},{"$f":"IFERROR((IF(A7=0,0,SUMIF('Program Invoicing'!$P$2:$Q$297,A7,'Program Invoicing'!$Q$2:$Q$297))),0)","v":0},"-Medi-Cal DMC",{"$f":"SUMIF('Provider Charges'!$R$2:$S$501,D7,'Provider Charges'!$S$2:$S$501)","v":0},"-OHC",{"$f":"SUMIF('Provider Charges'!$R$2:$S$501,F7,'Provider Charges'!$S$2:$S$501)","v":0},"-County Billable SUD",{"$f":"IF(C7>0,C7-E7-G7,SUMIF('Provider Charges'!$R$1:$S$501,H7,'Provider Charges'!$S$1:$S$501))","v":0}]
[null,{"$f":"IFERROR((VLOOKUP(A8,'Program Invoicing'!P:R,3,0)),\" \")","v":" "},{"$f":"IFERROR((IF(A8=0,0,SUMIF('Program Invoicing'!$P$2:$Q$297,A8,'Program Invoicing'!$Q$2:$Q$297))),0)","v":0},"-Medi-Cal DMC",{"$f":"SUMIF('Provider Charges'!$R$2:$S$501,D8,'Provider Charges'!$S$2:$S$501)","v":0},"-OHC",{"$f":"SUMIF('Provider Charges'!$R$2:$S$501,F8,'Provider Charges'!$S$2:$S$501)","v":0},"-County Billable SUD",{"$f":"IF(C8>0,C8-E8-G8,SUMIF('Provider Charges'!$R$1:$S$501,H8,'Provider Charges'!$S$1:$S$501))","v":0}]
[null,{"$f":"IFERROR((VLOOKUP(A9,'Program Invoicing'!P:R,3,0)),\" \")","v":" "},{"$f":"IFERROR((IF(A9=0,0,SUMIF('Program Invoicing'!$P$2:$Q$297,A9,'Program Invoicing'!$Q$2:$Q$297))),0)","v":0},"-Medi-Cal DMC",{"$f":"SUMIF('Provider Charges'!$R$2:$S$501,D9,'Provider Charges'!$S$2:$S$501)","v":0},"-OHC",{"$f":"SUMIF('Provider Charges'!$R$2:$S$501,F9,'Provider Charges'!$S$2:$S$501)","v":0},"-County Billable SUD",{"$f":"IF(C9>0,C9-E9-G9,SUMIF('Provider Charges'!$R$1:$S$501,H9,'Provider Charges'!$S$1:$S$501))","v":0}]
[null,{"$f":"IFERROR((VLOOKUP(A10,'Program Invoicing'!P:R,3,0)),\" \")","v":" "},{"$f":"IFERROR((IF(A10=0,0,SUMIF('Program Invoicing'!$P$2:$Q$297,A10,'Program Invoicing'!$Q$2:$Q$297))),0)","v":0},{"$f":"A10&\"-\"&\"Medi-Cal DMC\"","v":"-Medi-Cal DMC"},{"$f":"SUMIF('Provider Charges'!$R$2:$S$501,D10,'Provider Charges'!$S$2:$S$501)","v":0},"-OHC",{"$f":"SUMIF('Provider Charges'!$R$2:$S$501,F10,'Provider Charges'!$S$2:$S$501)","v":0},"-County Billable SUD",{"$f":"IF(C10>0,C10-E10-G10,SUMIF('Provider Charges'!$R$1:$S$501,H10,'Provider Charges'!$S$1:$S$501))","v":0}]
[null,{"$f":"IFERROR((VLOOKUP(A11,'Program Invoicing'!P:R,3,0)),\" \")","v":" "},{"$f":"IFERROR((IF(A11=0,0,SUMIF('Program Invoicing'!$P$2:$Q$297,A11,'Program Invoicing'!$Q$2:$Q$297))),0)","v":0},"-Medi-Cal DMC",{"$f":"SUMIF('Provider Charges'!$R$2:$S$501,D11,'Provider Charges'!$S$2:$S$501)","v":0},"-OHC",{"$f":"SUMIF('Provider Charges'!$R$2:$S$501,F11,'Provider Charges'!$S$2:$S$501)","v":0},"-County Billable SUD",{"$f":"IF(C11>0,C11-E11-G11,SUMIF('Provider Charges'!$R$1:$S$501,H11,'Provider Charges'!$S$1:$S$501))","v":0}]
[null,{"$f":"IFERROR((VLOOKUP(A12,'Program Invoicing'!P:R,3,0)),\" \")","v":" "},{"$f":"IFERROR((IF(A12=0,0,SUMIF('Program Invoicing'!$P$2:$Q$297,A12,'Program Invoicing'!$Q$2:$Q$297))),0)","v":0},{"$f":"A12&\"-\"&\"Medi-Cal DMC\"","v":"-Medi-Cal DMC"},{"$f":"SUMIF('Provider Charges'!$R$2:$S$501,D12,'Provider Charges'!$S$2:$S$501)","v":0},"-OHC",{"$f":"SUMIF('Provider Charges'!$R$2:$S$501,F12,'Provider Charges'!$S$2:$S$501)","v":0},"-County Billable SUD",{"$f":"IF(C12>0,C12-E12-G12,SUMIF('Provider Charges'!$R$1:$S$501,H12,'Provider Charges'!$S$1:$S$501))","v":0}]
[null,{"$f":"IFERROR((VLOOKUP(A13,'Program Invoicing'!P:R,3,0)),\" \")","v":" "},{"$f":"IFERROR((IF(A13=0,0,SUMIF('Program Invoicing'!$P$2:$Q$297,A13,'Program Invoicing'!$Q$2:$Q$297))),0)","v":0},"-Medi-Cal DMC",{"$f":"SUMIF('Provider Charges'!$R$2:$S$501,D13,'Provider Charges'!$S$2:$S$501)","v":0},"-OHC",{"$f":"SUMIF('Provider Charges'!$R$2:$S$501,F13,'Provider Charges'!$S$2:$S$501)","v":0},"-County Billable SUD",{"$f":"IF(C13>0,C13-E13-G13,SUMIF('Provider Charges'!$R$1:$S$501,H13,'Provider Charges'!$S$1:$S$501))","v":0}]
[null,{"$f":"IFERROR((VLOOKUP(A14,'Program Invoicing'!P:R,3,0)),\" \")","v":" "},{"$f":"IFERROR((IF(A14=0,0,SUMIF('Program Invoicing'!$P$2:$Q$297,A14,'Program Invoicing'!$Q$2:$Q$297))),0)","v":0},"-Medi-Cal DMC",{"$f":"SUMIF('Provider Charges'!$R$2:$S$501,D14,'Provider Charges'!$S$2:$S$501)","v":0},"-OHC",{"$f":"SUMIF('Provider Charges'!$R$2:$S$501,F14,'Provider Charges'!$S$2:$S$501)","v":0},"-County Billable SUD",{"$f":"IF(C14>0,C14-E14-G14,SUMIF('Provider Charges'!$R$1:$S$501,H14,'Provider Charges'!$S$1:$S$501))","v":0}]
[null,{"$f":"IFERROR((VLOOKUP(A15,'Program Invoicing'!P:R,3,0)),\" \")","v":" "},{"$f":"IFERROR((IF(A15=0,0,SUMIF('Program Invoicing'!$P$2:$Q$297,A15,'Program Invoicing'!$Q$2:$Q$297))),0)","v":0},"-Medi-Cal DMC",{"$f":"SUMIF('Provider Charges'!$R$2:$S$501,D15,'Provider Charges'!$S$2:$S$501)","v":0},"-OHC",{"$f":"SUMIF('Provider Charges'!$R$2:$S$501,F15,'Provider Charges'!$S$2:$S$501)","v":0},"-County Billable SUD",{"$f":"IF(C15>0,C15-E15-G15,SUMIF('Provider Charges'!$R$1:$S$501,H15,'Provider Charges'!$S$1:$S$501))","v":0}]
[null,{"$f":"IFERROR((VLOOKUP(A16,'Program Invoicing'!P:R,3,0)),\" \")","v":" "},{"$f":"IFERROR((IF(A16=0,0,SUMIF('Program Invoicing'!$P$2:$Q$297,A16,'Program Invoicing'!$Q$2:$Q$297))),0)","v":0},"-Medi-Cal DMC",{"$f":"SUMIF('Provider Charges'!$R$2:$S$501,D16,'Provider Charges'!$S$2:$S$501)","v":0},"-OHC",{"$f":"SUMIF('Provider Charges'!$R$2:$S$501,F16,'Provider Charges'!$S$2:$S$501)","v":0},"-County Billable SUD",{"$f":"IF(C16>0,C16-E16-G16,SUMIF('Provider Charges'!$R$1:$S$501,H16,'Provider Charges'!$S$1:$S$501))","v":0}]
[null,{"$f":"IFERROR((VLOOKUP(A17,'Program Invoicing'!P:R,3,0)),\" \")","v":" "},{"$f":"IFERROR((IF(A17=0,0,SUMIF('Program Invoicing'!$P$2:$Q$297,A17,'Program Invoicing'!$Q$2:$Q$297))),0)","v":0},"-Medi-Cal DMC",{"$f":"SUMIF('Provider Charges'!$R$2:$S$501,D17,'Provider Charges'!$S$2:$S$501)","v":0},"-OHC",{"$f":"SUMIF('Provider Charges'!$R$2:$S$501,F17,'Provider Charges'!$S$2:$S$501)","v":0},"-County Billable SUD",{"$f":"IF(C17>0,C17-E17-G17,SUMIF('Provider Charges'!$R$1:$S$501,H17,'Provider Charges'!$S$1:$S$501))","v":0}]
[null,{"$f":"IFERROR((VLOOKUP(A18,'Program Invoicing'!P:R,3,0)),\" \")","v":" "},{"$f":"IFERROR((IF(A18=0,0,SUMIF('Program Invoicing'!$P$2:$Q$297,A18,'Program Invoicing'!$Q$2:$Q$297))),0)","v":0},"-Medi-Cal DMC",{"$f":"SUMIF('Provider Charges'!$R$2:$S$501,D18,'Provider Charges'!$S$2:$S$501)","v":0},"-OHC",{"$f":"SUMIF('Provider Charges'!$R$2:$S$501,F18,'Provider Charges'!$S$2:$S$501)","v":0},"-County Billable SUD",{"$f":"IF(C18>0,C18-E18-G18,SUMIF('Provider Charges'!$R$1:$S$501,H18,'Provider Charges'!$S$1:$S$501))","v":0}]
[null,{"$f":"IFERROR((VLOOKUP(A19,'Program Invoicing'!P:R,3,0)),\" \")","v":" "},{"$f":"IFERROR((IF(A19=0,0,SUMIF('Program Invoicing'!$P$2:$Q$297,A19,'Program Invoicing'!$Q$2:$Q$297))),0)","v":0},"-Medi-Cal DMC",{"$f":"SUMIF('Provider Charges'!$R$2:$S$501,D19,'Provider Charges'!$S$2:$S$501)","v":0},"-OHC",{"$f":"SUMIF('Provider Charges'!$R$2:$S$501,F19,'Provider Charges'!$S$2:$S$501)","v":0},"-County Billable SUD",{"$f":"IF(C19>0,C19-E19-G19,SUMIF('Provider Charges'!$R$1:$S$501,H19,'Provider Charges'!$S$1:$S$501))","v":0}]
[null,{"$f":"IFERROR((VLOOKUP(A20,'Program Invoicing'!P:R,3,0)),\" \")","v":" "},{"$f":"IFERROR((IF(A20=0,0,SUMIF('Program Invoicing'!$P$2:$Q$297,A20,'Program Invoicing'!$Q$2:$Q$297))),0)","v":0},"-Medi-Cal DMC",{"$f":"SUMIF('Provider Charges'!$R$2:$S$501,D20,'Provider Charges'!$S$2:$S$501)","v":0},"-OHC",{"$f":"SUMIF('Provider Charges'!$R$2:$S$501,F20,'Provider Charges'!$S$2:$S$501)","v":0},"-County Billable SUD",{"$f":"IF(C20>0,C20-E20-G20,SUMIF('Provider Charges'!$R$1:$S$501,H20,'Provider Charges'!$S$1:$S$501))","v":0}]
{"$rows_left_out":43}
{"sheet":"Sheet6","index":4,"n_rows":696,"n_cols":1,"rows_kept":696,"cut":false,"hidden":true,"merged":[]}
[]
[{"$f":"_xlfn.VSTACK('Program Invoicing'!P2:P397,'Provider Charges'!Q2:Q300)","v":"-0"}]
[0]
[0]
[0]
[0]
[0]
[0]
[0]
[0]
[0]
[0]
[0]
[0]
[0]
[0]
[0]
[0]
[0]
[0]
{"$rows_left_out":677}
{"sheet":"Sheet4","index":5,"n_rows":52,"n_cols":7,"rows_kept":52,"cut":false,"hidden":true,"merged":[]}
[null,"Program Name","Bed Day",null,null,"Program Name"]
[null,"MITE New Connections 3.1",3.1,null,null,"MITE 3.1 New Connections",3.1]
[null,"SD Freedom Ranch Inc 3.1",3.1,null,null,"Freedom Ranch 3.1",3.1]
[null,"The Fellowship Center 3.1",3.1,null,null,"The Fellowship Ctr 3.1",3.1]
[null,"Alpha Project Casa Raphael 3.1",3.1,null,null,"Alpha Proj 3.1 Casa Raphael",3.1]
[null,"Interfaith Escondido Community Sobering 3.1",3.1,null,null,"Interfaith 3.1 Comm Sober ESC",3.1]
[null,"CRASH Golden Hill House 3.1",3.1,null,null,"CRASH 3.1 Golden Hill Hse",3.1]
[null,"CRASH Golden Hill House II 3.1",3.1,null,null,"CRASH 3.1 Golden Hill Hse II",3.1]
[null,"CRASH Short Term I 3.1",3.1,null,null,"CRASH 3.1 Short Term I",3.1]
[null,"Crossroads 3.1",3.1,null,null,"Crossroads 3.1",3.1]
[null,"MAAC Project Casa de Milagros 3.1",3.1,null,null,"MAAC 3.1 Casa de Milagros",3.1]
[null,"MAAC Project Nosotros 3.1",3.1,null,null,"MAAC 3.1 Nosotros",3.1]
[null,"Pathfinders Cedar House 3.1",3.1,null,null,"Pathfinders 3.1 Cedar Hse",3.1]
[null,"Pathfinders Dale House 3.1",3.1,null,null,"Pathfinders 3.1 Dale Hse",3.1]
[null,"Stepping Stone SD Residential 3.1",3.1,null,null,"Stepping Stone 3.1 SD",3.1]
[null,"The Way Back 3.1",3.1,null,null,"The Way Back 3.1",3.1]
[null,"Tradition One 3.1",3.1,null,null,"Tradition One 3.1",3.1]
[null,"Turning Point Home 3.1",3.1,null,null,"Turning Pt Home 3.1",3.1]
[null,"HealthRIGHT 360 Serenity Center 3.1",3.1,null,null,"HealthRight 360 3.1 Serenity Ctr",3.1]
[null,"MITE Kiva Perinatal Residential 3.1",3.1,null,null,"MITE 3.1 Kiva Peri",3.1]
{"$rows_left_out":33}
{"sheet":"Data Validation","index":6,"n_rows":324,"n_cols":19,"rows_kept":324,"cut":false,"hidden":true,"merged":[]}
["Credential/Degree Name/Modality (From Smartcare)","Credential (From Invoice Template)",null,"DegreeName (From Smartcare)","Credential (From Invoice Template)",null,"Program Name","Bed Day/AWM",null,"Program Name","Bed Day",null,"Plan","Plan Name",null,"Program Name","CalOMSProviderId",null,"Program Name"]
[" PT Psychiatric Technician","Licensed Psychiatric Technician",null,"Admin Use Only - Bed Days","Bed Days",null,"MITE New Connections 3.1",3.1,null,"MITE 3.1 New Connections",3.1,null,"Medi-Cal MH","Medi-Cal MH",null,"Alpha Project Casa Raphael 3.1",373769,null,"Alpha Proj 3.1 Casa Raphael"]
[" Certified Peer Specialist, MHRS Mental Health Rehabilitation Specialist","Peer Support Specialist",null,"Admin Use Only - Bed Days, LVN Licensed Vocational Nurse, NPI","Bed Days",null,"SD Freedom Ranch Inc 3.1",3.1,null,"Freedom Ranch 3.1",3.1,null,"Community Health Group","OHC",null,"Alpha Project Casa Raphael 3.5",373769,null,"Alpha Proj 3.5 Casa Raphael"]
[" NP Nurse Practitioner Clinical Trainee","Nurse Practitioner",null,"Admin Use Only - Bed Days, MD Medical Doctor, NPI","Bed Days",null,"The Fellowship Center 3.1",3.1,null,"The Fellowship Ctr 3.1",3.1,null,"Molina Healthcare","OHC",null,"CRASH Short Term I 3.1",378766,null,"CRASH 3.1 Short Term I"]
["Therapeutic Foster Care","Therapeutic Foster Care",null,"Admin Use Only - Bed Days, MHRS Mental Health Rehabilitation Specialist, NPI","Bed Days",null,"Alpha Project Casa Raphael 3.1",3.1,null,"Alpha Proj 3.1 Casa Raphael",3.1,null,"MCP - Community Health Group","OHC",null,"CRASH Golden Hill House II 3.1",373791,null,"CRASH 3.1 Golden Hill Hse II"]
["Crisis Residential Day","Crisis Residential Day",null,"Admin Use Only - Bed Days, NPI","Bed Days",null,"Interfaith Escondido Community Sobering 3.1",3.1,null,"Interfaith 3.1 Comm Sober ESC",3.1,null,"Blue Cross","OHC",null,"CRASH Golden Hill House 3.1",378764,null,"CRASH 3.1 Golden Hill Hse"]
[" Master's Degree LPHA Clinical Trainee, Registered AOD Counselor","LPHA (MFT  LCSW  LPCC)/Intern or\nWaivered LPHA (MFT  LCSW  LPCC)",null,"Admin Use Only - Bed Days, NPI, Other Qualified Provider","Bed Days",null,"CRASH Golden Hill House 3.1",3.1,null,"CRASH 3.1 Golden Hill Hse",3.1,null,"Health Net","OHC",null,"Crossroads 3.1",370001,null,"Crossroads 3.1"]
[" AMFT Associate Marriage and Family Therapist","LPHA (MFT  LCSW  LPCC)/Intern or\nWaivered LPHA (MFT  LCSW  LPCC)",null,"AMFT Associate Marriage and Family Therapist","LPHA (MFT  LCSW  LPCC)/Intern or\nWaivered LPHA (MFT  LCSW  LPCC)",null,"CRASH Golden Hill House II 3.1",3.1,null,"CRASH 3.1 Golden Hill Hse II",3.1,null,"Aetna","OHC",null,"Crossroads 3.5",370001,null,"Crossroads 3.5"]
["Residential Treatment -Substance Use","Bed Days",null,"AMFT Associate Marriage and Family Therapist, NPI","LPHA (MFT  LCSW  LPCC)/Intern or\nWaivered LPHA (MFT  LCSW  LPCC)",null,"CRASH Short Term I 3.1",3.1,null,"CRASH 3.1 Short Term I",3.1,null,"Imperial Health Holdings Grp","OHC",null,"HealthRIGHT 360 Serenity Center 3.1",378650,null,"HealthRight 360 3.1 Serenity Ctr"]
[" Certified AOD Counselor","Alcohol and Drug Counselor",null,"APCC Associate Professional Clinical Counselor","LPHA (MFT  LCSW  LPCC)/Intern or\nWaivered LPHA (MFT  LCSW  LPCC)",null,"Crossroads 3.1",3.1,null,"Crossroads 3.1",3.1,null,"MCP - No plan","OHC",null,"HealthRIGHT 360 Serenity Center 3.5",378650,null,"HealthRight 360 3.5 Serenity Ctr"]
[" Psych Associate/RPS","Psychologist/Pre-licensed Psychologist",null,"APCC Associate Professional Clinical Counselor, NPI","LPHA (MFT  LCSW  LPCC)/Intern or\nWaivered LPHA (MFT  LCSW  LPCC)",null,"MAAC Project Casa de Milagros 3.1",3.1,null,"MAAC 3.1 Casa de Milagros",3.1,null,"MEDICARE PART  A & B","OHC",null,"HealthRIGHT 360 Serenity Center 3.2 WM",378650,null,"HealthRight 360 3.2 WM Serenity Ctr"]
[" Certified Peer Specialist","Peer Support Specialist",null,"ASW Associate Social Worker","LPHA (MFT  LCSW  LPCC)/Intern or\nWaivered LPHA (MFT  LCSW  LPCC)",null,"MAAC Project Nosotros 3.1",3.1,null,"MAAC 3.1 Nosotros",3.1,null,"MEDICARE PART A","OHC",null,"House of Metamorphosis 3.1",378756,null,"HOM 3.1"]
[" Certified AOD Counselor, Registered AOD Counselor","Alcohol and Drug Counselor",null,"ASW Associate Social Worker, NPI","LPHA (MFT  LCSW  LPCC)/Intern or\nWaivered LPHA (MFT  LCSW  LPCC)",null,"Pathfinders Cedar House 3.1",3.1,null,"Pathfinders 3.1 Cedar Hse",3.1,null,"Mercy Physicians Med Grp","OHC",null,"MAAC Project Casa de Milagros 3.1",370050,null,"MAAC 3.1 Casa de Milagros"]
[" MD Medical Doctor","Psychiatrist/ Contracted Psychiatrist/Licensed Physician (MD)",null,"Certified AOD Counselor","Alcohol and Drug Counselor",null,"Pathfinders Dale House 3.1",3.1,null,"Pathfinders 3.1 Dale Hse",3.1,null,"Scripps Health Plan Services","OHC",null,"MAAC Project Nosotros 3.1",370051,null,"MAAC 3.1 Nosotros"]
[" Master's Degree LPHA Clinical Trainee, MHRS Mental Health Rehabilitation Specialist","LPHA (MFT  LCSW  LPCC)/Intern or\nWaivered LPHA (MFT  LCSW  LPCC)",null,"Certified AOD Counselor, LCSW Licensed Clinical Social Worker, NPI","Alcohol and Drug Counselor",null,"Stepping Stone SD Residential 3.1",3.1,null,"Stepping Stone 3.1 SD",3.1,null,"United Health Care","OHC",null,"MAAC Project Nosotros 3.5",370051,null,"MAAC 3.5 Nosotros"]
[" Certified Peer Specialist, Registered AOD Counselor","Alcohol and Drug Counselor",null,"Certified AOD Counselor, NPI","Alcohol and Drug Counselor",null,"The Way Back 3.1",3.1,null,"The Way Back 3.1",3.1,null,"Blue Shield","OHC",null,"TURN Family Recovery Center 3.1",373773,null,"TURN 3.1 FRC"]
["Day Treatment Intensive - Half Day","Day Treatment Intensive - Half Day",null,"Certified AOD Counselor, NPI, Registered AOD Counselor","Alcohol and Drug Counselor",null,"Tradition One 3.1",3.1,null,"Tradition One 3.1",3.1,null,"Cigna Healthcare","OHC",null,"TURN Family Recovery Center 3.5",373773,null,"TURN 3.5 FRC"]
[" MHRS Mental Health Rehabilitation Specialist","Mental Health Rehabilitation Specialist",null,"Certified Peer Specialist","Peer Support Specialist",null,"Turning Point Home 3.1",3.1,null,"Turning Pt Home 3.1",3.1,null,"Kaiser Permanente","OHC",null,"TURN Family Recovery Center 3.2 WM",373773,null,"TURN 3.2 WM FRC"]
[" AMFT Associate Marriage and Family Therapist, MHRS Mental Health Rehabilitation Specialist","LPHA (MFT  LCSW  LPCC)/Intern or\nWaivered LPHA (MFT  LCSW  LPCC)",null,"Certified Peer Specialist, NPI","Peer Support Specialist",null,"HealthRIGHT 360 Serenity Center 3.1",3.1,null,"HealthRight 360 3.1 Serenity Ctr",3.1,null,"MOLINA CAL MEDICONNECT","OHC",null,"MITE Adolescent Group Home East 3.1",373785]
[" ASW Associate Social Worker, LCSW Licensed Clinical Social Worker","LPHA (MFT  LCSW  LPCC)/Intern or\nWaivered LPHA (MFT  LCSW  LPCC)",null,"DEA",null,null,"MITE Kiva Perinatal Residential 3.1",3.1,null,"MITE 3.1 Kiva Peri",3.1,null,"Molina Medicare Advantage","OHC",null,"MITE Adolescent Group Home South 3.1",373787]
{"$rows_left_out":304}