{"text_format":"1","workbook":"xlsx","n_sheets":7,"sheets":["Instructions","Smartcare Report","PivotTable","Summary","Copied Data","Linked Data","Non Billable"],"not_rendered":{"charts":0,"images":0,"macros":1,"external_links":0,"defined_names":6,"comments":0,"pivot_tables":0},"unopened":[],"bounds":{"document_bytes":16777216,"sheet_cells":100000,"rows_first":2000,"rows_last":500,"rows_between":2000,"halvings":0,"cell_chars":16384,"cell_head_chars":4096},"cells_cut":0,"cells_raw":0,"read":"whole","date_system":"1900"}

{"sheet":"Instructions","index":0,"n_rows":17,"n_cols":2,"rows_kept":17,"cut":false,"hidden":false,"merged":[]}
["Instruction To Generate the Summary of CoSD Program Invoicing Report"]
[]
["1.","Download the CoSD Program Invoicing Report as CSV file. Make sure to select services with Show and Completed status only."]
["2.","In the CoSD Program Invoicing Report, delete the first 3 rows and copy the data from column A - V"]
["3.","Paste the data as value in the Smartcare Report tab of the Service Time Generator Template."]
["4.","Click the Generate Summary button which can be found in column AQ of the Smartcare Report tab."]
["5.","To generate a new summary for another report, click the Clear Data button in column H-K of the Summary tab."]
["6.","Follow steps 1-4."]
[]
["Since the template is too big to attach in an e-mail. Please make sure to compress the template before sending it via e-mail."]
[]
["How to Compress an Excel File"]
["1.","Locate the Excel file. Go to the folder where the Service Time Generator - Program Invoicing Template is saved."]
["2.","Right-click the file."]
["3.","Select Compress to.."]
["4.","In the selection, click Zip file."]
["5.","You'll see a new ZIP file (e.g., your_excel_file_name.zip) in your file browser, indicating that the compression was successful."]

{"sheet":"Smartcare Report","index":1,"n_rows":2,"n_cols":42,"rows_kept":2,"cut":false,"hidden":false,"merged":[]}
[null,null,null,null,null,null,null,null,null,null,null,null,null,null,null,null,null,null,null,null,null,null,null,"Non Billable (Y/N)","Service Units (Converted)","Individual/Group","Credential","Billable/Non Billable","Service Units (Invoiced)","Crisis Stabilization Hours","Overstay Hours","Unit Type",null,"Units Formula","Credential Formula","Unit Type Formula","Service Units","Unit Type (Converted)",null,"CSU Formula"]
[null,null,null,null,null,null,null,null,null,null,null,null,null,null,null,null,null,null,null,null,null,null,null,{"$f":"IFERROR((VLOOKUP(I2,'Non Billable'!A:B,2,0)),\"N\")","v":"N"},{"$f":"IFERROR((_xlfn.IFS(AND(AND(AL2=\"MINUTES\",AK2>=8),X2=\"N\"),AK2,AND(I2=\"Residential Treatment -Substance Use\",F2=\"BedDay, System\"),AK2,AND(F2=\"BedDay, System\",I2=\"Crisis Residential Day\"),AK2,I2=\"Crisis Stabilization - Emergency Room Services\",AK2,I2=\"Crisis Stabilization - Extended Hours\",AK2,I2=\"Therapeutic Foster Care\",AK2,AND(I2=\"Day Treatment Intensive - Half Day\",AM2<4),1,AND(I2=\"Day Treatment Intensive - Full Day\",AM2>=4),1)),0)","v":0},{"$f":"IFERROR((VLOOKUP(I2,'Non Billable'!D:E,2,0)),\"Individual\")","v":"Individual"},{"$f":"IFERROR((_xlfn.IFS(F2=\"BedDay, System\",I2,I2=\"Crisis Stabilization - Emergency Room Services\",\"Crisis Stabilization\",I2=\"Crisis Stabilization - Extended Hours\",\"Overstay\",I2=\"Therapeutic Foster Care\",\"Therapeutic Foster Care\",I2=\"Day Treatment Intensive - Full Day\",I2,I2=\"Day Treatment Intensive - Half Day\",I2)),G2)","v":0},{"$f":"IF(X2=\"N\",\"Billable\",\"Non-Billable\")","v":"Billable"},{"$f":"Y2*1","v":0},{"$f":"IFERROR((_xlfn.IFS(AND(I2=\"Crisis Stabilization - Emergency Room Services\",AC2<=23),AC2,I2=\"Crisis Stabilization - Extended Hours\",0,AND(I2=\"Crisis Stabilization - Emergency Room Services\",AC2>23),23)),AC2)","v":0},{"$f":"IF(AD2>0,AC2-AD2,0)","v":0},{"$f":"IFERROR((_xlfn.IFS(I2=\"Day Treatment Intensive - Half Day\",\"Days\",I2=\"Day Treatment Intensive - Full Day\",\"Days\")),AL2)","v":0},{"$f":"AND(F2=\"BedDay, System\",I2=\"Crisis Residential Day\")","v":false},{"$f":"_xlfn.IFS(AND(AND(AL2=\"MINUTES\",AK2>=8),X2=\"N\"),AK2,AND(I2=\"Residential Treatment -Substance Use\",F2=\"BedDay, System\"),AK2,AND(F2=\"BedDay, System\",I2=\"Crisis Residential Day\"),AK2,I2=\"Crisis Stabilization - Emergency Room Services\",AK2,I2=\"Crisis Stabilization - Extended Hours\",AK2,I2=\"Therapeutic Foster Care\",AK2,AND(I2=\"Day Treatment Intensive - Half Day\",AM2<4),1,AND(I2=\"Day Treatment Intensive - Full Day\",AM2>=4),1)","v":{"$error":"#N/A"}},{"$f":"_xlfn.IFS(F2=\"BedDay, System\",I2,I2=\"Crisis Stabilization - Emergency Room Services\",\"Crisis Stabilization\",I2=\"Crisis Stabilization - Extended Hours\",\"Overstay\",I2=\"Therapeutic Foster Care\",\"Therapeutic Foster Care\",I2=\"Day Treatment Intensive - Full Day\",I2,I2=\"Day Treatment Intensive - Half Day\",I2)","v":{"$error":"#N/A"}},{"$f":"_xlfn.IFS(I2=\"Day Treatment Intensive - Half Day\",\"Days\",I2=\"Day Treatment Intensive - Full Day\",\"Days\")","v":{"$error":"#N/A"}},{"$f":"IFERROR((_xlfn.TEXTSPLIT(O2,\" \")),0)","v":0},null,{"$f":"AK2*1","v":0},{"$f":"AND(I2=\"Crisis Stabilization - Emergency Room Services\",AC2<=23)","v":false},{"$f":"AND(I2=\"Day Treatment Intensive - Full Day\",AK2>=4)","v":false},{"$f":"AND(I2=\"Day Treatment Intensive - Full Day\",AM2>=4)","v":false}]

{"sheet":"PivotTable","index":2,"n_rows":0,"n_cols":0,"rows_kept":0,"cut":false,"hidden":true,"merged":[]}

{"sheet":"Summary","index":3,"n_rows":308,"n_cols":7,"rows_kept":308,"cut":false,"hidden":false,"merged":[[0,0,0,6]]}
["Client Services Report Summary"]
[null,null,"Report Date:",{"$f":"TODAY()","v":"2026-01-23"}]
[]
[]
["Program Name","Credential/Degree Name/Modality","Billable/Non Billable","Unit Type","Crisis Stabilization Hours","Overstay Hours","Total Hours"]
[null,null,null,null,null,null,{"$f":"Table1[[#This Row],[Crisis Stabilization Hours]]+Table1[[#This Row],[Overstay Hours]]","v":0}]
[null,null,null,null,null,null,{"$f":"Table1[[#This Row],[Crisis Stabilization Hours]]+Table1[[#This Row],[Overstay Hours]]","v":0}]
[null,null,null,null,null,null,{"$f":"Table1[[#This Row],[Crisis Stabilization Hours]]+Table1[[#This Row],[Overstay Hours]]","v":0}]
[null,null,null,null,null,null,{"$f":"Table1[[#This Row],[Crisis Stabilization Hours]]+Table1[[#This Row],[Overstay Hours]]","v":0}]
[null,null,null,null,null,null,{"$f":"Table1[[#This Row],[Crisis Stabilization Hours]]+Table1[[#This Row],[Overstay Hours]]","v":0}]
[null,null,null,null,null,null,{"$f":"Table1[[#This Row],[Crisis Stabilization Hours]]+Table1[[#This Row],[Overstay Hours]]","v":0}]
[null,null,null,null,null,null,{"$f":"Table1[[#This Row],[Crisis Stabilization Hours]]+Table1[[#This Row],[Overstay Hours]]","v":0}]
[null,null,null,null,null,null,{"$f":"Table1[[#This Row],[Crisis Stabilization Hours]]+Table1[[#This Row],[Overstay Hours]]","v":0}]
[null,null,null,null,null,null,{"$f":"Table1[[#This Row],[Crisis Stabilization Hours]]+Table1[[#This Row],[Overstay Hours]]","v":0}]
[null,null,null,null,null,null,{"$f":"Table1[[#This Row],[Crisis Stabilization Hours]]+Table1[[#This Row],[Overstay Hours]]","v":0}]
[null,null,null,null,null,null,{"$f":"Table1[[#This Row],[Crisis Stabilization Hours]]+Table1[[#This Row],[Overstay Hours]]","v":0}]
[null,null,null,null,null,null,{"$f":"Table1[[#This Row],[Crisis Stabilization Hours]]+Table1[[#This Row],[Overstay Hours]]","v":0}]
[null,null,null,null,null,null,{"$f":"Table1[[#This Row],[Crisis Stabilization Hours]]+Table1[[#This Row],[Overstay Hours]]","v":0}]
[null,null,null,null,null,null,{"$f":"Table1[[#This Row],[Crisis Stabilization Hours]]+Table1[[#This Row],[Overstay Hours]]","v":0}]
[null,null,null,null,null,null,{"$f":"Table1[[#This Row],[Crisis Stabilization Hours]]+Table1[[#This Row],[Overstay Hours]]","v":0}]
[null,null,null,null,null,null,{"$f":"Table1[[#This Row],[Crisis Stabilization Hours]]+Table1[[#This Row],[Overstay Hours]]","v":0}]
[null,null,null,null,null,null,{"$f":"Table1[[#This Row],[Crisis Stabilization Hours]]+Table1[[#This Row],[Overstay Hours]]","v":0}]
[null,null,null,null,null,null,{"$f":"Table1[[#This Row],[Crisis Stabilization Hours]]+Table1[[#This Row],[Overstay Hours]]","v":0}]
[null,null,null,null,null,null,{"$f":"Table1[[#This Row],[Crisis Stabilization Hours]]+Table1[[#This Row],[Overstay Hours]]","v":0}]
[null,null,null,null,null,null,{"$f":"Table1[[#This Row],[Crisis Stabilization Hours]]+Table1[[#This Row],[Overstay Hours]]","v":0}]
[null,null,null,null,null,null,{"$f":"Table1[[#This Row],[Crisis Stabilization Hours]]+Table1[[#This Row],[Overstay Hours]]","v":0}]
[null,null,null,null,null,null,{"$f":"Table1[[#This Row],[Crisis Stabilization Hours]]+Table1[[#This Row],[Overstay Hours]]","v":0}]
[null,null,null,null,null,null,{"$f":"Table1[[#This Row],[Crisis Stabilization Hours]]+Table1[[#This Row],[Overstay Hours]]","v":0}]
[null,null,null,null,null,null,{"$f":"Table1[[#This Row],[Crisis Stabilization Hours]]+Table1[[#This Row],[Overstay Hours]]","v":0}]
[null,null,null,null,null,null,{"$f":"Table1[[#This Row],[Crisis Stabilization Hours]]+Table1[[#This Row],[Overstay Hours]]","v":0}]
[null,null,null,null,null,null,{"$f":"Table1[[#This Row],[Crisis Stabilization Hours]]+Table1[[#This Row],[Overstay Hours]]","v":0}]
[null,null,null,null,null,null,{"$f":"Table1[[#This Row],[Crisis Stabilization Hours]]+Table1[[#This Row],[Overstay Hours]]","v":0}]
[null,null,null,null,null,null,{"$f":"Table1[[#This Row],[Crisis Stabilization Hours]]+Table1[[#This Row],[Overstay Hours]]","v":0}]
[null,null,null,null,null,null,{"$f":"Table1[[#This Row],[Crisis Stabilization Hours]]+Table1[[#This Row],[Overstay Hours]]","v":0}]
[null,null,null,null,null,null,{"$f":"Table1[[#This Row],[Crisis Stabilization Hours]]+Table1[[#This Row],[Overstay Hours]]","v":0}]
[null,null,null,null,null,null,{"$f":"Table1[[#This Row],[Crisis Stabilization Hours]]+Table1[[#This Row],[Overstay Hours]]","v":0}]
[null,null,null,null,null,null,{"$f":"Table1[[#This Row],[Crisis Stabilization Hours]]+Table1[[#This Row],[Overstay Hours]]","v":0}]
[null,null,null,null,null,null,{"$f":"Table1[[#This Row],[Crisis Stabilization Hours]]+Table1[[#This Row],[Overstay Hours]]","v":0}]
[null,null,null,null,null,null,{"$f":"Table1[[#This Row],[Crisis Stabilization Hours]]+Table1[[#This Row],[Overstay Hours]]","v":0}]
[null,null,null,null,null,null,{"$f":"Table1[[#This Row],[Crisis Stabilization Hours]]+Table1[[#This Row],[Overstay Hours]]","v":0}]
[null,null,null,null,null,null,{"$f":"Table1[[#This Row],[Crisis Stabilization Hours]]+Table1[[#This Row],[Overstay Hours]]","v":0}]
[null,null,null,null,null,null,{"$f":"Table1[[#This Row],[Crisis Stabilization Hours]]+Table1[[#This Row],[Overstay Hours]]","v":0}]
[null,null,null,null,null,null,{"$f":"Table1[[#This Row],[Crisis Stabilization Hours]]+Table1[[#This Row],[Overstay Hours]]","v":0}]
[null,null,null,null,null,null,{"$f":"Table1[[#This Row],[Crisis Stabilization Hours]]+Table1[[#This Row],[Overstay Hours]]","v":0}]
[null,null,null,null,null,null,{"$f":"Table1[[#This Row],[Crisis Stabilization Hours]]+Table1[[#This Row],[Overstay Hours]]","v":0}]
[null,null,null,null,null,null,{"$f":"Table1[[#This Row],[Crisis Stabilization Hours]]+Table1[[#This Row],[Overstay Hours]]","v":0}]
[null,null,null,null,null,null,{"$f":"Table1[[#This Row],[Crisis Stabilization Hours]]+Table1[[#This Row],[Overstay Hours]]","v":0}]
[null,null,null,null,null,null,{"$f":"Table1[[#This Row],[Crisis Stabilization Hours]]+Table1[[#This Row],[Overstay Hours]]","v":0}]
[null,null,null,null,null,null,{"$f":"Table1[[#This Row],[Crisis Stabilization Hours]]+Table1[[#This Row],[Overstay Hours]]","v":0}]
[null,null,null,null,null,null,{"$f":"Table1[[#This Row],[Crisis Stabilization Hours]]+Table1[[#This Row],[Overstay Hours]]","v":0}]
[null,null,null,null,null,null,{"$f":"Table1[[#This Row],[Crisis Stabilization Hours]]+Table1[[#This Row],[Overstay Hours]]","v":0}]
[null,null,null,null,null,null,{"$f":"Table1[[#This Row],[Crisis Stabilization Hours]]+Table1[[#This Row],[Overstay Hours]]","v":0}]
[null,null,null,null,null,null,{"$f":"Table1[[#This Row],[Crisis Stabilization Hours]]+Table1[[#This Row],[Overstay Hours]]","v":0}]
[null,null,null,null,null,null,{"$f":"Table1[[#This Row],[Crisis Stabilization Hours]]+Table1[[#This Row],[Overstay Hours]]","v":0}]
[null,null,null,null,null,null,{"$f":"Table1[[#This Row],[Crisis Stabilization Hours]]+Table1[[#This Row],[Overstay Hours]]","v":0}]
[null,null,null,null,null,null,{"$f":"Table1[[#This Row],[Crisis Stabilization Hours]]+Table1[[#This Row],[Overstay Hours]]","v":0}]
[null,null,null,null,null,null,{"$f":"Table1[[#This Row],[Crisis Stabilization Hours]]+Table1[[#This Row],[Overstay Hours]]","v":0}]
[null,null,null,null,null,null,{"$f":"Table1[[#This Row],[Crisis Stabilization Hours]]+Table1[[#This Row],[Overstay Hours]]","v":0}]
[null,null,null,null,null,null,{"$f":"Table1[[#This Row],[Crisis Stabilization Hours]]+Table1[[#This Row],[Overstay Hours]]","v":0}]
[null,null,null,null,null,null,{"$f":"Table1[[#This Row],[Crisis Stabilization Hours]]+Table1[[#This Row],[Overstay Hours]]","v":0}]
[null,null,null,null,null,null,{"$f":"Table1[[#This Row],[Crisis Stabilization Hours]]+Table1[[#This Row],[Overstay Hours]]","v":0}]
[null,null,null,null,null,null,{"$f":"Table1[[#This Row],[Crisis Stabilization Hours]]+Table1[[#This Row],[Overstay Hours]]","v":0}]
[null,null,null,null,null,null,{"$f":"Table1[[#This Row],[Crisis Stabilization Hours]]+Table1[[#This Row],[Overstay Hours]]","v":0}]
[null,null,null,null,null,null,{"$f":"Table1[[#This Row],[Crisis Stabilization Hours]]+Table1[[#This Row],[Overstay Hours]]","v":0}]
[null,null,null,null,null,null,{"$f":"Table1[[#This Row],[Crisis Stabilization Hours]]+Table1[[#This Row],[Overstay Hours]]","v":0}]
[null,null,null,null,null,null,{"$f":"Table1[[#This Row],[Crisis Stabilization Hours]]+Table1[[#This Row],[Overstay Hours]]","v":0}]
[null,null,null,null,null,null,{"$f":"Table1[[#This Row],[Crisis Stabilization Hours]]+Table1[[#This Row],[Overstay Hours]]","v":0}]
[null,null,null,null,null,null,{"$f":"Table1[[#This Row],[Crisis Stabilization Hours]]+Table1[[#This Row],[Overstay Hours]]","v":0}]
[null,null,null,null,null,null,{"$f":"Table1[[#This Row],[Crisis Stabilization Hours]]+Table1[[#This Row],[Overstay Hours]]","v":0}]
[null,null,null,null,null,null,{"$f":"Table1[[#This Row],[Crisis Stabilization Hours]]+Table1[[#This Row],[Overstay Hours]]","v":0}]
[null,null,null,null,null,null,{"$f":"Table1[[#This Row],[Crisis Stabilization Hours]]+Table1[[#This Row],[Overstay Hours]]","v":0}]
[null,null,null,null,null,null,{"$f":"Table1[[#This Row],[Crisis Stabilization Hours]]+Table1[[#This Row],[Overstay Hours]]","v":0}]
[null,null,null,null,null,null,{"$f":"Table1[[#This Row],[Crisis Stabilization Hours]]+Table1[[#This Row],[Overstay Hours]]","v":0}]
[null,null,null,null,null,null,{"$f":"Table1[[#This Row],[Crisis Stabilization Hours]]+Table1[[#This Row],[Overstay Hours]]","v":0}]
[null,null,null,null,null,null,{"$f":"Table1[[#This Row],[Crisis Stabilization Hours]]+Table1[[#This Row],[Overstay Hours]]","v":0}]
[null,null,null,null,null,null,{"$f":"Table1[[#This Row],[Crisis Stabilization Hours]]+Table1[[#This Row],[Overstay Hours]]","v":0}]
[null,null,null,null,null,null,{"$f":"Table1[[#This Row],[Crisis Stabilization Hours]]+Table1[[#This Row],[Overstay Hours]]","v":0}]
[null,null,null,null,null,null,{"$f":"Table1[[#This Row],[Crisis Stabilization Hours]]+Table1[[#This Row],[Overstay Hours]]","v":0}]
[null,null,null,null,null,null,{"$f":"Table1[[#This Row],[Crisis Stabilization Hours]]+Table1[[#This Row],[Overstay Hours]]","v":0}]
[null,null,null,null,null,null,{"$f":"Table1[[#This Row],[Crisis Stabilization Hours]]+Table1[[#This Row],[Overstay Hours]]","v":0}]
[null,null,null,null,null,null,{"$f":"Table1[[#This Row],[Crisis Stabilization Hours]]+Table1[[#This Row],[Overstay Hours]]","v":0}]
[null,null,null,null,null,null,{"$f":"Table1[[#This Row],[Crisis Stabilization Hours]]+Table1[[#This Row],[Overstay Hours]]","v":0}]
[null,null,null,null,null,null,{"$f":"Table1[[#This Row],[Crisis Stabilization Hours]]+Table1[[#This Row],[Overstay Hours]]","v":0}]
[null,null,null,null,null,null,{"$f":"Table1[[#This Row],[Crisis Stabilization Hours]]+Table1[[#This Row],[Overstay Hours]]","v":0}]
[null,null,null,null,null,null,{"$f":"Table1[[#This Row],[Crisis Stabilization Hours]]+Table1[[#This Row],[Overstay Hours]]","v":0}]
[null,null,null,null,null,null,{"$f":"Table1[[#This Row],[Crisis Stabilization Hours]]+Table1[[#This Row],[Overstay Hours]]","v":0}]
[null,null,null,null,null,null,{"$f":"Table1[[#This Row],[Crisis Stabilization Hours]]+Table1[[#This Row],[Overstay Hours]]","v":0}]
[null,null,null,null,null,null,{"$f":"Table1[[#This Row],[Crisis Stabilization Hours]]+Table1[[#This Row],[Overstay Hours]]","v":0}]
[null,null,null,null,null,null,{"$f":"Table1[[#This Row],[Crisis Stabilization Hours]]+Table1[[#This Row],[Overstay Hours]]","v":0}]
[null,null,null,null,null,null,{"$f":"Table1[[#This Row],[Crisis Stabilization Hours]]+Table1[[#This Row],[Overstay Hours]]","v":0}]
[null,null,null,null,null,null,{"$f":"Table1[[#This Row],[Crisis Stabilization Hours]]+Table1[[#This Row],[Overstay Hours]]","v":0}]
[null,null,null,null,null,null,{"$f":"Table1[[#This Row],[Crisis Stabilization Hours]]+Table1[[#This Row],[Overstay Hours]]","v":0}]
[null,null,null,null,null,null,{"$f":"Table1[[#This Row],[Crisis Stabilization Hours]]+Table1[[#This Row],[Overstay Hours]]","v":0}]
[null,null,null,null,null,null,{"$f":"Table1[[#This Row],[Crisis Stabilization Hours]]+Table1[[#This Row],[Overstay Hours]]","v":0}]
[null,null,null,null,null,null,{"$f":"Table1[[#This Row],[Crisis Stabilization Hours]]+Table1[[#This Row],[Overstay Hours]]","v":0}]
[null,null,null,null,null,null,{"$f":"Table1[[#This Row],[Crisis Stabilization Hours]]+Table1[[#This Row],[Overstay Hours]]","v":0}]
[null,null,null,null,null,null,{"$f":"Table1[[#This Row],[Crisis Stabilization Hours]]+Table1[[#This Row],[Overstay Hours]]","v":0}]
[null,null,null,null,null,null,{"$f":"Table1[[#This Row],[Crisis Stabilization Hours]]+Table1[[#This Row],[Overstay Hours]]","v":0}]
[null,null,null,null,null,null,{"$f":"Table1[[#This Row],[Crisis Stabilization Hours]]+Table1[[#This Row],[Overstay Hours]]","v":0}]
[null,null,null,null,null,null,{"$f":"Table1[[#This Row],[Crisis Stabilization Hours]]+Table1[[#This Row],[Overstay Hours]]","v":0}]
[null,null,null,null,null,null,{"$f":"Table1[[#This Row],[Crisis Stabilization Hours]]+Table1[[#This Row],[Overstay Hours]]","v":0}]
[null,null,null,null,null,null,{"$f":"Table1[[#This Row],[Crisis Stabilization Hours]]+Table1[[#This Row],[Overstay Hours]]","v":0}]
[null,null,null,null,null,null,{"$f":"Table1[[#This Row],[Crisis Stabilization Hours]]+Table1[[#This Row],[Overstay Hours]]","v":0}]
[null,null,null,null,null,null,{"$f":"Table1[[#This Row],[Crisis Stabilization Hours]]+Table1[[#This Row],[Overstay Hours]]","v":0}]
[null,null,null,null,null,null,{"$f":"Table1[[#This Row],[Crisis Stabilization Hours]]+Table1[[#This Row],[Overstay Hours]]","v":0}]
[null,null,null,null,null,null,{"$f":"Table1[[#This Row],[Crisis Stabilization Hours]]+Table1[[#This Row],[Overstay Hours]]","v":0}]
[null,null,null,null,null,null,{"$f":"Table1[[#This Row],[Crisis Stabilization Hours]]+Table1[[#This Row],[Overstay Hours]]","v":0}]
[null,null,null,null,null,null,{"$f":"Table1[[#This Row],[Crisis Stabilization Hours]]+Table1[[#This Row],[Overstay Hours]]","v":0}]
[null,null,null,null,null,null,{"$f":"Table1[[#This Row],[Crisis Stabilization Hours]]+Table1[[#This Row],[Overstay Hours]]","v":0}]
[null,null,null,null,null,null,{"$f":"Table1[[#This Row],[Crisis Stabilization Hours]]+Table1[[#This Row],[Overstay Hours]]","v":0}]
[null,null,null,null,null,null,{"$f":"Table1[[#This Row],[Crisis Stabilization Hours]]+Table1[[#This Row],[Overstay Hours]]","v":0}]
[null,null,null,null,null,null,{"$f":"Table1[[#This Row],[Crisis Stabilization Hours]]+Table1[[#This Row],[Overstay Hours]]","v":0}]
[null,null,null,null,null,null,{"$f":"Table1[[#This Row],[Crisis Stabilization Hours]]+Table1[[#This Row],[Overstay Hours]]","v":0}]
[null,null,null,null,null,null,{"$f":"Table1[[#This Row],[Crisis Stabilization Hours]]+Table1[[#This Row],[Overstay Hours]]","v":0}]
[null,null,null,null,null,null,{"$f":"Table1[[#This Row],[Crisis Stabilization Hours]]+Table1[[#This Row],[Overstay Hours]]","v":0}]
[null,null,null,null,null,null,{"$f":"Table1[[#This Row],[Crisis Stabilization Hours]]+Table1[[#This Row],[Overstay Hours]]","v":0}]
[null,null,null,null,null,null,{"$f":"Table1[[#This Row],[Crisis Stabilization Hours]]+Table1[[#This Row],[Overstay Hours]]","v":0}]
[null,null,null,null,null,null,{"$f":"Table1[[#This Row],[Crisis Stabilization Hours]]+Table1[[#This Row],[Overstay Hours]]","v":0}]
[null,null,null,null,null,null,{"$f":"Table1[[#This Row],[Crisis Stabilization Hours]]+Table1[[#This Row],[Overstay Hours]]","v":0}]
[null,null,null,null,null,null,{"$f":"Table1[[#This Row],[Crisis Stabilization Hours]]+Table1[[#This Row],[Overstay Hours]]","v":0}]
{"$rows_left_out":189}
{"sheet":"Copied Data","index":4,"n_rows":0,"n_cols":0,"rows_kept":0,"cut":false,"hidden":true,"merged":[]}

{"sheet":"Linked Data","index":5,"n_rows":1,"n_cols":32,"rows_kept":1,"cut":false,"hidden":true,"merged":[]}
[{"$f":"_xlfn._xlws.FILTER('Smartcare Report'!A:AF,'Smartcare Report'!AC:AC>0,0)","v":0},0,0,0,0,0,0,0,0,0,0,0,0,0,0,0,0,0,0,0,0,0,0,"Non Billable (Y/N)","Service Units (Converted)","Individual/Group","Credential","Billable/Non Billable","Service Units (Invoiced)","Crisis Stabilization Hours","Overstay Hours","Unit Type"]

{"sheet":"Non Billable","index":6,"n_rows":40,"n_cols":5,"rows_kept":40,"cut":false,"hidden":true,"merged":[]}
["Procedure Name","Non-Billable?",null,"Procedure Name","Individual/Group"]
["Mobile Crisis Dispatch Screening","Y",null,"Care Coordination Outside System of Care Group","Group"]
["Dietician Progress Note","Y",null,"Psychosocial Rehabilitation Group","Group"]
["Dietician Assessment","Y",null,"Group Therapy","Group"]
["Mobile Crisis Follow-Up","Y",null,"Multiple-Family Group Psychotherapy","Group"]
["General Outreach","Y"]
["Targeted Outreach","Y"]
["Quality Improvement Activities","Y"]
["Consults to External Providers (Non-billable)","Y"]
["Transportation","Y"]
["Client Non Billable Srvc Must Document","Y"]
["Psychiatric Procedure (IP/PHF/CSU/Res)","Y"]
["Shift Summary","Y"]
["Non-Billable Bed Procedure","Y"]
["Brief Contact Note","Y"]
["Residential Daily Note","Y"]
["Non-Billable Attempted Contact","Y"]
["Attestation Note","Y"]
["Medical Non-Billable Note","Y"]
["Legal Report Writing Note","Y"]
["CARE Act - Notice Activity","Y"]
["CARE Act - Outreach and Engagement","Y"]
["CARE Act - Court Report Activity","Y"]
["CARE Act - Hearing Time","Y"]
["Prev Prob Identification-AOD","Y"]
["Prev Education-AOD","Y"]
["Prev Community Based-AOD","Y"]
["Prev Info Dissemination-AOD","Y"]
["Prev Environ Strategy-AOD","Y"]
["Prev-Alternatives-AOD","Y"]
["Quality Assurance-AOD","Y"]
["CARE Act - Data Reporting","Y"]
["PEI Outreach","Y"]
["Room and Board","Y"]
["Bed Hold Day","Y"]
["Nurse Progress Note (IP/PHF/CSU/Res)","Y"]
["Brief Emotional/Behavioral Assessment","Y"]
["Care Coordination Outside System of Care","Y"]
["SB 43/SUD Crisis Stabilization","Y"]
["Home Medications Note","Y"]